{"text_format":"1","workbook":"xlsx","n_sheets":18,"sheets":["Compiled_06_2018","Information","Homepage","Summary","Detail","TRENDS","PRACTICE","HEADERTOGGLE","HEADERINFO2","Locations","BLANK","CHART","Sheet2","Sheet3","Sheet4","DATA","Sheet6","Sheet7"],"not_rendered":{"charts":3,"images":5,"macros":1,"external_links":2,"defined_names":26,"comments":0,"pivot_tables":0},"unopened":[],"bounds":{"document_bytes":16777216,"sheet_cells":100000,"rows_first":2000,"rows_last":500,"rows_between":2000,"halvings":0,"cell_chars":16384,"cell_head_chars":4096},"cells_cut":0,"cells_raw":0,"read":"whole","date_system":"1900"}

{"sheet":"Compiled_06_2018","index":0,"n_rows":62,"n_cols":13,"rows_kept":62,"cut":false,"hidden":true,"merged":[]}
["PracName","Locality","NACS","Worksheet","[00-00]","[08-CKD]","NIS08-CKD01","NIS08-CKD01%","NIS08-CKD02","NIS08-CKD02%","NIS08-CKD03","NIS08-CKD03%","NIS08-CKD08"]
[null,null,null,"Seach Code:","[00-00]","[08-CKD]","NIS08-CKD01","NIS08-CKD01%","NIS08-CKD02","NIS08-CKD02%","NIS08-CKD03","NIS08-CKD03%","NIS08-CKD08"]
["2018-06-01",null,null,"Found EMISweb Search:","[00-00] Listsize","[08-CKD] eGFR evidence of CKD","NIS08-CKD01: evidence of CKD coded CKD (QOF v33)",null,"NIS08-CKD02: evidence of CKD with appropriate BP",null,"NIS08-CKD03: evidence of CKD on Statins",null,"NIS08-CKD08: Referrals to community renal clinic"]
[null,null,null,"Relative Run Date:","2018-06-01","2018-06-01","2018-06-01",null,"2018-06-01",null,"2018-06-01",null,"2018-06-01"]
[null,null,null,"Top Left EMISweb Data:","$A$9","$A$45","$A$81",null,"$A$117",null,"$A$153",null,"$A$225"]
["2018-06-01",null,null,"EMISweb Array Start:","$B$9","$B$45","$B$81",null,"$B$117",null,"$B$153",null,"$B$225"]
{"$rows_left_out":57}
{"sheet":"Information","index":1,"n_rows":4,"n_cols":2,"rows_kept":4,"cut":false,"hidden":false,"merged":[]}
[]
[null,"Waltham Forest"]
[]
[null,"CKD Management"]

{"sheet":"Homepage","index":2,"n_rows":29,"n_cols":13,"rows_kept":29,"cut":false,"hidden":false,"merged":[[18,2,19,3],[18,4,19,4],[4,5,4,7],[6,2,7,3],[8,2,9,3],[10,2,11,3],[12,2,13,3],[14,2,15,3],[12,4,13,4],[14,4,15,4],[16,4,17,4],[16,2,17,3],[6,4,7,4],[8,4,9,4],[10,4,11,4]]}
[]
[null,null,"WF CKD MANAGEMENT 2023-2024",null,null,null,"SELECT DATE >>",null,null,"SELECT PRACTICE >>",null,null,"SELECT KPI >>"]
[null,null,null,null,null,null,"01/04/2024",null,null,"Churchill Medical Centre",null,null,"QOF CKD code with ACR recorded"]
[]
[null,null,{"$f":"UPPER(CHART!B1)","v":"QOF CKD CODE WITH ACR RECORDED"},null,null,"PROGRESS TO TARGET",null,null,null,null,null,"MONTHLY ACHIEVEMENT TREND"]
[]
{"$rows_left_out":24}
{"sheet":"Summary","index":3,"n_rows":11,"n_cols":13,"rows_kept":11,"cut":false,"hidden":false,"merged":[]}
[null,"Waltham Forest: CKD - Summary "]
[null,null,null,null,{"$f":"Locations!E21","v":"01/04/2024"},"to change date go to Homepage"]
[]
[null,null,null,"[00-00]","[08-CKD]","NIS08-CKD01","NIS08-CKD01%","NIS08-CKD02","NIS08-CKD02%","NIS08-CKD03","NIS08-CKD03%",null,"NIS08-CKD03%"]
[null,null,null,"Listsize","eGFR evidence of CKD","evidence of CKD coded CKD","% evidence of CKD coded CKD","evidence of CKD with BP below 140/90","% evidence of CKD with BP below 140/90","evidence of CKD on Statins","% evidence of CKD on Statins","QOF CKD code with ACR recorded","% QOF CKD code with ACR recorded"]
[null,"Select a Practice >>","Leyton Healthcare (Oliver Road) **",{"$f":"IF(COUNTIFS(WF_CKD_DATA[[#All],[OrgID]],PRACTICE!$F$11,WF_CKD_DATA[[#All],[Rel_D]],Locations!$E$17)=0,\"-\",(SUMIFS(WF_CKD_DATA[[#All],[00-00]],WF_CKD_DATA[[#All],[OrgID]],PRACTICE!F11,WF_CKD_DATA[[#All],[Rel_D]],Locations!$E$17)))","v":14528},{"$f":"IF(COUNTIFS(WF_CKD_DATA[[#All],[OrgID]],PRACTICE!$F$11,WF_CKD_DATA[[#All],[Rel_D]],Locations!$E$17)=0,\"-\",(SUMIFS(WF_CKD_DATA[[#All],[08-CKD]],WF_CKD_DATA[[#All],[OrgID]],PRACTICE!F11,WF_CKD_DATA[[#All],[Rel_D]],Locations!$E$17)))","v":389},{"$f":"IF(COUNTIFS(WF_CKD_DATA[[#All],[OrgID]],PRACTICE!$F$11,WF_CKD_DATA[[#All],[Rel_D]],Locations!$E$17)=0,\"-\",(SUMIFS(WF_CKD_DATA[[#All],[NIS08-CKD01]],WF_CKD_DATA[[#All],[OrgID]],PRACTICE!F11,WF_CKD_DATA[[#All],[Rel_D]],Locations!$E$17)))","v":303},{"$f":"IFERROR(F6/E6,\"-\")","v":0.77892030848329052},{"$f":"IF(COUNTIFS(WF_CKD_DATA[[#All],[OrgID]],PRACTICE!$F$11,WF_CKD_DATA[[#All],[Rel_D]],Locations!$E$17)=0,\"-\",(SUMIFS(WF_CKD_DATA[[#All],[NIS08-CKD02]],WF_CKD_DATA[[#All],[OrgID]],PRACTICE!F11,WF_CKD_DATA[[#All],[Rel_D]],Locations!$E$17)))","v":283},{"$f":"IFERROR(H6/E6,\"-\")","v":0.72750642673521848},{"$f":"IF(COUNTIFS(WF_CKD_DATA[[#All],[OrgID]],PRACTICE!$F$11,WF_CKD_DATA[[#All],[Rel_D]],Locations!$E$17)=0,\"-\",(SUMIFS(WF_CKD_DATA[[#All],[NIS08-CKD03]],WF_CKD_DATA[[#All],[OrgID]],PRACTICE!F11,WF_CKD_DATA[[#All],[Rel_D]],Locations!$E$17)))","v":270},{"$f":"IFERROR(J6/E6,\"-\")","v":0.6940874035989717},{"$f":"IF(COUNTIFS(WF_CKD_DATA[[#All],[OrgID]],PRACTICE!$F$11,WF_CKD_DATA[[#All],[Rel_D]],Locations!$E$17)=0,\"-\",(SUMIFS(WF_CKD_DATA[[#All],[NIS08-CKD04]],WF_CKD_DATA[[#All],[OrgID]],PRACTICE!F11,WF_CKD_DATA[[#All],[Rel_D]],Locations!$E$17)))","v":166},{"$f":"IFERROR(L6/F6,\"-\")","v":0.54785478547854782}]
{"$rows_left_out":6}
{"sheet":"Detail","index":4,"n_rows":60,"n_cols":15,"rows_kept":60,"cut":false,"hidden":false,"merged":[[56,12,56,13],[57,12,57,13],[58,12,58,13],[59,12,59,13],[57,3,57,4],[59,3,59,4],[56,3,56,4],[58,3,58,4]]}
[]
[null,null,null,null,{"$f":"MATCH(D3,HEADERINFO2!D:D,0)-1","v":2},"A",0,1,2,3,4,5,6,5,6]
[null,null,"CKD DETAIL",{"$f":"F2&HEADERTOGGLE!$J$2","v":"A"},null,"[00-00]",{"$f":"OFFSET(HEADERINFO2!$B$1,$E$2+G2,0)","v":"[08-CKD]"},{"$f":"OFFSET(HEADERINFO2!$B$1,$E$2+H2,0)","v":"NIS08-CKD01"},{"$f":"OFFSET(HEADERINFO2!$B$1,$E$2+I2,0)","v":"NIS08-CKD01%"},{"$f":"OFFSET(HEADERINFO2!$B$1,$E$2+J2,0)","v":"NIS08-CKD02"},{"$f":"OFFSET(HEADERINFO2!$B$1,$E$2+K2,0)","v":"NIS08-CKD02%"},{"$f":"OFFSET(HEADERINFO2!$B$1,$E$2+L2,0)","v":"NIS08-CKD03"},{"$f":"OFFSET(HEADERINFO2!$B$1,$E$2+M2,0)","v":"NIS08-CKD03%"},"NIS08-CKD04","NIS08-CKD04%"]
[]
[null,null,"Practice","NACS","Locality","Listsize",{"$f":"VLOOKUP(G$3,INDIRECT(Locations!$B$39),2,0)","v":"Complex Care"}]
[null,null,{"$f":"Locations!E21&\"  - to change date go to homepage\"","v":"01/04/2024  - to change date go to homepage"},null,null,null,{"$f":"VLOOKUP(G$3,INDIRECT(Locations!$B$39),4,0)","v":"eGFR evidence of CKD"},{"$f":"VLOOKUP(H$3,INDIRECT(Locations!$B$39),4,0)","v":"evidence of CKD coded CKD"},{"$f":"VLOOKUP(I$3,INDIRECT(Locations!$B$39),4,0)","v":"% evidence of CKD coded CKD"},{"$f":"VLOOKUP(J$3,INDIRECT(Locations!$B$39),4,0)","v":"evidence of CKD with BP below 140/90"},{"$f":"VLOOKUP(K$3,INDIRECT(Locations!$B$39),4,0)","v":"% evidence of CKD with BP below 140/90"},{"$f":"VLOOKUP(L$3,INDIRECT(Locations!$B$39),4,0)","v":"evidence of CKD on Statins"},{"$f":"VLOOKUP(M$3,INDIRECT(Locations!$B$39),4,0)","v":"% evidence of CKD on Statins"},{"$f":"VLOOKUP(N$3,INDIRECT(Locations!$B$39),4,0)","v":"QOF CKD code with ACR recorded"},{"$f":"VLOOKUP(O$3,INDIRECT(Locations!$B$39),4,0)","v":"% QOF CKD code with ACR recorded"}]
{"$rows_left_out":55}
{"sheet":"TRENDS","index":5,"n_rows":64,"n_cols":31,"rows_kept":64,"cut":false,"hidden":true,"merged":[[14,0,14,2]]}
["Practice Trend: Trend Chart"]
[{"$f":"B2&\"%\"","v":"NIS08-CKD04%"},{"$f":"CHART!C1","v":"NIS08-CKD04"},{"$f":"Locations!E21","v":"01/04/2024"}]
["Practice","NACS","Locality",null,"Listsize","2023-04-01","2023-05-01","2023-06-01","2023-07-01","2023-08-01","2023-09-01","2023-10-01","2023-11-01","2023-12-01","2024-01-01","2024-02-01","2024-03-01","2024-04-01","2024-05-01"]
[{"$f":"PRACTICE!E1","v":"Churchill Medical Centre"},{"$f":"PRACTICE!E2","v":"F86627"},{"$f":"PRACTICE!E5","v":"WF-2"},null,null,{"$f":"IF(TEXT(F3,0)<=TEXT($C$2,0),VLOOKUP(F3,$E$13:$H$26,3,0)/VLOOKUP(F3,$E$13:$H$26,2,0),#N/A)","v":0.31163708086785008},{"$f":"IF(TEXT(G3,0)<=TEXT($C$2,0),VLOOKUP(G3,$E$13:$H$26,3,0)/VLOOKUP(G3,$E$13:$H$26,2,0),#N/A)","v":{"$error":"#N/A"}},{"$f":"IF(TEXT(H3,0)<=TEXT($C$2,0),VLOOKUP(H3,$E$13:$H$25,3,0)/VLOOKUP(H3,$E$13:$H$25,2,0),#N/A)","v":6.7061143984220903E-2},9.6192384769539077E-2,0.15322580645161291,0.20445344129554655,0.24746450304259635,0.32172131147540983,0.38095238095238093,0.4209445585215606,0.46611909650924027,0.50099009900990099,0.52277227722772279,{"$error":"#N/A"}]
["Target",null,null,null,null,{"$f":"VLOOKUP($B$2,$B$16:$C$19,2)","v":0.5},{"$f":"VLOOKUP($B$2,$B$16:$C$19,2)","v":0.5},0.5,0.5,0.5,0.5,0.5,0.5,0.5,0.5,0.5,0.5,0.5,0.5]
[]
{"$rows_left_out":59}
{"sheet":"PRACTICE","index":6,"n_rows":40,"n_cols":14,"rows_kept":40,"cut":false,"hidden":true,"merged":[]}
[" -","Select Practice","Area","Locality",{"$f":"Homepage!J3","v":"Churchill Medical Centre"}]
["Y01291","Chingford Medical Practice","Chingford E4","WF-2",{"$f":"INDEX($A$1:$D$45,MATCH($E$1,$B$1:$B$45,0),1)","v":"F86627"},null,null,null,"Y01291","Chingford Medical Practice","Chingford E4",{"$f":"IF($K2=$M$2,$N$2,IF($K2=$M$3,$N$3,$N$4))","v":"WF-2"},"Chingford/ Walthamstow","WF-1"]
["F86627","Churchill Medical Centre","Chingford E4","WF-2",9,null,null,null,"F86627","Churchill Medical Centre","Chingford E4","WF-2","Chingford E4","WF-2"]
["F86078","The Ridgeway Surgery","Chingford E4","WF-2",{"$f":"\"'TRENDTABLE'!$A$\"&E3&\":$T$\"&E3","v":"'TRENDTABLE'!$A$9:$T$9"},null,null,null,"F86078","The Ridgeway Surgery","Chingford E4","WF-2","Leyton Collaborative","WF-3"]
["F86700","Kings Head Medical Practice","Chingford/ Walthamstow","WF-1",{"$f":"VLOOKUP(E2,A1:D41, 4, 0)","v":"WF-2"},null,null,null,"F86700","Kings Head Medical Practice","Chingford/ Walthamstow","WF-1","Forest Integrated Health","WF-4"]
["F86664","Larkshall Medical Centre","Chingford/ Walthamstow","WF-1",null,null,null,null,"F86664","Larkshall Medical Centre","Chingford/ Walthamstow","WF-1","South Leytonstone","WF-5"]
{"$rows_left_out":35}
{"sheet":"HEADERTOGGLE","index":7,"n_rows":40,"n_cols":10,"rows_kept":40,"cut":false,"hidden":true,"merged":[]}
["Condition","Indicator Type",true,"Condition","Indicator Type",false,"Alphabetical","Quadrant",true,false]
["iLTC01-RV01","iLTC10-RA01",null,"Complex Care","COPD",null,"F86607","Y01291",null,{"$f":"IF(J1,\"Y\",\"\")","v":""}]
["iLTC03-CP04","iLTC10-RA02",null,"IC101-ICC01","IC205-COPD01",null,"Y01291","F86627",null,{"$f":"IF(J1,\"in financial year\",\"in last 12 months\")","v":"in last 12 months"}]
["iLTC03-PS03","iLTC05-AS01",null,"IC101-ICC02","IC205-COPD02",null,"F86627","F86700"]
["iLTC03-RV04","iLTC01-RV01",null,"IC101-ICC03","IC205-COPD03",null,"F86708","F86664"]
["iLTC04-CP05","iLTC05-RV02",null,"IC101-ICC04","Cancer",null,"F86044","F86616"]
{"$rows_left_out":35}
{"sheet":"HEADERINFO2","index":8,"n_rows":88,"n_cols":9,"rows_kept":88,"cut":false,"hidden":true,"merged":[]}
["SearchID","FieldID","LTC","Type","Search Title","Target1","Target2","Pay1","Pay2"]
["[00-00]","[00-00]","Listsize",null,"Listsize"]
["[08-CKD]","[08-CKD]","Complex Care","A","eGFR evidence of CKD"]
["NIS08-CKD01","NIS08-CKD01","Complex Care","A","evidence of CKD coded CKD"]
["NIS08-CKD01%","NIS08-CKD01%","Complex Care","A","% evidence of CKD coded CKD",0.7,null,0.4]
["NIS08-CKD02","NIS08-CKD02","Complex Care","A","evidence of CKD with BP below 140/90"]
{"$rows_left_out":83}
{"sheet":"Locations","index":9,"n_rows":40,"n_cols":16,"rows_kept":40,"cut":false,"hidden":true,"merged":[]}
["Blank","01/04/2019","2019-05-01","2019-06-01","2019-07-01","2019-08-01","2019-09-01","2019-10-01","2019-11-01","2019-12-01","2020-01-01","2020-02-01","2020-03-01","2020-04-01","BLANK"]
["Data (Y/N)","Y","Y","Y","Y","Y","Y","Y","Y","Y","Y","Y","Y","Y"]
["File Name"]
["Q Work Sheet","Compiled_04_2018","Compiled_05_2018","Compiled_06_2018","Compiled_07_2018","Compiled_08_2018","Compiled_09_2018","Compiled_10_2018","Compiled_11_2018","Compiled_12_2018","Compiled_01_2019","Compiled_02_2019","Compiled_03_2019","Compiled_04_2019","BLANK",{"$f":"COUNTA(B4:N4)","v":13}]
["Sheet Address",{"$f":"\"'\"&IF(B3<>\"\",\"[\"&B3&\".xlsx]\",\"\")&IF(B2=\"N\",$O$5,B4)&\"'!\"","v":"'Compiled_04_2018'!"},"'Compiled_05_2018'!","'Compiled_06_2018'!","'Compiled_07_2018'!","'Compiled_08_2018'!","'Compiled_09_2018'!","'Compiled_10_2018'!","'Compiled_11_2018'!","'Compiled_12_2018'!","'Compiled_01_2019'!","'Compiled_02_2019'!","'Compiled_03_2019'!","'Compiled_04_2019'!",{"$f":"IF(O3<>\"\",\"[\"&O3&\".xlsx]\",\"\")&IF(O2=\"N\",\"\",O4)","v":"BLANK"}]
["Sheet Check",{"$f":"IF(ISREF(INDIRECT(B5&\"A1\")),\"OK\",\"WORKSHEET NOT FOUND\")","v":"WORKSHEET NOT FOUND"},"WORKSHEET NOT FOUND","OK","WORKSHEET NOT FOUND","WORKSHEET NOT FOUND","WORKSHEET NOT FOUND","WORKSHEET NOT FOUND","WORKSHEET NOT FOUND","WORKSHEET NOT FOUND","WORKSHEET NOT FOUND","WORKSHEET NOT FOUND","WORKSHEET NOT FOUND","WORKSHEET NOT FOUND"]
{"$rows_left_out":35}
{"sheet":"BLANK","index":10,"n_rows":61,"n_cols":12,"rows_kept":61,"cut":false,"hidden":true,"merged":[]}
["PracName","NW","NACS","Worksheet","[00-00]","[08-CKD]","NIS08-CKD01","NIS08-CKD01%","NIS08-CKD02","NIS08-CKD02%","NIS08-CKD03","NIS08-CKD03%"]
[null,null,null,"Seach Code:","[00-00]","[08-CKD]","NIS08-CKD01","NIS08-CKD01%","NIS08-CKD02","NIS08-CKD02%","NIS08-CKD03","NIS08-CKD03%"]
["BLANK",null,null,"Found EMISweb Search:","[00-00] Listsize","[08-CKD] eGFR evidence of CKD","NIS08-CKD01: evidence of CKD coded CKD (QOF v33)",null,"NIS08-CKD02: evidence of CKD with appropriate BP",null,"NIS08-CKD03: evidence of CKD on Statins"]
[null,null,null,"Top Left EMISweb Data:","$A$1","$A$46","$A$92",null,"$A$137",null,"$A$183"]
[null,null,null,"EMISweb Array Start:","$B$1","$B$46","$B$92",null,"$B$137",null,"$B$183"]
["2016-07-01",null,null,"EMISweb Array End:","$C$45","$C$91","$C$136",null,"$C$182",null,"$C$227"]
{"$rows_left_out":56}
{"sheet":"CHART","index":11,"n_rows":46,"n_cols":6,"rows_kept":46,"cut":false,"hidden":true,"merged":[[45,1,46,2],[45,3,46,3],[39,1,40,2],[39,3,40,3],[41,1,42,2],[41,3,42,3],[43,1,44,2],[43,3,44,3],[33,1,34,2],[33,3,34,3],[35,1,36,2],[35,3,36,3],[37,1,38,2],[37,3,38,3]]}
["Chart Selection ",{"$f":"Homepage!$M$3","v":"QOF CKD code with ACR recorded"},{"$f":"VLOOKUP(B1,B2:C4,2,0)","v":"NIS08-CKD04"}]
["Chart List ","evidence of CKD with BP below 140/90","NIS08-CKD02","evidence of CKD not coded CKD","NIS08-CKD02%",{"$f":"IFERROR(TRENDS!AA51,#N/A)","v":0.67436006374331869}]
[null,"evidence of CKD on Statins","NIS08-CKD03","evidence of CKD with BP below 140/90","NIS08-CKD03%",{"$f":"IFERROR(TRENDS!AC51,#N/A)","v":0.76957619689535761}]
[null,"QOF CKD code with ACR recorded","NIS08-CKD04","evidence of CKD not on Statins","NIS08-CKD04%",{"$f":"IFERROR(TRENDS!AE51,#N/A)","v":0.65069886448449132}]
[]
[]
{"$rows_left_out":41}
{"sheet":"Sheet2","index":12,"n_rows":5,"n_cols":7,"rows_kept":5,"cut":false,"hidden":true,"merged":[]}
["Column1","Column2","Column3","Column4","Column5","Column6","Column7"]
["Column8","Column10","Column11","Column12","Column13","Column14","Column15"]
["Search","{00-00} Listsize","{08-CKD} eGFR evidence of CKD","{NIS08-CKD01}: evidence of CKD coded CKD (QOF v46)","{NIS08-CKD02}: evidence of CKD with BP below 140/90","{NIS08-CKD03}: evidence of CKD on Statins","NIS08-CKD04: evidence of CKD has ACR"]
["OrgID","00-00","08-CKD","NIS08-CKD01","NIS08-CKD02","NIS08-CKD03","NIS08-CKD04"]
["OrgID","Listsize","eGFR evidence of CKD"," evidence of CKD coded CKD (QOF v33","evidence of CKD with BP below 140/90","evidence of CKD on Statins","evidence of CKD has ACR"]

{"sheet":"Sheet3","index":13,"n_rows":10,"n_cols":4,"rows_kept":10,"cut":false,"hidden":true,"merged":[]}
["Metric","MetricID","Target1","Target2"]
["MHA Depression Review + Activity (12M)",1,0.35]
["MHA Depression Review + Activity (IN YEAR)",2,0.35]
["Anti-Psych non-SMI Review + Activity (12M)",3,0.7]
["Anti-Psych non-SMI Review + Activity (IN YEAR)",4,0.7]
["SMI Review + Activity (12M)",5,0.7]
{"$rows_left_out":5}
{"sheet":"Sheet4","index":14,"n_rows":267,"n_cols":18,"rows_kept":267,"cut":false,"hidden":true,"merged":[]}
["Status","Practice ID","Practice","Locality ID","Locality","SubLocality ID","SubLocality","PCN/Network","PCN code","Clinical System","Address 1","Address 2","Postcode","Grid Reference","X (easting)","Y (northing)","Latitude","Longitude"]
["Active","F82005","Church Elm Lane Medical Practice","BK","Barking and Dagenham","BK-1","East","Network East","U86967","EMISweb","Church Elm Lane","Dagenham","RM10 9RR","TQ 49667 84556",549667,184556,51.540066000000003,0.15673988]
["Active","Y01719","Broad Street Medical Centre","BK","Barking and Dagenham","BK-1","East","Network East","U86968","EMISweb","Broad Street Resource Centre","Dagenham","RM10 9HU","TQ 49367 83962",549367,183962,51.534807999999998,0.15216547999999999]
["Active","Y02575","Porters Avenue Doctors Surgery","BK","Barking and Dagenham","BK-1","East","Network East","U86969","EMISweb","234 Porters Avenue","Dagenham","RM8 2EQ","TQ 47283 85077",547283,185077,51.545372999999998,0.12260706]
["Active","F82003","First Avenue Surgery","BK","Barking and Dagenham","BK-2","East One","Network East One","U27362","EMISweb","2 First Avenue","Dagenham","RM10 9AT","TQ 49762 83388",549762,183388,51.529546000000003,0.15761231000000001]
["Active","F82015","Hedgemans Surgery","BK","Barking and Dagenham","BK-2","East One","Network East One","U27362","EMISweb","92 Hedgemans Road","Dagenham","RM9 6HT","TQ 48734 84495",548734,184495,51.539763999999998,0.14327081999999999]
{"$rows_left_out":262}
{"sheet":"DATA","index":15,"n_rows":1171,"n_cols":12,"rows_kept":1171,"cut":false,"hidden":true,"merged":[]}
["Rel_D","OrgID","00-00","08-CKD","NIS08-CKD01","NIS08-CKD02","NIS08-CKD03","NIS08-CKD04","Practice","Locality ID","SubLocality ID","SubLocality"]
["2021-10-01","F86078",6905,347,109,123,207,58,"The Ridgeway Surgery","WF","WF-2","Chingford E4"]
["2021-10-01","F86086",6180,84,63,38,48,19,"Dr Dhital Practice","WF","WF-6","Central Walthamstow"]
["2021-10-01","F86058",16559,256,208,158,180,117,"St James Medical Practice Ltd","WF","WF-7","Walthamstow West"]
["2021-10-01","F86062",7321,161,110,63,122,53,"The Grove Road Medical Centre","WF","WF-7","Walthamstow West"]
["2021-10-01","F86616",7799,286,249,190,172,111,"Old Church Surgery","WF","WF-2","Chingford E4"]
{"$rows_left_out":1166}
{"sheet":"Sheet6","index":16,"n_rows":36,"n_cols":2,"rows_kept":36,"cut":false,"hidden":true,"merged":[]}
["Systmone.Name","Emis.Name"]
["1.12_With_BP_below_140_90_(CEG_Dashboards___CKD_Review)","NIS08-CKD02: evidence of CKD with BP below 140/90"]
["1.13_On_Statins_(CEG_Dashboards___CKD_Review)","NIS08-CKD03: evidence of CKD on Statins"]
["1.14_Has_ACR_(CEG_Dashboards___CKD_Review)","NIS08-CKD04: evidence of CKD has ACR"]
["1.0_Listsize_(CEG_Dashboards___CKD_Review)","[00-00] Listsize"]
["1.1_Evidence_of_CKD_(CEG_Dashboards___CKD_Review)","[08-CKD] eGFR evidence of CKD"]
{"$rows_left_out":31}
{"sheet":"Sheet7","index":17,"n_rows":151,"n_cols":12,"rows_kept":151,"cut":false,"hidden":true,"merged":[]}
["Rel_D","OrgID","00-00","08-CKD","NIS08-CKD01","NIS08-CKD02","NIS08-CKD03","NIS08-CKD04","Practice","Locality ID","SubLocality ID","SubLocality"]
["2021-10-01","F86004",32008,1670,1186,738,940,232,"Handsworth Medical Centre","WF","WF-2","Chingford E4"]
["2021-10-01","F86018",19922,966,744,454,522,334,"The Ecclesbourne Practice","WF","WF-4","Forest Integrated Health"]
["2021-10-01","F86026",14402,556,402,346,318,280,"Forest Surgery","WF","WF-1","Chingford/ Walthamstow"]
["2021-10-01","F86074",30548,706,528,386,468,230,"Leyton Healthcare (Oliver Road)","WF","WF-3","Leyton Collaborative"]
["2021-10-01","F86638",10594,554,354,274,374,258,"The Microfaculty","WF","WF-1","Chingford/ Walthamstow"]
{"$rows_left_out":145}