{"text_format":"1","workbook":"xlsx","n_sheets":18,"sheets":["Compiled_06_2018","Information","Homepage","Summary","Detail","TRENDS","PRACTICE","HEADERTOGGLE","HEADERINFO2","Locations","BLANK","CHART","Sheet2","Sheet3","Sheet4","DATA","Sheet6","Sheet7"],"not_rendered":{"charts":3,"images":5,"macros":1,"external_links":2,"defined_names":26,"comments":0,"pivot_tables":0},"unopened":[],"bounds":{"document_bytes":16777216,"sheet_cells":100000,"rows_first":2000,"rows_last":500,"rows_between":2000,"halvings":0,"cell_chars":16384,"cell_head_chars":4096},"cells_cut":0,"cells_raw":0,"read":"whole","date_system":"1900"}

{"sheet":"Compiled_06_2018","index":0,"n_rows":62,"n_cols":13,"rows_kept":62,"cut":false,"hidden":true,"merged":[]}
["PracName","Locality","NACS","Worksheet","[00-00]","[08-CKD]","NIS08-CKD01","NIS08-CKD01%","NIS08-CKD02","NIS08-CKD02%","NIS08-CKD03","NIS08-CKD03%","NIS08-CKD08"]
[null,null,null,"Seach Code:","[00-00]","[08-CKD]","NIS08-CKD01","NIS08-CKD01%","NIS08-CKD02","NIS08-CKD02%","NIS08-CKD03","NIS08-CKD03%","NIS08-CKD08"]
["2018-06-01",null,null,"Found EMISweb Search:","[00-00] Listsize","[08-CKD] eGFR evidence of CKD","NIS08-CKD01: evidence of CKD coded CKD (QOF v33)",null,"NIS08-CKD02: evidence of CKD with appropriate BP",null,"NIS08-CKD03: evidence of CKD on Statins",null,"NIS08-CKD08: Referrals to community renal clinic"]
[null,null,null,"Relative Run Date:","2018-06-01","2018-06-01","2018-06-01",null,"2018-06-01",null,"2018-06-01",null,"2018-06-01"]
[null,null,null,"Top Left EMISweb Data:","$A$9","$A$45","$A$81",null,"$A$117",null,"$A$153",null,"$A$225"]
["2018-06-01",null,null,"EMISweb Array Start:","$B$9","$B$45","$B$81",null,"$B$117",null,"$B$153",null,"$B$225"]
[null,null,null,"Top Left EMISweb Data +1 Row:","$A$10","$A$46","$A$82",null,"$A$118",null,"$A$154",null,"$A$226"]
[null,null,null,"EMISweb Array End:","$C$44","$C$80","$C$116",null,"$C$152",null,"$C$188",null,"$C$237"]
["Payment",null,"Payment"]
["Dr Zamora-Eguiluz - Leyton Green Neighbourhood H S","LC1","F86073","'CKD AR 06 18'!",3695,70,54,0.77142857142857146,38,0.54285714285714282,41,0.58571428571428574,0]
["Addison Road Medical Practice","LC1","F86607","'CKD AR 06 18'!",14040,216,82,0.37962962962962965,124,0.57407407407407407,138,0.63888888888888884,0]
["Dr Shantir Practice","LC1","F86626","'CKD AR 06 18'!",5257,72,63,0.875,49,0.68055555555555558,43,0.59722222222222221,0]
["Lime Tree Surgery","LC1","F86650","'CKD AR 06 18'!",8088,120,61,0.5083333333333333,49,0.40833333333333333,78,0.65,0]
["Francis Road Medical Centre","LC1","F86696","'CKD AR 06 18'!",4851,123,94,0.76422764227642281,67,0.54471544715447151,88,0.71544715447154472,1]
["The Vicarage Road Practice","LC1","Y00092","'CKD AR 06 18'!",0,0,0,"N/A",0,"N/A",0,"N/A",0]
["Dr S Phillips & Dr M Patel","LC2","F86006","'CKD AR 06 18'!",6053,126,76,0.60317460317460314,60,0.47619047619047616,71,0.56349206349206349,0]
["Dr Sheikh & Partners - Queens Road Medical Centre","LC2","F86030","'CKD AR 06 18'!",7753,157,93,0.59235668789808915,90,0.57324840764331209,132,0.84076433121019112,1]
["Dr K Aswani - The Allum Medical Centre","LC2","F86036","'CKD AR 06 18'!",15560,292,104,0.35616438356164382,170,0.5821917808219178,184,0.63013698630136983,3]
["Dr Sm Ali - Sma Medical Centre","LC2","F86038","'CKD AR 06 18'!",10744,171,60,0.35087719298245612,109,0.63742690058479534,122,0.71345029239766078,1]
["Dr T Kalra - Crawley Road Medical Centre","LC2","F86044","'CKD AR 06 18'!",7990,108,93,0.86111111111111116,61,0.56481481481481477,78,0.72222222222222221,0]
["Grove Surgery","LC2","F86062","'CKD AR 06 18'!",6580,153,98,0.64052287581699341,86,0.56209150326797386,116,0.75816993464052285,0]
["Dr Rp Dhital - Dr Dhital Practice","LC2","F86086","'CKD AR 06 18'!",5852,86,28,0.32558139534883723,49,0.56976744186046513,59,0.68604651162790697,0]
["Old Church Surgery","LC2","F86616","'CKD AR 06 18'!",5955,230,105,0.45652173913043476,151,0.65652173913043477,134,0.58260869565217388,2]
["Green Man Medical Centre","LC2","F86621","'CKD AR 06 18'!",5443,148,50,0.33783783783783783,112,0.7567567567567568,88,0.59459459459459463,0]
["Churchill Medical Centre","LC2","F86627","'CKD AR 06 18'!",14118,549,250,0.45537340619307831,261,0.47540983606557374,350,0.63752276867030966,4]
["Waltham Forest Community & Family Health Services Ltd","LC2","F86644","'CKD AR 06 18'!",10901,230,78,0.33913043478260868,141,0.61304347826086958,131,0.56956521739130439,0]
["Larkshall Medical Centre","LC2","F86664","'CKD AR 06 18'!",8162,186,29,0.15591397849462366,102,0.54838709677419351,112,0.60215053763440862,0]
["The Bailey Practice","LC2","F86689","'CKD AR 06 18'!",3826,51,26,0.50980392156862742,21,0.41176470588235292,32,0.62745098039215685,0]
["Kings Head Medical Practice","LC2","F86700","'CKD AR 06 18'!",3751,199,198,0.99497487437185927,116,0.58291457286432158,137,0.68844221105527637,0]
["Kiyani Medical Practice","LC2","F86701","'CKD AR 06 18'!",3134,80,54,0.67500000000000004,58,0.72499999999999998,55,0.6875,0]
["Claremont Medical Centre","LC2","F86708","'CKD AR 06 18'!",2872,48,18,0.375,32,0.66666666666666663,35,0.72916666666666663,0]
["Hampton Medical Centre","LC2","F86712","'CKD AR 06 18'!",2978,81,78,0.96296296296296291,56,0.69135802469135799,61,0.75308641975308643,0]
["Lime Tree & Sinnott Healthcare Ltd","LC2","Y01839","'CKD AR 06 18'!",6530,124,25,0.20161290322580644,88,0.70967741935483875,78,0.62903225806451613,1]
["Dr John & Partners - The Firs","LC3","F86001","'CKD AR 06 18'!",8118,174,81,0.46551724137931033,73,0.41954022988505746,111,0.63793103448275867,0]
["Dr Lindall & Partners - The Penryhn Surgery","LC3","F86005","'CKD AR 06 18'!",7742,211,157,0.74407582938388628,136,0.64454976303317535,137,0.64928909952606639,5]
["Dr Huddart - The Manor Practice","LC3","F86011","'CKD AR 06 18'!",9093,212,100,0.47169811320754718,129,0.60849056603773588,129,0.60849056603773588,0]
["High Road Surgery","LC3","F86045","'CKD AR 06 18'!",1895,47,35,0.74468085106382975,15,0.31914893617021278,33,0.7021276595744681,1]
["Brunner Road Medical Centre","LC3","F86049","'CKD AR 06 18'!",0,0,0,"N/A",0,"N/A",0,"N/A",0]
["St James Medical Practice Ltd","LC3","F86058","'CKD AR 06 18'!",14437,207,152,0.7342995169082126,137,0.66183574879227058,152,0.7342995169082126,0]
["Dr Cave & Partners - The Ridgeway Surgery","LC3","F86078","'CKD AR 06 18'!",7436,364,97,0.26648351648351648,171,0.46978021978021978,224,0.61538461538461542,1]
["The Lyndhurst Surgery","LC3","F86088","'CKD AR 06 18'!",4380,96,73,0.76041666666666663,69,0.71875,73,0.76041666666666663,1]
["LL Medical Care (Agarwal & Agrwal Practice)","LC3","F86625","'CKD AR 06 18'!",5980,127,46,0.36220472440944884,75,0.59055118110236215,80,0.62992125984251968,0]
["Thatched House Medical Centre","LC3","F86639","'CKD AR 06 18'!",0,0,0,"N/A",0,"N/A",0,"N/A",0]
["The Harrow Road Surgery","LC3","F86666","'CKD AR 06 18'!",13757,231,147,0.63636363636363635,129,0.55844155844155841,156,0.67532467532467533,1]
["Higham Hill Medical Centre","LC3","F86679","'CKD AR 06 18'!",5435,77,21,0.27272727272727271,56,0.72727272727272729,44,0.5714285714285714,0]
["The Langthorne Sharma Family Practice","LC3","F86705","'CKD AR 06 18'!",2895,50,8,0.16,33,0.66,32,0.64,0]
["Chingford Medical Practice","LC3","Y01291","'CKD AR 06 18'!",8697,363,249,0.68595041322314054,197,0.54269972451790638,203,0.55922865013774103,1]
["The Orient Practice","LC3","Y02585","'CKD AR 06 18'!",8203,41,26,0.63414634146341464,24,0.58536585365853655,28,0.68292682926829273,0]
[null,null,null,"Found EMISweb Search:","[00-00] Listsize","[08-CKD] eGFR evidence of CKD","NIS08-CKD01: evidence of CKD coded CKD (QOF v33)",null,"NIS08-CKD02: evidence of CKD with appropriate BP",null,"NIS08-CKD03: evidence of CKD on Statins",null,"NIS08-CKD08: Referrals to community renal clinic"]
[null,null,null,"Top Left EMISweb Data:","$A$9","$A$45","$A$81",null,"$A$117",null,"$A$153",null,"$A$225"]
[null,null,null,"EMISweb Array Start:","$B$9","$B$45","$B$81",null,"$B$117",null,"$B$153",null,"$B$225"]
[null,null,null,"Top Left EMISweb Data +1 Row:","$A$10","$A$46","$A$82",null,"$A$118",null,"$A$154",null,"$A$226"]
[null,null,null,"EMISweb Array End:","$C$44","$C$80","$C$116",null,"$C$152",null,"$C$188",null,"$C$237"]
["Chingford",null,"LC1",null,35931,601,354,0.589018302828619,327,0.54409317803660562,388,0.64559068219633942,1]
["Leyton & Leytonstone",null,"LC2",null,128202,3019,1463,0.48459754885723749,1763,0.5839682013911891,1975,0.65419012918184827,12]
["Walthamstow",null,"LC3",null,98068,2200,1192,0.54181818181818187,1244,0.56545454545454543,1402,0.63727272727272732,10]
["Waltham Forest Average",null,"Ave",null,null,null,null,0.53975287801137251,null,0.58500538009159608,null,0.65748456632349161]
[null,null,"Total","Networks",262201,5820,3009,0.51701030927835057,3334,0.57285223367697591,3765,0.64690721649484539,23]
[null,null,null,"Practices",245301,5416,2734,0.50480059084194973,3113,0.57477843426883313,3534,0.6525110782865583,22]
[null,null," -"," -"," -"," -"," -"," -"," -"," -"," -"," -"," -"]
["Target3",null,"Target3"]
["Target4",null,"Target4"]

{"sheet":"Information","index":1,"n_rows":4,"n_cols":2,"rows_kept":4,"cut":false,"hidden":false,"merged":[]}
[]
[null,"Waltham Forest"]
[]
[null,"CKD Management"]

{"sheet":"Homepage","index":2,"n_rows":29,"n_cols":13,"rows_kept":29,"cut":false,"hidden":false,"merged":[[18,2,19,3],[18,4,19,4],[4,5,4,7],[6,2,7,3],[8,2,9,3],[10,2,11,3],[12,2,13,3],[14,2,15,3],[12,4,13,4],[14,4,15,4],[16,4,17,4],[16,2,17,3],[6,4,7,4],[8,4,9,4],[10,4,11,4]]}
[]
[null,null,"WF CKD MANAGEMENT 2023-2024",null,null,null,"SELECT DATE >>",null,null,"SELECT PRACTICE >>",null,null,"SELECT KPI >>"]
[null,null,null,null,null,null,"01/04/2024",null,null,"Churchill Medical Centre",null,null,"QOF CKD code with ACR recorded"]
[]
[null,null,{"$f":"UPPER(CHART!B1)","v":"QOF CKD CODE WITH ACR RECORDED"},null,null,"PROGRESS TO TARGET",null,null,null,null,null,"MONTHLY ACHIEVEMENT TREND"]
[]
[null,null,"ELIGIBLE",null,{"$f":"IF(CHART!C8=\"#N/A\",\"-\",CHART!C8)","v":429}]
[]
[null,null,"AIM%",null,{"$f":"IFERROR(CHART!D12,\"-\")","v":0.5}]
[]
[null,null,"TOTAL REMAINING",null,{"$f":"IF(ISNA(CHART!C10), \"-\", CHART!C10)","v":165}]
[]
[null,null,"MIN REMAINING",null,{"$f":" CHART!E9","v":0}]
[]
[null,null,"COMPLETED",null,{"$f":"IF(ISNA(CHART!C9), \"-\", CHART!C9)","v":264}]
[]
[null,null,"ACHIEVED%",null,{"$f":"IF(ISNA(CHART!C12),\"-\",CHART!C12)","v":0.61538461538461542}]
[]
[null,null,"WF AVERAGE%",null,{"$f":"IF(ISNA(CHART!B14), \"-\", CHART!B14)","v":0.65069886448449132}]
[]
[]
[]
[]
[null,null,"*Data is cumulative"]
[]
[]
[]
[]
[null,null,"Version: 10.0",null,"CEG Website:","Visit CEG website","CEG WF Facilitator:","Fae Wilkins","Email:","Contact Fae"]

{"sheet":"Summary","index":3,"n_rows":11,"n_cols":13,"rows_kept":11,"cut":false,"hidden":false,"merged":[]}
[null,"Waltham Forest: CKD - Summary "]
[null,null,null,null,{"$f":"Locations!E21","v":"01/04/2024"},"to change date go to Homepage"]
[]
[null,null,null,"[00-00]","[08-CKD]","NIS08-CKD01","NIS08-CKD01%","NIS08-CKD02","NIS08-CKD02%","NIS08-CKD03","NIS08-CKD03%",null,"NIS08-CKD03%"]
[null,null,null,"Listsize","eGFR evidence of CKD","evidence of CKD coded CKD","% evidence of CKD coded CKD","evidence of CKD with BP below 140/90","% evidence of CKD with BP below 140/90","evidence of CKD on Statins","% evidence of CKD on Statins","QOF CKD code with ACR recorded","% QOF CKD code with ACR recorded"]
[null,"Select a Practice >>","Leyton Healthcare (Oliver Road) **",{"$f":"IF(COUNTIFS(WF_CKD_DATA[[#All],[OrgID]],PRACTICE!$F$11,WF_CKD_DATA[[#All],[Rel_D]],Locations!$E$17)=0,\"-\",(SUMIFS(WF_CKD_DATA[[#All],[00-00]],WF_CKD_DATA[[#All],[OrgID]],PRACTICE!F11,WF_CKD_DATA[[#All],[Rel_D]],Locations!$E$17)))","v":14528},{"$f":"IF(COUNTIFS(WF_CKD_DATA[[#All],[OrgID]],PRACTICE!$F$11,WF_CKD_DATA[[#All],[Rel_D]],Locations!$E$17)=0,\"-\",(SUMIFS(WF_CKD_DATA[[#All],[08-CKD]],WF_CKD_DATA[[#All],[OrgID]],PRACTICE!F11,WF_CKD_DATA[[#All],[Rel_D]],Locations!$E$17)))","v":389},{"$f":"IF(COUNTIFS(WF_CKD_DATA[[#All],[OrgID]],PRACTICE!$F$11,WF_CKD_DATA[[#All],[Rel_D]],Locations!$E$17)=0,\"-\",(SUMIFS(WF_CKD_DATA[[#All],[NIS08-CKD01]],WF_CKD_DATA[[#All],[OrgID]],PRACTICE!F11,WF_CKD_DATA[[#All],[Rel_D]],Locations!$E$17)))","v":303},{"$f":"IFERROR(F6/E6,\"-\")","v":0.77892030848329052},{"$f":"IF(COUNTIFS(WF_CKD_DATA[[#All],[OrgID]],PRACTICE!$F$11,WF_CKD_DATA[[#All],[Rel_D]],Locations!$E$17)=0,\"-\",(SUMIFS(WF_CKD_DATA[[#All],[NIS08-CKD02]],WF_CKD_DATA[[#All],[OrgID]],PRACTICE!F11,WF_CKD_DATA[[#All],[Rel_D]],Locations!$E$17)))","v":283},{"$f":"IFERROR(H6/E6,\"-\")","v":0.72750642673521848},{"$f":"IF(COUNTIFS(WF_CKD_DATA[[#All],[OrgID]],PRACTICE!$F$11,WF_CKD_DATA[[#All],[Rel_D]],Locations!$E$17)=0,\"-\",(SUMIFS(WF_CKD_DATA[[#All],[NIS08-CKD03]],WF_CKD_DATA[[#All],[OrgID]],PRACTICE!F11,WF_CKD_DATA[[#All],[Rel_D]],Locations!$E$17)))","v":270},{"$f":"IFERROR(J6/E6,\"-\")","v":0.6940874035989717},{"$f":"IF(COUNTIFS(WF_CKD_DATA[[#All],[OrgID]],PRACTICE!$F$11,WF_CKD_DATA[[#All],[Rel_D]],Locations!$E$17)=0,\"-\",(SUMIFS(WF_CKD_DATA[[#All],[NIS08-CKD04]],WF_CKD_DATA[[#All],[OrgID]],PRACTICE!F11,WF_CKD_DATA[[#All],[Rel_D]],Locations!$E$17)))","v":166},{"$f":"IFERROR(L6/F6,\"-\")","v":0.54785478547854782}]
[null,"Network",{"$f":"VLOOKUP($C$6,PRACTICE!$B$2:$C$40,2,0)","v":"Leyton Collaborative"},{"$f":"SUMIFS(WF_CKD_DATA[[#All],[00-00]],WF_CKD_DATA[[#All],[SubLocality]],$C$7,WF_CKD_DATA[[#All],[Rel_D]],Locations!$E$17)","v":35308},{"$f":"SUMIFS(WF_CKD_DATA[[#All],[08-CKD]],WF_CKD_DATA[[#All],[SubLocality]],$C$7,WF_CKD_DATA[[#All],[Rel_D]],Locations!$E$17)","v":811},{"$f":"SUMIFS(WF_CKD_DATA[[#All],[NIS08-CKD01]],WF_CKD_DATA[[#All],[SubLocality]],$C$7,WF_CKD_DATA[[#All],[Rel_D]],Locations!$E$17)","v":700},{"$f":"IFERROR(F7/E7, \"-\")","v":0.86313193588162762},{"$f":"SUMIFS(WF_CKD_DATA[[#All],[NIS08-CKD02]],WF_CKD_DATA[[#All],[SubLocality]],$C$7,WF_CKD_DATA[[#All],[Rel_D]],Locations!$E$17)","v":579},{"$f":"IFERROR(H7/E7, \"-\")","v":0.71393341553637479},{"$f":"SUMIFS(WF_CKD_DATA[[#All],[NIS08-CKD03]],WF_CKD_DATA[[#All],[SubLocality]],$C$7,WF_CKD_DATA[[#All],[Rel_D]],Locations!$E$17)","v":590},{"$f":"IFERROR(J7/E7, \"-\")","v":0.72749691738594324},{"$f":"SUMIFS(WF_CKD_DATA[[#All],[NIS08-CKD04]],WF_CKD_DATA[[#All],[SubLocality]],$C$7,WF_CKD_DATA[[#All],[Rel_D]],Locations!$E$17)","v":411},{"$f":"IFERROR(L7/F7,\"-\")","v":0.58714285714285719}]
[null,"Waltham Forest Total","Total",{"$f":"SUMIFS(WF_CKD_DATA[[#All],[00-00]],WF_CKD_DATA[[#All],[Rel_D]],Locations!$E$17)","v":329026},{"$f":"SUMIFS(WF_CKD_DATA[[#All],[08-CKD]],WF_CKD_DATA[[#All],[Rel_D]],Locations!$E$17)","v":8349},{"$f":"SUMIFS(WF_CKD_DATA[[#All],[NIS08-CKD01]],WF_CKD_DATA[[#All],[Rel_D]],Locations!$E$17)","v":7155},{"$f":"IFERROR(F8/E8, \"-\")","v":0.85698886094143012},{"$f":"SUMIFS(WF_CKD_DATA[[#All],[NIS08-CKD02]],WF_CKD_DATA[[#All],[Rel_D]],Locations!$E$17)","v":5641},{"$f":"IFERROR(H8/E8,\"-\")","v":0.67564977841657681},{"$f":"SUMIFS(WF_CKD_DATA[[#All],[NIS08-CKD03]],WF_CKD_DATA[[#All],[Rel_D]],Locations!$E$17)","v":6192},{"$f":"IFERROR(J8/E8, \"-\")","v":0.74164570607258351},{"$f":"SUMIFS(WF_CKD_DATA[[#All],[NIS08-CKD04]],WF_CKD_DATA[[#All],[Rel_D]],Locations!$E$17)","v":4574},0.63927323549965065]
[]
[]
[null,null,null,"**","SystmOne practices"]

{"sheet":"Detail","index":4,"n_rows":60,"n_cols":15,"rows_kept":60,"cut":false,"hidden":false,"merged":[[56,12,56,13],[57,12,57,13],[58,12,58,13],[59,12,59,13],[57,3,57,4],[59,3,59,4],[56,3,56,4],[58,3,58,4]]}
[]
[null,null,null,null,{"$f":"MATCH(D3,HEADERINFO2!D:D,0)-1","v":2},"A",0,1,2,3,4,5,6,5,6]
[null,null,"CKD DETAIL",{"$f":"F2&HEADERTOGGLE!$J$2","v":"A"},null,"[00-00]",{"$f":"OFFSET(HEADERINFO2!$B$1,$E$2+G2,0)","v":"[08-CKD]"},{"$f":"OFFSET(HEADERINFO2!$B$1,$E$2+H2,0)","v":"NIS08-CKD01"},{"$f":"OFFSET(HEADERINFO2!$B$1,$E$2+I2,0)","v":"NIS08-CKD01%"},{"$f":"OFFSET(HEADERINFO2!$B$1,$E$2+J2,0)","v":"NIS08-CKD02"},{"$f":"OFFSET(HEADERINFO2!$B$1,$E$2+K2,0)","v":"NIS08-CKD02%"},{"$f":"OFFSET(HEADERINFO2!$B$1,$E$2+L2,0)","v":"NIS08-CKD03"},{"$f":"OFFSET(HEADERINFO2!$B$1,$E$2+M2,0)","v":"NIS08-CKD03%"},"NIS08-CKD04","NIS08-CKD04%"]
[]
[null,null,"Practice","NACS","Locality","Listsize",{"$f":"VLOOKUP(G$3,INDIRECT(Locations!$B$39),2,0)","v":"Complex Care"}]
[null,null,{"$f":"Locations!E21&\"  - to change date go to homepage\"","v":"01/04/2024  - to change date go to homepage"},null,null,null,{"$f":"VLOOKUP(G$3,INDIRECT(Locations!$B$39),4,0)","v":"eGFR evidence of CKD"},{"$f":"VLOOKUP(H$3,INDIRECT(Locations!$B$39),4,0)","v":"evidence of CKD coded CKD"},{"$f":"VLOOKUP(I$3,INDIRECT(Locations!$B$39),4,0)","v":"% evidence of CKD coded CKD"},{"$f":"VLOOKUP(J$3,INDIRECT(Locations!$B$39),4,0)","v":"evidence of CKD with BP below 140/90"},{"$f":"VLOOKUP(K$3,INDIRECT(Locations!$B$39),4,0)","v":"% evidence of CKD with BP below 140/90"},{"$f":"VLOOKUP(L$3,INDIRECT(Locations!$B$39),4,0)","v":"evidence of CKD on Statins"},{"$f":"VLOOKUP(M$3,INDIRECT(Locations!$B$39),4,0)","v":"% evidence of CKD on Statins"},{"$f":"VLOOKUP(N$3,INDIRECT(Locations!$B$39),4,0)","v":"QOF CKD code with ACR recorded"},{"$f":"VLOOKUP(O$3,INDIRECT(Locations!$B$39),4,0)","v":"% QOF CKD code with ACR recorded"}]
[null,null,"Kings Head Medical Practice","F86700","WF-1",{"$f":"SUMIFS(WF_CKD_DATA[[#All],[00-00]],WF_CKD_DATA[[#All],[OrgID]],$D7,WF_CKD_DATA[[#All],[Rel_D]],Locations!$E$17)","v":3705},{"$f":"SUMIFS(WF_CKD_DATA[[#All],[08-CKD]],WF_CKD_DATA[[#All],[OrgID]],$D7,WF_CKD_DATA[[#All],[Rel_D]],Locations!$E$17)","v":161},{"$f":"SUMIFS(WF_CKD_DATA[[#All],[NIS08-CKD01]],WF_CKD_DATA[[#All],[OrgID]],$D7,WF_CKD_DATA[[#All],[Rel_D]],Locations!$E$17)","v":160},{"$f":"H7/G7","v":0.99378881987577639},{"$f":"SUMIFS(WF_CKD_DATA[[#All],[NIS08-CKD02]],WF_CKD_DATA[[#All],[OrgID]],$D7,WF_CKD_DATA[[#All],[Rel_D]],Locations!$E$17)","v":134},{"$f":"J7/G7","v":0.83229813664596275},{"$f":"SUMIFS(WF_CKD_DATA[[#All],[NIS08-CKD03]],WF_CKD_DATA[[#All],[OrgID]],$D7,WF_CKD_DATA[[#All],[Rel_D]],Locations!$E$17)","v":136},{"$f":"L7/G7","v":0.84472049689440998},{"$f":"SUMIFS(WF_CKD_DATA[[#All],[NIS08-CKD04]],WF_CKD_DATA[[#All],[OrgID]],$D7,WF_CKD_DATA[[#All],[Rel_D]],Locations!$E$17)","v":113},{"$f":"N7/H7","v":0.70625000000000004}]
[null,null,"Larkshall Medical Centre","F86664","WF-1",{"$f":"SUMIFS(WF_CKD_DATA[[#All],[00-00]],WF_CKD_DATA[[#All],[OrgID]],$D8,WF_CKD_DATA[[#All],[Rel_D]],Locations!$E$17)","v":8554},{"$f":"SUMIFS(WF_CKD_DATA[[#All],[08-CKD]],WF_CKD_DATA[[#All],[OrgID]],$D8,WF_CKD_DATA[[#All],[Rel_D]],Locations!$E$17)","v":186},{"$f":"SUMIFS(WF_CKD_DATA[[#All],[NIS08-CKD01]],WF_CKD_DATA[[#All],[OrgID]],$D8,WF_CKD_DATA[[#All],[Rel_D]],Locations!$E$17)","v":167},{"$f":"H8/G8","v":0.89784946236559138},{"$f":"SUMIFS(WF_CKD_DATA[[#All],[NIS08-CKD02]],WF_CKD_DATA[[#All],[OrgID]],$D8,WF_CKD_DATA[[#All],[Rel_D]],Locations!$E$17)","v":109},{"$f":"J8/G8","v":0.58602150537634412},{"$f":"SUMIFS(WF_CKD_DATA[[#All],[NIS08-CKD03]],WF_CKD_DATA[[#All],[OrgID]],$D8,WF_CKD_DATA[[#All],[Rel_D]],Locations!$E$17)","v":124},{"$f":"L8/G8","v":0.66666666666666663},{"$f":"SUMIFS(WF_CKD_DATA[[#All],[NIS08-CKD04]],WF_CKD_DATA[[#All],[OrgID]],$D8,WF_CKD_DATA[[#All],[Rel_D]],Locations!$E$17)","v":114},{"$f":"N8/H8","v":0.68263473053892221}]
[null,null,"The Microfaculty **","F86638","WF-1",{"$f":"SUMIFS(WF_CKD_DATA[[#All],[00-00]],WF_CKD_DATA[[#All],[OrgID]],$D9,WF_CKD_DATA[[#All],[Rel_D]],Locations!$E$17)","v":4628},{"$f":"SUMIFS(WF_CKD_DATA[[#All],[08-CKD]],WF_CKD_DATA[[#All],[OrgID]],$D9,WF_CKD_DATA[[#All],[Rel_D]],Locations!$E$17)","v":239},{"$f":"SUMIFS(WF_CKD_DATA[[#All],[NIS08-CKD01]],WF_CKD_DATA[[#All],[OrgID]],$D9,WF_CKD_DATA[[#All],[Rel_D]],Locations!$E$17)","v":188},{"$f":"IFERROR(H9/G9,\"-\")","v":0.78661087866108792},{"$f":"SUMIFS(WF_CKD_DATA[[#All],[NIS08-CKD02]],WF_CKD_DATA[[#All],[OrgID]],$D9,WF_CKD_DATA[[#All],[Rel_D]],Locations!$E$17)","v":193},{"$f":"IFERROR(J9/G9, \"-\")","v":0.80753138075313813},{"$f":"SUMIFS(WF_CKD_DATA[[#All],[NIS08-CKD03]],WF_CKD_DATA[[#All],[OrgID]],$D9,WF_CKD_DATA[[#All],[Rel_D]],Locations!$E$17)","v":193},{"$f":"IFERROR(L9/G9,\"-\")","v":0.80753138075313813},{"$f":"SUMIFS(WF_CKD_DATA[[#All],[NIS08-CKD04]],WF_CKD_DATA[[#All],[OrgID]],$D9,WF_CKD_DATA[[#All],[Rel_D]],Locations!$E$17)","v":133},0.70744680851063835]
[null,null," The Penryhn Surgery","F86005","WF-1",{"$f":"SUMIFS(WF_CKD_DATA[[#All],[00-00]],WF_CKD_DATA[[#All],[OrgID]],$D10,WF_CKD_DATA[[#All],[Rel_D]],Locations!$E$17)","v":9350},{"$f":"SUMIFS(WF_CKD_DATA[[#All],[08-CKD]],WF_CKD_DATA[[#All],[OrgID]],$D10,WF_CKD_DATA[[#All],[Rel_D]],Locations!$E$17)","v":179},{"$f":"SUMIFS(WF_CKD_DATA[[#All],[NIS08-CKD01]],WF_CKD_DATA[[#All],[OrgID]],$D10,WF_CKD_DATA[[#All],[Rel_D]],Locations!$E$17)","v":170},0.94972067039106145,{"$f":"SUMIFS(WF_CKD_DATA[[#All],[NIS08-CKD02]],WF_CKD_DATA[[#All],[OrgID]],$D10,WF_CKD_DATA[[#All],[Rel_D]],Locations!$E$17)","v":130},0.72625698324022347,{"$f":"SUMIFS(WF_CKD_DATA[[#All],[NIS08-CKD03]],WF_CKD_DATA[[#All],[OrgID]],$D10,WF_CKD_DATA[[#All],[Rel_D]],Locations!$E$17)","v":138},0.77094972067039103,{"$f":"SUMIFS(WF_CKD_DATA[[#All],[NIS08-CKD04]],WF_CKD_DATA[[#All],[OrgID]],$D10,WF_CKD_DATA[[#All],[Rel_D]],Locations!$E$17)","v":132},0.77647058823529413]
[null,null,"Dr Shantir Practice","F86626","WF-1",{"$f":"SUMIFS(WF_CKD_DATA[[#All],[00-00]],WF_CKD_DATA[[#All],[OrgID]],$D11,WF_CKD_DATA[[#All],[Rel_D]],Locations!$E$17)","v":7785},{"$f":"SUMIFS(WF_CKD_DATA[[#All],[08-CKD]],WF_CKD_DATA[[#All],[OrgID]],$D11,WF_CKD_DATA[[#All],[Rel_D]],Locations!$E$17)","v":114},{"$f":"SUMIFS(WF_CKD_DATA[[#All],[NIS08-CKD01]],WF_CKD_DATA[[#All],[OrgID]],$D11,WF_CKD_DATA[[#All],[Rel_D]],Locations!$E$17)","v":90},0.78947368421052633,{"$f":"SUMIFS(WF_CKD_DATA[[#All],[NIS08-CKD02]],WF_CKD_DATA[[#All],[OrgID]],$D11,WF_CKD_DATA[[#All],[Rel_D]],Locations!$E$17)","v":76},0.66666666666666663,{"$f":"SUMIFS(WF_CKD_DATA[[#All],[NIS08-CKD03]],WF_CKD_DATA[[#All],[OrgID]],$D11,WF_CKD_DATA[[#All],[Rel_D]],Locations!$E$17)","v":77},0.67543859649122806,{"$f":"SUMIFS(WF_CKD_DATA[[#All],[NIS08-CKD04]],WF_CKD_DATA[[#All],[OrgID]],$D11,WF_CKD_DATA[[#All],[Rel_D]],Locations!$E$17)","v":61},0.67777777777777781]
[null,null,"Lime Tree & Sinnott Healthcare Ltd","Y01839","WF-1",{"$f":"SUMIFS(WF_CKD_DATA[[#All],[00-00]],WF_CKD_DATA[[#All],[OrgID]],$D12,WF_CKD_DATA[[#All],[Rel_D]],Locations!$E$17)","v":7345},{"$f":"SUMIFS(WF_CKD_DATA[[#All],[08-CKD]],WF_CKD_DATA[[#All],[OrgID]],$D12,WF_CKD_DATA[[#All],[Rel_D]],Locations!$E$17)","v":146},{"$f":"SUMIFS(WF_CKD_DATA[[#All],[NIS08-CKD01]],WF_CKD_DATA[[#All],[OrgID]],$D12,WF_CKD_DATA[[#All],[Rel_D]],Locations!$E$17)","v":126},0.86301369863013699,{"$f":"SUMIFS(WF_CKD_DATA[[#All],[NIS08-CKD02]],WF_CKD_DATA[[#All],[OrgID]],$D12,WF_CKD_DATA[[#All],[Rel_D]],Locations!$E$17)","v":99},0.67808219178082196,{"$f":"SUMIFS(WF_CKD_DATA[[#All],[NIS08-CKD03]],WF_CKD_DATA[[#All],[OrgID]],$D12,WF_CKD_DATA[[#All],[Rel_D]],Locations!$E$17)","v":115},0.78767123287671237,{"$f":"SUMIFS(WF_CKD_DATA[[#All],[NIS08-CKD04]],WF_CKD_DATA[[#All],[OrgID]],$D12,WF_CKD_DATA[[#All],[Rel_D]],Locations!$E$17)","v":97},0.76984126984126988]
[null,null,"The Bailey Practice","F86689","WF-1",{"$f":"SUMIFS(WF_CKD_DATA[[#All],[00-00]],WF_CKD_DATA[[#All],[OrgID]],$D13,WF_CKD_DATA[[#All],[Rel_D]],Locations!$E$17)","v":4510},{"$f":"SUMIFS(WF_CKD_DATA[[#All],[08-CKD]],WF_CKD_DATA[[#All],[OrgID]],$D13,WF_CKD_DATA[[#All],[Rel_D]],Locations!$E$17)","v":80},{"$f":"SUMIFS(WF_CKD_DATA[[#All],[NIS08-CKD01]],WF_CKD_DATA[[#All],[OrgID]],$D13,WF_CKD_DATA[[#All],[Rel_D]],Locations!$E$17)","v":68},0.85,{"$f":"SUMIFS(WF_CKD_DATA[[#All],[NIS08-CKD02]],WF_CKD_DATA[[#All],[OrgID]],$D13,WF_CKD_DATA[[#All],[Rel_D]],Locations!$E$17)","v":55},0.6875,{"$f":"SUMIFS(WF_CKD_DATA[[#All],[NIS08-CKD03]],WF_CKD_DATA[[#All],[OrgID]],$D13,WF_CKD_DATA[[#All],[Rel_D]],Locations!$E$17)","v":58},0.72499999999999998,{"$f":"SUMIFS(WF_CKD_DATA[[#All],[NIS08-CKD04]],WF_CKD_DATA[[#All],[OrgID]],$D13,WF_CKD_DATA[[#All],[Rel_D]],Locations!$E$17)","v":44},0.6470588235294118]
[null,null,"Forest Surgery **","F86026","WF-1",{"$f":"SUMIFS(WF_CKD_DATA[[#All],[00-00]],WF_CKD_DATA[[#All],[OrgID]],$D14,WF_CKD_DATA[[#All],[Rel_D]],Locations!$E$17)","v":6843},{"$f":"SUMIFS(WF_CKD_DATA[[#All],[08-CKD]],WF_CKD_DATA[[#All],[OrgID]],$D14,WF_CKD_DATA[[#All],[Rel_D]],Locations!$E$17)","v":284},{"$f":"SUMIFS(WF_CKD_DATA[[#All],[NIS08-CKD01]],WF_CKD_DATA[[#All],[OrgID]],$D14,WF_CKD_DATA[[#All],[Rel_D]],Locations!$E$17)","v":218},{"$f":"IFERROR(H14/G14,\"-\")","v":0.76760563380281688},{"$f":"SUMIFS(WF_CKD_DATA[[#All],[NIS08-CKD02]],WF_CKD_DATA[[#All],[OrgID]],$D14,WF_CKD_DATA[[#All],[Rel_D]],Locations!$E$17)","v":227},{"$f":"IFERROR(J14/G14, \"-\")","v":0.79929577464788737},{"$f":"SUMIFS(WF_CKD_DATA[[#All],[NIS08-CKD03]],WF_CKD_DATA[[#All],[OrgID]],$D14,WF_CKD_DATA[[#All],[Rel_D]],Locations!$E$17)","v":185},{"$f":"IFERROR(L14/G14,\"-\")","v":0.65140845070422537},{"$f":"SUMIFS(WF_CKD_DATA[[#All],[NIS08-CKD04]],WF_CKD_DATA[[#All],[OrgID]],$D14,WF_CKD_DATA[[#All],[Rel_D]],Locations!$E$17)","v":192},0.88073394495412849]
[null,null,"Chingford/ Walthamstow","WF-1","WF-1",{"$f":"SUM(F7:F14)","v":52720},{"$f":"SUM(G7:G14)","v":1389},{"$f":"SUM(H7:H14)","v":1187},{"$f":"IFERROR(H15/G15,\"-\")","v":0.85457163426925842},{"$f":"SUM(J7:J14)","v":1023},{"$f":"IFERROR(J15/G15,\"-\")","v":0.73650107991360692},{"$f":"SUM(L7:L14)","v":1026},{"$f":"L15/G15","v":0.73866090712742982},{"$f":"SUM(N7:N14)","v":886},0.74641954507160913]
[null,null,"Chingford Medical Practice","Y01291","WF-2",{"$f":"SUMIFS(WF_CKD_DATA[[#All],[00-00]],WF_CKD_DATA[[#All],[OrgID]],$D16,WF_CKD_DATA[[#All],[Rel_D]],Locations!$E$17)","v":10152},{"$f":"SUMIFS(WF_CKD_DATA[[#All],[08-CKD]],WF_CKD_DATA[[#All],[OrgID]],$D16,WF_CKD_DATA[[#All],[Rel_D]],Locations!$E$17)","v":393},{"$f":"SUMIFS(WF_CKD_DATA[[#All],[NIS08-CKD01]],WF_CKD_DATA[[#All],[OrgID]],$D16,WF_CKD_DATA[[#All],[Rel_D]],Locations!$E$17)","v":372},0.94656488549618323,{"$f":"SUMIFS(WF_CKD_DATA[[#All],[NIS08-CKD02]],WF_CKD_DATA[[#All],[OrgID]],$D16,WF_CKD_DATA[[#All],[Rel_D]],Locations!$E$17)","v":233},{"$f":"IFERROR(J16/G16,\"-\")","v":0.59287531806615779},{"$f":"SUMIFS(WF_CKD_DATA[[#All],[NIS08-CKD03]],WF_CKD_DATA[[#All],[OrgID]],$D16,WF_CKD_DATA[[#All],[Rel_D]],Locations!$E$17)","v":291},{"$f":"L16/G16","v":0.74045801526717558},{"$f":"SUMIFS(WF_CKD_DATA[[#All],[NIS08-CKD04]],WF_CKD_DATA[[#All],[OrgID]],$D16,WF_CKD_DATA[[#All],[Rel_D]],Locations!$E$17)","v":219},0.58870967741935487]
[null,null,"Churchill Medical Centre","F86627","WF-2",{"$f":"SUMIFS(WF_CKD_DATA[[#All],[00-00]],WF_CKD_DATA[[#All],[OrgID]],$D17,WF_CKD_DATA[[#All],[Rel_D]],Locations!$E$17)","v":13453},{"$f":"SUMIFS(WF_CKD_DATA[[#All],[08-CKD]],WF_CKD_DATA[[#All],[OrgID]],$D17,WF_CKD_DATA[[#All],[Rel_D]],Locations!$E$17)","v":505},{"$f":"SUMIFS(WF_CKD_DATA[[#All],[NIS08-CKD01]],WF_CKD_DATA[[#All],[OrgID]],$D17,WF_CKD_DATA[[#All],[Rel_D]],Locations!$E$17)","v":429},0.84950495049504948,{"$f":"SUMIFS(WF_CKD_DATA[[#All],[NIS08-CKD02]],WF_CKD_DATA[[#All],[OrgID]],$D17,WF_CKD_DATA[[#All],[Rel_D]],Locations!$E$17)","v":307},0.60792079207920791,{"$f":"SUMIFS(WF_CKD_DATA[[#All],[NIS08-CKD03]],WF_CKD_DATA[[#All],[OrgID]],$D17,WF_CKD_DATA[[#All],[Rel_D]],Locations!$E$17)","v":373},{"$f":"L17/G17","v":0.7386138613861386},{"$f":"SUMIFS(WF_CKD_DATA[[#All],[NIS08-CKD04]],WF_CKD_DATA[[#All],[OrgID]],$D17,WF_CKD_DATA[[#All],[Rel_D]],Locations!$E$17)","v":264},0.61538461538461542]
[null,null,"Handsworth Medical Centre **","F86004","WF-2",{"$f":"SUMIFS(WF_CKD_DATA[[#All],[00-00]],WF_CKD_DATA[[#All],[OrgID]],$D18,WF_CKD_DATA[[#All],[Rel_D]],Locations!$E$17)","v":15999},{"$f":"SUMIFS(WF_CKD_DATA[[#All],[08-CKD]],WF_CKD_DATA[[#All],[OrgID]],$D18,WF_CKD_DATA[[#All],[Rel_D]],Locations!$E$17)","v":793},{"$f":"SUMIFS(WF_CKD_DATA[[#All],[NIS08-CKD01]],WF_CKD_DATA[[#All],[OrgID]],$D18,WF_CKD_DATA[[#All],[Rel_D]],Locations!$E$17)","v":604},{"$f":"IFERROR(H18/G18, \"-\")","v":0.76166456494325352},{"$f":"SUMIFS(WF_CKD_DATA[[#All],[NIS08-CKD02]],WF_CKD_DATA[[#All],[OrgID]],$D18,WF_CKD_DATA[[#All],[Rel_D]],Locations!$E$17)","v":604},{"$f":"IFERROR(J18/G18, \"-\")","v":0.76166456494325352},{"$f":"SUMIFS(WF_CKD_DATA[[#All],[NIS08-CKD03]],WF_CKD_DATA[[#All],[OrgID]],$D18,WF_CKD_DATA[[#All],[Rel_D]],Locations!$E$17)","v":517},{"$f":"IFERROR(L18/G18,\"-\")","v":0.65195460277427486},{"$f":"SUMIFS(WF_CKD_DATA[[#All],[NIS08-CKD04]],WF_CKD_DATA[[#All],[OrgID]],$D18,WF_CKD_DATA[[#All],[Rel_D]],Locations!$E$17)","v":402},0.66556291390728473]
[null,null,"The Ridgeway Surgery","F86078","WF-2",{"$f":"SUMIFS(WF_CKD_DATA[[#All],[00-00]],WF_CKD_DATA[[#All],[OrgID]],$D19,WF_CKD_DATA[[#All],[Rel_D]],Locations!$E$17)","v":6736},{"$f":"SUMIFS(WF_CKD_DATA[[#All],[08-CKD]],WF_CKD_DATA[[#All],[OrgID]],$D19,WF_CKD_DATA[[#All],[Rel_D]],Locations!$E$17)","v":311},{"$f":"SUMIFS(WF_CKD_DATA[[#All],[NIS08-CKD01]],WF_CKD_DATA[[#All],[OrgID]],$D19,WF_CKD_DATA[[#All],[Rel_D]],Locations!$E$17)","v":253},0.81350482315112538,{"$f":"SUMIFS(WF_CKD_DATA[[#All],[NIS08-CKD02]],WF_CKD_DATA[[#All],[OrgID]],$D19,WF_CKD_DATA[[#All],[Rel_D]],Locations!$E$17)","v":167},0.53697749196141475,{"$f":"SUMIFS(WF_CKD_DATA[[#All],[NIS08-CKD03]],WF_CKD_DATA[[#All],[OrgID]],$D19,WF_CKD_DATA[[#All],[Rel_D]],Locations!$E$17)","v":212},0.68167202572347263,{"$f":"SUMIFS(WF_CKD_DATA[[#All],[NIS08-CKD04]],WF_CKD_DATA[[#All],[OrgID]],$D19,WF_CKD_DATA[[#All],[Rel_D]],Locations!$E$17)","v":97},0.38339920948616601]
[null,null,"Old Church Surgery","F86616","WF-2",{"$f":"SUMIFS(WF_CKD_DATA[[#All],[00-00]],WF_CKD_DATA[[#All],[OrgID]],$D20,WF_CKD_DATA[[#All],[Rel_D]],Locations!$E$17)","v":8508},{"$f":"SUMIFS(WF_CKD_DATA[[#All],[08-CKD]],WF_CKD_DATA[[#All],[OrgID]],$D20,WF_CKD_DATA[[#All],[Rel_D]],Locations!$E$17)","v":292},{"$f":"SUMIFS(WF_CKD_DATA[[#All],[NIS08-CKD01]],WF_CKD_DATA[[#All],[OrgID]],$D20,WF_CKD_DATA[[#All],[Rel_D]],Locations!$E$17)","v":249},0.85273972602739723,{"$f":"SUMIFS(WF_CKD_DATA[[#All],[NIS08-CKD02]],WF_CKD_DATA[[#All],[OrgID]],$D20,WF_CKD_DATA[[#All],[Rel_D]],Locations!$E$17)","v":196},0.67123287671232879,{"$f":"SUMIFS(WF_CKD_DATA[[#All],[NIS08-CKD03]],WF_CKD_DATA[[#All],[OrgID]],$D20,WF_CKD_DATA[[#All],[Rel_D]],Locations!$E$17)","v":211},0.7226027397260274,{"$f":"SUMIFS(WF_CKD_DATA[[#All],[NIS08-CKD04]],WF_CKD_DATA[[#All],[OrgID]],$D20,WF_CKD_DATA[[#All],[Rel_D]],Locations!$E$17)","v":144},0.57831325301204817]
[null,null,"Chingford E4","WF-2","WF-2",{"$f":"SUM(F16:F20)","v":54848},{"$f":"SUM(G16:G20)","v":2294},1907,0.83129904097646035,{"$f":"SUM(J16:J20)","v":1507},{"$f":"J21/G21","v":0.65693112467306014},{"$f":"SUM(L16:L20)","v":1604},{"$f":"L21/G21","v":0.69921534437663468},{"$f":"SUM(N16:N20)","v":1126},0.59045621394861036]
[null,null,"The Manor Practice","F86011","WF-3",{"$f":"SUMIFS(WF_CKD_DATA[[#All],[00-00]],WF_CKD_DATA[[#All],[OrgID]],$D22,WF_CKD_DATA[[#All],[Rel_D]],Locations!$E$17)","v":9647},{"$f":"SUMIFS(WF_CKD_DATA[[#All],[08-CKD]],WF_CKD_DATA[[#All],[OrgID]],$D22,WF_CKD_DATA[[#All],[Rel_D]],Locations!$E$17)","v":213},{"$f":"SUMIFS(WF_CKD_DATA[[#All],[NIS08-CKD01]],WF_CKD_DATA[[#All],[OrgID]],$D22,WF_CKD_DATA[[#All],[Rel_D]],Locations!$E$17)","v":194},0.91079812206572774,{"$f":"SUMIFS(WF_CKD_DATA[[#All],[NIS08-CKD02]],WF_CKD_DATA[[#All],[OrgID]],$D22,WF_CKD_DATA[[#All],[Rel_D]],Locations!$E$17)","v":135},0.63380281690140849,{"$f":"SUMIFS(WF_CKD_DATA[[#All],[NIS08-CKD03]],WF_CKD_DATA[[#All],[OrgID]],$D22,WF_CKD_DATA[[#All],[Rel_D]],Locations!$E$17)","v":146},{"$f":"L22/G22","v":0.68544600938967137},{"$f":"SUMIFS(WF_CKD_DATA[[#All],[NIS08-CKD04]],WF_CKD_DATA[[#All],[OrgID]],$D22,WF_CKD_DATA[[#All],[Rel_D]],Locations!$E$17)","v":111},0.57216494845360821]
[null,null,"Sma Medical Centre","F86038","WF-3",{"$f":"SUMIFS(WF_CKD_DATA[[#All],[00-00]],WF_CKD_DATA[[#All],[OrgID]],$D23,WF_CKD_DATA[[#All],[Rel_D]],Locations!$E$17)","v":11133},{"$f":"SUMIFS(WF_CKD_DATA[[#All],[08-CKD]],WF_CKD_DATA[[#All],[OrgID]],$D23,WF_CKD_DATA[[#All],[Rel_D]],Locations!$E$17)","v":209},{"$f":"SUMIFS(WF_CKD_DATA[[#All],[NIS08-CKD01]],WF_CKD_DATA[[#All],[OrgID]],$D23,WF_CKD_DATA[[#All],[Rel_D]],Locations!$E$17)","v":203},0.9712918660287081,{"$f":"SUMIFS(WF_CKD_DATA[[#All],[NIS08-CKD02]],WF_CKD_DATA[[#All],[OrgID]],$D23,WF_CKD_DATA[[#All],[Rel_D]],Locations!$E$17)","v":161},0.77033492822966509,{"$f":"SUMIFS(WF_CKD_DATA[[#All],[NIS08-CKD03]],WF_CKD_DATA[[#All],[OrgID]],$D23,WF_CKD_DATA[[#All],[Rel_D]],Locations!$E$17)","v":174},{"$f":"L23/G23","v":0.83253588516746413},{"$f":"SUMIFS(WF_CKD_DATA[[#All],[NIS08-CKD04]],WF_CKD_DATA[[#All],[OrgID]],$D23,WF_CKD_DATA[[#All],[Rel_D]],Locations!$E$17)","v":134},0.66009852216748766]
[null,null,"Leyton Healthcare (Oliver Road) **","F86074","WF-3",{"$f":"SUMIFS(WF_CKD_DATA[[#All],[00-00]],WF_CKD_DATA[[#All],[OrgID]],$D24,WF_CKD_DATA[[#All],[Rel_D]],Locations!$E$17)","v":14528},{"$f":"SUMIFS(WF_CKD_DATA[[#All],[08-CKD]],WF_CKD_DATA[[#All],[OrgID]],$D24,WF_CKD_DATA[[#All],[Rel_D]],Locations!$E$17)","v":389},{"$f":"SUMIFS(WF_CKD_DATA[[#All],[NIS08-CKD01]],WF_CKD_DATA[[#All],[OrgID]],$D24,WF_CKD_DATA[[#All],[Rel_D]],Locations!$E$17)","v":303},{"$f":"IFERROR(H24/G24,\"-\")","v":0.77892030848329052},{"$f":"SUMIFS(WF_CKD_DATA[[#All],[NIS08-CKD02]],WF_CKD_DATA[[#All],[OrgID]],$D24,WF_CKD_DATA[[#All],[Rel_D]],Locations!$E$17)","v":283},{"$f":"IFERROR(J24/G24, \"-\")","v":0.72750642673521848},{"$f":"SUMIFS(WF_CKD_DATA[[#All],[NIS08-CKD03]],WF_CKD_DATA[[#All],[OrgID]],$D24,WF_CKD_DATA[[#All],[Rel_D]],Locations!$E$17)","v":270},{"$f":"IFERROR(L24/G24,\"-\")","v":0.6940874035989717},{"$f":"SUMIFS(WF_CKD_DATA[[#All],[NIS08-CKD04]],WF_CKD_DATA[[#All],[OrgID]],$D24,WF_CKD_DATA[[#All],[Rel_D]],Locations!$E$17)","v":166},0.54785478547854782]
[null,null,"Leyton Collaborative","WF-3","WF-3",{"$f":"SUM(F22:F24)","v":35308},{"$f":"SUM(G22:G24)","v":811},{"$f":"SUM(H22:H24)","v":700},0.86313193588162762,{"$f":"SUM(J22:J24)","v":579},{"$f":"J25/G25","v":0.71393341553637479},{"$f":"SUM(L22:L24)","v":590},{"$f":"L25/G25","v":0.72749691738594324},{"$f":"SUM(N22:N24)","v":411},0.58714285714285719]
[null,null,"The Allum Medical Centre","F86036","WF-4",{"$f":"SUMIFS(WF_CKD_DATA[[#All],[00-00]],WF_CKD_DATA[[#All],[OrgID]],$D26,WF_CKD_DATA[[#All],[Rel_D]],Locations!$E$17)","v":14408},{"$f":"SUMIFS(WF_CKD_DATA[[#All],[08-CKD]],WF_CKD_DATA[[#All],[OrgID]],$D26,WF_CKD_DATA[[#All],[Rel_D]],Locations!$E$17)","v":289},{"$f":"SUMIFS(WF_CKD_DATA[[#All],[NIS08-CKD01]],WF_CKD_DATA[[#All],[OrgID]],$D26,WF_CKD_DATA[[#All],[Rel_D]],Locations!$E$17)","v":209},0.72318339100346019,{"$f":"SUMIFS(WF_CKD_DATA[[#All],[NIS08-CKD02]],WF_CKD_DATA[[#All],[OrgID]],$D26,WF_CKD_DATA[[#All],[Rel_D]],Locations!$E$17)","v":185},0.64013840830449831,{"$f":"SUMIFS(WF_CKD_DATA[[#All],[NIS08-CKD03]],WF_CKD_DATA[[#All],[OrgID]],$D26,WF_CKD_DATA[[#All],[Rel_D]],Locations!$E$17)","v":210},{"$f":"L26/G26","v":0.72664359861591699},{"$f":"SUMIFS(WF_CKD_DATA[[#All],[NIS08-CKD04]],WF_CKD_DATA[[#All],[OrgID]],$D26,WF_CKD_DATA[[#All],[Rel_D]],Locations!$E$17)","v":104},0.49760765550239233]
[null,null," Crawley Road Medical Centre","F86044","WF-4",{"$f":"SUMIFS(WF_CKD_DATA[[#All],[00-00]],WF_CKD_DATA[[#All],[OrgID]],$D27,WF_CKD_DATA[[#All],[Rel_D]],Locations!$E$17)","v":10471},{"$f":"SUMIFS(WF_CKD_DATA[[#All],[08-CKD]],WF_CKD_DATA[[#All],[OrgID]],$D27,WF_CKD_DATA[[#All],[Rel_D]],Locations!$E$17)","v":135},{"$f":"SUMIFS(WF_CKD_DATA[[#All],[NIS08-CKD01]],WF_CKD_DATA[[#All],[OrgID]],$D27,WF_CKD_DATA[[#All],[Rel_D]],Locations!$E$17)","v":121},0.89629629629629626,{"$f":"SUMIFS(WF_CKD_DATA[[#All],[NIS08-CKD02]],WF_CKD_DATA[[#All],[OrgID]],$D27,WF_CKD_DATA[[#All],[Rel_D]],Locations!$E$17)","v":96},0.71111111111111114,{"$f":"SUMIFS(WF_CKD_DATA[[#All],[NIS08-CKD03]],WF_CKD_DATA[[#All],[OrgID]],$D27,WF_CKD_DATA[[#All],[Rel_D]],Locations!$E$17)","v":106},{"$f":"L27/G27","v":0.78518518518518521},{"$f":"SUMIFS(WF_CKD_DATA[[#All],[NIS08-CKD04]],WF_CKD_DATA[[#All],[OrgID]],$D27,WF_CKD_DATA[[#All],[Rel_D]],Locations!$E$17)","v":80},0.66115702479338845]
[null,null,"Francis Road Medical Centre","F86696","WF-4",{"$f":"SUMIFS(WF_CKD_DATA[[#All],[00-00]],WF_CKD_DATA[[#All],[OrgID]],$D28,WF_CKD_DATA[[#All],[Rel_D]],Locations!$E$17)","v":7425},{"$f":"SUMIFS(WF_CKD_DATA[[#All],[08-CKD]],WF_CKD_DATA[[#All],[OrgID]],$D28,WF_CKD_DATA[[#All],[Rel_D]],Locations!$E$17)","v":115},{"$f":"SUMIFS(WF_CKD_DATA[[#All],[NIS08-CKD01]],WF_CKD_DATA[[#All],[OrgID]],$D28,WF_CKD_DATA[[#All],[Rel_D]],Locations!$E$17)","v":103},0.89565217391304353,{"$f":"SUMIFS(WF_CKD_DATA[[#All],[NIS08-CKD02]],WF_CKD_DATA[[#All],[OrgID]],$D28,WF_CKD_DATA[[#All],[Rel_D]],Locations!$E$17)","v":64},0.55652173913043479,{"$f":"SUMIFS(WF_CKD_DATA[[#All],[NIS08-CKD03]],WF_CKD_DATA[[#All],[OrgID]],$D28,WF_CKD_DATA[[#All],[Rel_D]],Locations!$E$17)","v":95},0.82608695652173914,{"$f":"SUMIFS(WF_CKD_DATA[[#All],[NIS08-CKD04]],WF_CKD_DATA[[#All],[OrgID]],$D28,WF_CKD_DATA[[#All],[Rel_D]],Locations!$E$17)","v":40},0.38834951456310679]
[null,null,"Hampton Medical Centre","F86712","WF-4",{"$f":"SUMIFS(WF_CKD_DATA[[#All],[00-00]],WF_CKD_DATA[[#All],[OrgID]],$D29,WF_CKD_DATA[[#All],[Rel_D]],Locations!$E$17)","v":3425},{"$f":"SUMIFS(WF_CKD_DATA[[#All],[08-CKD]],WF_CKD_DATA[[#All],[OrgID]],$D29,WF_CKD_DATA[[#All],[Rel_D]],Locations!$E$17)","v":66},{"$f":"SUMIFS(WF_CKD_DATA[[#All],[NIS08-CKD01]],WF_CKD_DATA[[#All],[OrgID]],$D29,WF_CKD_DATA[[#All],[Rel_D]],Locations!$E$17)","v":63},0.95454545454545459,{"$f":"SUMIFS(WF_CKD_DATA[[#All],[NIS08-CKD02]],WF_CKD_DATA[[#All],[OrgID]],$D29,WF_CKD_DATA[[#All],[Rel_D]],Locations!$E$17)","v":52},0.78787878787878785,{"$f":"SUMIFS(WF_CKD_DATA[[#All],[NIS08-CKD03]],WF_CKD_DATA[[#All],[OrgID]],$D29,WF_CKD_DATA[[#All],[Rel_D]],Locations!$E$17)","v":54},0.81818181818181823,{"$f":"SUMIFS(WF_CKD_DATA[[#All],[NIS08-CKD04]],WF_CKD_DATA[[#All],[OrgID]],$D29,WF_CKD_DATA[[#All],[Rel_D]],Locations!$E$17)","v":53},0.84126984126984128]
[null,null,"Lime Tree Surgery","F86650","WF-4",{"$f":"SUMIFS(WF_CKD_DATA[[#All],[00-00]],WF_CKD_DATA[[#All],[OrgID]],$D30,WF_CKD_DATA[[#All],[Rel_D]],Locations!$E$17)","v":7765},{"$f":"SUMIFS(WF_CKD_DATA[[#All],[08-CKD]],WF_CKD_DATA[[#All],[OrgID]],$D30,WF_CKD_DATA[[#All],[Rel_D]],Locations!$E$17)","v":160},{"$f":"SUMIFS(WF_CKD_DATA[[#All],[NIS08-CKD01]],WF_CKD_DATA[[#All],[OrgID]],$D30,WF_CKD_DATA[[#All],[Rel_D]],Locations!$E$17)","v":132},0.82499999999999996,{"$f":"SUMIFS(WF_CKD_DATA[[#All],[NIS08-CKD02]],WF_CKD_DATA[[#All],[OrgID]],$D30,WF_CKD_DATA[[#All],[Rel_D]],Locations!$E$17)","v":85},0.53125,{"$f":"SUMIFS(WF_CKD_DATA[[#All],[NIS08-CKD03]],WF_CKD_DATA[[#All],[OrgID]],$D30,WF_CKD_DATA[[#All],[Rel_D]],Locations!$E$17)","v":126},0.78749999999999998,{"$f":"SUMIFS(WF_CKD_DATA[[#All],[NIS08-CKD04]],WF_CKD_DATA[[#All],[OrgID]],$D30,WF_CKD_DATA[[#All],[Rel_D]],Locations!$E$17)","v":78},0.59090909090909094]
[null,null,"The Lyndhurst Surgery","F86088","WF-4",{"$f":"SUMIFS(WF_CKD_DATA[[#All],[00-00]],WF_CKD_DATA[[#All],[OrgID]],$D31,WF_CKD_DATA[[#All],[Rel_D]],Locations!$E$17)","v":5224},{"$f":"SUMIFS(WF_CKD_DATA[[#All],[08-CKD]],WF_CKD_DATA[[#All],[OrgID]],$D31,WF_CKD_DATA[[#All],[Rel_D]],Locations!$E$17)","v":117},{"$f":"SUMIFS(WF_CKD_DATA[[#All],[NIS08-CKD01]],WF_CKD_DATA[[#All],[OrgID]],$D31,WF_CKD_DATA[[#All],[Rel_D]],Locations!$E$17)","v":111},0.94871794871794868,{"$f":"SUMIFS(WF_CKD_DATA[[#All],[NIS08-CKD02]],WF_CKD_DATA[[#All],[OrgID]],$D31,WF_CKD_DATA[[#All],[Rel_D]],Locations!$E$17)","v":78},0.66666666666666663,{"$f":"SUMIFS(WF_CKD_DATA[[#All],[NIS08-CKD03]],WF_CKD_DATA[[#All],[OrgID]],$D31,WF_CKD_DATA[[#All],[Rel_D]],Locations!$E$17)","v":95},0.81196581196581197,{"$f":"SUMIFS(WF_CKD_DATA[[#All],[NIS08-CKD04]],WF_CKD_DATA[[#All],[OrgID]],$D31,WF_CKD_DATA[[#All],[Rel_D]],Locations!$E$17)","v":57},0.51351351351351349]
[null,null,"The Ecclesbourne Practice **","F86018","WF-4",{"$f":"SUMIFS(WF_CKD_DATA[[#All],[00-00]],WF_CKD_DATA[[#All],[OrgID]],$D32,WF_CKD_DATA[[#All],[Rel_D]],Locations!$E$17)","v":9803},{"$f":"SUMIFS(WF_CKD_DATA[[#All],[08-CKD]],WF_CKD_DATA[[#All],[OrgID]],$D32,WF_CKD_DATA[[#All],[Rel_D]],Locations!$E$17)","v":488},{"$f":"SUMIFS(WF_CKD_DATA[[#All],[NIS08-CKD01]],WF_CKD_DATA[[#All],[OrgID]],$D32,WF_CKD_DATA[[#All],[Rel_D]],Locations!$E$17)","v":449},{"$f":"IFERROR(H32/G32, \"-\")","v":0.92008196721311475},{"$f":"SUMIFS(WF_CKD_DATA[[#All],[NIS08-CKD02]],WF_CKD_DATA[[#All],[OrgID]],$D32,WF_CKD_DATA[[#All],[Rel_D]],Locations!$E$17)","v":353},{"$f":"IFERROR(J32/G32, \"-\")","v":0.72336065573770492},{"$f":"SUMIFS(WF_CKD_DATA[[#All],[NIS08-CKD03]],WF_CKD_DATA[[#All],[OrgID]],$D32,WF_CKD_DATA[[#All],[Rel_D]],Locations!$E$17)","v":311},{"$f":"IFERROR(L32/G32,\"-\")","v":0.63729508196721307},{"$f":"SUMIFS(WF_CKD_DATA[[#All],[NIS08-CKD04]],WF_CKD_DATA[[#All],[OrgID]],$D32,WF_CKD_DATA[[#All],[Rel_D]],Locations!$E$17)","v":274},0.61024498886414258]
[null,null,"Forest Integrated Health","WF-4","WF-4",{"$f":"SUM(F26:F32)","v":58521},{"$f":"SUM(G26:G32)","v":1370},{"$f":"SUM(H26:H32)","v":1188},0.86715328467153285,{"$f":"SUM(J26:J32)","v":913},{"$f":"J33/G33","v":0.66642335766423355},{"$f":"SUM(L26:L32)","v":997},{"$f":"L33/G33","v":0.72773722627737225},{"$f":"SUM(N26:N32)","v":686},0.57744107744107742]
[null,null,"Green Man Medical Centre","F86621","WF-5",{"$f":"SUMIFS(WF_CKD_DATA[[#All],[00-00]],WF_CKD_DATA[[#All],[OrgID]],$D34,WF_CKD_DATA[[#All],[Rel_D]],Locations!$E$17)","v":6972},{"$f":"SUMIFS(WF_CKD_DATA[[#All],[08-CKD]],WF_CKD_DATA[[#All],[OrgID]],$D34,WF_CKD_DATA[[#All],[Rel_D]],Locations!$E$17)","v":160},{"$f":"SUMIFS(WF_CKD_DATA[[#All],[NIS08-CKD01]],WF_CKD_DATA[[#All],[OrgID]],$D34,WF_CKD_DATA[[#All],[Rel_D]],Locations!$E$17)","v":128},0.8,{"$f":"SUMIFS(WF_CKD_DATA[[#All],[NIS08-CKD02]],WF_CKD_DATA[[#All],[OrgID]],$D34,WF_CKD_DATA[[#All],[Rel_D]],Locations!$E$17)","v":109},0.68125000000000002,{"$f":"SUMIFS(WF_CKD_DATA[[#All],[NIS08-CKD03]],WF_CKD_DATA[[#All],[OrgID]],$D34,WF_CKD_DATA[[#All],[Rel_D]],Locations!$E$17)","v":153},{"$f":"L34/G34","v":0.95625000000000004},{"$f":"SUMIFS(WF_CKD_DATA[[#All],[NIS08-CKD04]],WF_CKD_DATA[[#All],[OrgID]],$D34,WF_CKD_DATA[[#All],[Rel_D]],Locations!$E$17)","v":95},0.7421875]
[null,null,"High Road Surgery","F86045","WF-5",{"$f":"SUMIFS(WF_CKD_DATA[[#All],[00-00]],WF_CKD_DATA[[#All],[OrgID]],$D35,WF_CKD_DATA[[#All],[Rel_D]],Locations!$E$17)","v":2035},{"$f":"SUMIFS(WF_CKD_DATA[[#All],[08-CKD]],WF_CKD_DATA[[#All],[OrgID]],$D35,WF_CKD_DATA[[#All],[Rel_D]],Locations!$E$17)","v":50},{"$f":"SUMIFS(WF_CKD_DATA[[#All],[NIS08-CKD01]],WF_CKD_DATA[[#All],[OrgID]],$D35,WF_CKD_DATA[[#All],[Rel_D]],Locations!$E$17)","v":48},0.96,{"$f":"SUMIFS(WF_CKD_DATA[[#All],[NIS08-CKD02]],WF_CKD_DATA[[#All],[OrgID]],$D35,WF_CKD_DATA[[#All],[Rel_D]],Locations!$E$17)","v":32},0.64,{"$f":"SUMIFS(WF_CKD_DATA[[#All],[NIS08-CKD03]],WF_CKD_DATA[[#All],[OrgID]],$D35,WF_CKD_DATA[[#All],[Rel_D]],Locations!$E$17)","v":39},{"$f":"L35/G35","v":0.78},{"$f":"SUMIFS(WF_CKD_DATA[[#All],[NIS08-CKD04]],WF_CKD_DATA[[#All],[OrgID]],$D35,WF_CKD_DATA[[#All],[Rel_D]],Locations!$E$17)","v":36},0.75]
[null,null,"Kiyani Medical Practice","F86701","WF-5",{"$f":"SUMIFS(WF_CKD_DATA[[#All],[00-00]],WF_CKD_DATA[[#All],[OrgID]],$D36,WF_CKD_DATA[[#All],[Rel_D]],Locations!$E$17)","v":4005},{"$f":"SUMIFS(WF_CKD_DATA[[#All],[08-CKD]],WF_CKD_DATA[[#All],[OrgID]],$D36,WF_CKD_DATA[[#All],[Rel_D]],Locations!$E$17)","v":93},{"$f":"SUMIFS(WF_CKD_DATA[[#All],[NIS08-CKD01]],WF_CKD_DATA[[#All],[OrgID]],$D36,WF_CKD_DATA[[#All],[Rel_D]],Locations!$E$17)","v":91},0.978494623655914,{"$f":"SUMIFS(WF_CKD_DATA[[#All],[NIS08-CKD02]],WF_CKD_DATA[[#All],[OrgID]],$D36,WF_CKD_DATA[[#All],[Rel_D]],Locations!$E$17)","v":70},0.75268817204301075,{"$f":"SUMIFS(WF_CKD_DATA[[#All],[NIS08-CKD03]],WF_CKD_DATA[[#All],[OrgID]],$D36,WF_CKD_DATA[[#All],[Rel_D]],Locations!$E$17)","v":90},0.967741935483871,{"$f":"SUMIFS(WF_CKD_DATA[[#All],[NIS08-CKD04]],WF_CKD_DATA[[#All],[OrgID]],$D36,WF_CKD_DATA[[#All],[Rel_D]],Locations!$E$17)","v":80},0.87912087912087911]
[null,null,"LL Medical Care (Agarwal & Agrwal Practice)","F86625","WF-5",{"$f":"SUMIFS(WF_CKD_DATA[[#All],[00-00]],WF_CKD_DATA[[#All],[OrgID]],$D37,WF_CKD_DATA[[#All],[Rel_D]],Locations!$E$17)","v":5901},{"$f":"SUMIFS(WF_CKD_DATA[[#All],[08-CKD]],WF_CKD_DATA[[#All],[OrgID]],$D37,WF_CKD_DATA[[#All],[Rel_D]],Locations!$E$17)","v":147},{"$f":"SUMIFS(WF_CKD_DATA[[#All],[NIS08-CKD01]],WF_CKD_DATA[[#All],[OrgID]],$D37,WF_CKD_DATA[[#All],[Rel_D]],Locations!$E$17)","v":125},0.85034013605442171,{"$f":"SUMIFS(WF_CKD_DATA[[#All],[NIS08-CKD02]],WF_CKD_DATA[[#All],[OrgID]],$D37,WF_CKD_DATA[[#All],[Rel_D]],Locations!$E$17)","v":111},0.75510204081632648,{"$f":"SUMIFS(WF_CKD_DATA[[#All],[NIS08-CKD03]],WF_CKD_DATA[[#All],[OrgID]],$D37,WF_CKD_DATA[[#All],[Rel_D]],Locations!$E$17)","v":119},0.80952380952380953,{"$f":"SUMIFS(WF_CKD_DATA[[#All],[NIS08-CKD04]],WF_CKD_DATA[[#All],[OrgID]],$D37,WF_CKD_DATA[[#All],[Rel_D]],Locations!$E$17)","v":87},0.69599999999999995]
[null,null,"The Harrow Road Surgery","F86666","WF-5",{"$f":"SUMIFS(WF_CKD_DATA[[#All],[00-00]],WF_CKD_DATA[[#All],[OrgID]],$D38,WF_CKD_DATA[[#All],[Rel_D]],Locations!$E$17)","v":15304},{"$f":"SUMIFS(WF_CKD_DATA[[#All],[08-CKD]],WF_CKD_DATA[[#All],[OrgID]],$D38,WF_CKD_DATA[[#All],[Rel_D]],Locations!$E$17)","v":297},{"$f":"SUMIFS(WF_CKD_DATA[[#All],[NIS08-CKD01]],WF_CKD_DATA[[#All],[OrgID]],$D38,WF_CKD_DATA[[#All],[Rel_D]],Locations!$E$17)","v":285},0.95959595959595956,{"$f":"SUMIFS(WF_CKD_DATA[[#All],[NIS08-CKD02]],WF_CKD_DATA[[#All],[OrgID]],$D38,WF_CKD_DATA[[#All],[Rel_D]],Locations!$E$17)","v":194},0.65319865319865322,{"$f":"SUMIFS(WF_CKD_DATA[[#All],[NIS08-CKD03]],WF_CKD_DATA[[#All],[OrgID]],$D38,WF_CKD_DATA[[#All],[Rel_D]],Locations!$E$17)","v":226},0.76094276094276092,{"$f":"SUMIFS(WF_CKD_DATA[[#All],[NIS08-CKD04]],WF_CKD_DATA[[#All],[OrgID]],$D38,WF_CKD_DATA[[#All],[Rel_D]],Locations!$E$17)","v":226},0.7929824561403509]
[null,null,"The Langthorne Sharma Family Practice","F86705","WF-5",{"$f":"SUMIFS(WF_CKD_DATA[[#All],[00-00]],WF_CKD_DATA[[#All],[OrgID]],$D39,WF_CKD_DATA[[#All],[Rel_D]],Locations!$E$17)","v":3434},{"$f":"SUMIFS(WF_CKD_DATA[[#All],[08-CKD]],WF_CKD_DATA[[#All],[OrgID]],$D39,WF_CKD_DATA[[#All],[Rel_D]],Locations!$E$17)","v":64},{"$f":"SUMIFS(WF_CKD_DATA[[#All],[NIS08-CKD01]],WF_CKD_DATA[[#All],[OrgID]],$D39,WF_CKD_DATA[[#All],[Rel_D]],Locations!$E$17)","v":63},0.984375,{"$f":"SUMIFS(WF_CKD_DATA[[#All],[NIS08-CKD02]],WF_CKD_DATA[[#All],[OrgID]],$D39,WF_CKD_DATA[[#All],[Rel_D]],Locations!$E$17)","v":46},0.71875,{"$f":"SUMIFS(WF_CKD_DATA[[#All],[NIS08-CKD03]],WF_CKD_DATA[[#All],[OrgID]],$D39,WF_CKD_DATA[[#All],[Rel_D]],Locations!$E$17)","v":59},0.921875,{"$f":"SUMIFS(WF_CKD_DATA[[#All],[NIS08-CKD04]],WF_CKD_DATA[[#All],[OrgID]],$D39,WF_CKD_DATA[[#All],[Rel_D]],Locations!$E$17)","v":49},0.77777777777777779]
[null,null,"South Leytonstone","WF-5","WF-5",{"$f":"SUM(F34:F39)","v":37651},{"$f":"SUM(G34:G39)","v":811},{"$f":"SUM(H34:H39)","v":740},0.91245376078914919,{"$f":"SUM(J34:J39)","v":562},{"$f":"J40/G40","v":0.69297163995067812},{"$f":"SUM(L34:L39)","v":686},{"$f":"L40/G40","v":0.84586929716399506},{"$f":"SUM(N34:N39)","v":573},0.7743243243243243]
[null,null,"Addison Road Medical Practice","F86607","WF-6",{"$f":"SUMIFS(WF_CKD_DATA[[#All],[00-00]],WF_CKD_DATA[[#All],[OrgID]],$D41,WF_CKD_DATA[[#All],[Rel_D]],Locations!$E$17)","v":16895},{"$f":"SUMIFS(WF_CKD_DATA[[#All],[08-CKD]],WF_CKD_DATA[[#All],[OrgID]],$D41,WF_CKD_DATA[[#All],[Rel_D]],Locations!$E$17)","v":297},{"$f":"SUMIFS(WF_CKD_DATA[[#All],[NIS08-CKD01]],WF_CKD_DATA[[#All],[OrgID]],$D41,WF_CKD_DATA[[#All],[Rel_D]],Locations!$E$17)","v":283},0.95286195286195285,{"$f":"SUMIFS(WF_CKD_DATA[[#All],[NIS08-CKD02]],WF_CKD_DATA[[#All],[OrgID]],$D41,WF_CKD_DATA[[#All],[Rel_D]],Locations!$E$17)","v":179},0.60269360269360273,{"$f":"SUMIFS(WF_CKD_DATA[[#All],[NIS08-CKD03]],WF_CKD_DATA[[#All],[OrgID]],$D41,WF_CKD_DATA[[#All],[Rel_D]],Locations!$E$17)","v":219},{"$f":"L41/G41","v":0.73737373737373735},{"$f":"SUMIFS(WF_CKD_DATA[[#All],[NIS08-CKD04]],WF_CKD_DATA[[#All],[OrgID]],$D41,WF_CKD_DATA[[#All],[Rel_D]],Locations!$E$17)","v":187},0.66077738515901063]
[null,null,"Claremont Medical Centre","F86708","WF-6",{"$f":"SUMIFS(WF_CKD_DATA[[#All],[00-00]],WF_CKD_DATA[[#All],[OrgID]],$D42,WF_CKD_DATA[[#All],[Rel_D]],Locations!$E$17)","v":2887},{"$f":"SUMIFS(WF_CKD_DATA[[#All],[08-CKD]],WF_CKD_DATA[[#All],[OrgID]],$D42,WF_CKD_DATA[[#All],[Rel_D]],Locations!$E$17)","v":62},{"$f":"SUMIFS(WF_CKD_DATA[[#All],[NIS08-CKD01]],WF_CKD_DATA[[#All],[OrgID]],$D42,WF_CKD_DATA[[#All],[Rel_D]],Locations!$E$17)","v":61},0.9838709677419355,{"$f":"SUMIFS(WF_CKD_DATA[[#All],[NIS08-CKD02]],WF_CKD_DATA[[#All],[OrgID]],$D42,WF_CKD_DATA[[#All],[Rel_D]],Locations!$E$17)","v":47},0.75806451612903225,{"$f":"SUMIFS(WF_CKD_DATA[[#All],[NIS08-CKD03]],WF_CKD_DATA[[#All],[OrgID]],$D42,WF_CKD_DATA[[#All],[Rel_D]],Locations!$E$17)","v":51},{"$f":"L42/G42","v":0.82258064516129037},{"$f":"SUMIFS(WF_CKD_DATA[[#All],[NIS08-CKD04]],WF_CKD_DATA[[#All],[OrgID]],$D42,WF_CKD_DATA[[#All],[Rel_D]],Locations!$E$17)","v":30},0.49180327868852458]
[null,null," The Firs","F86001","WF-6",{"$f":"SUMIFS(WF_CKD_DATA[[#All],[00-00]],WF_CKD_DATA[[#All],[OrgID]],$D43,WF_CKD_DATA[[#All],[Rel_D]],Locations!$E$17)","v":10431},{"$f":"SUMIFS(WF_CKD_DATA[[#All],[08-CKD]],WF_CKD_DATA[[#All],[OrgID]],$D43,WF_CKD_DATA[[#All],[Rel_D]],Locations!$E$17)","v":190},{"$f":"SUMIFS(WF_CKD_DATA[[#All],[NIS08-CKD01]],WF_CKD_DATA[[#All],[OrgID]],$D43,WF_CKD_DATA[[#All],[Rel_D]],Locations!$E$17)","v":173},0.91052631578947374,{"$f":"SUMIFS(WF_CKD_DATA[[#All],[NIS08-CKD02]],WF_CKD_DATA[[#All],[OrgID]],$D43,WF_CKD_DATA[[#All],[Rel_D]],Locations!$E$17)","v":112},0.58947368421052626,{"$f":"SUMIFS(WF_CKD_DATA[[#All],[NIS08-CKD03]],WF_CKD_DATA[[#All],[OrgID]],$D43,WF_CKD_DATA[[#All],[Rel_D]],Locations!$E$17)","v":142},0.74736842105263157,{"$f":"SUMIFS(WF_CKD_DATA[[#All],[NIS08-CKD04]],WF_CKD_DATA[[#All],[OrgID]],$D43,WF_CKD_DATA[[#All],[Rel_D]],Locations!$E$17)","v":86},0.49710982658959535]
[null,null,"Dr Dhital Practice","F86086","WF-6",{"$f":"SUMIFS(WF_CKD_DATA[[#All],[00-00]],WF_CKD_DATA[[#All],[OrgID]],$D44,WF_CKD_DATA[[#All],[Rel_D]],Locations!$E$17)","v":6244},{"$f":"SUMIFS(WF_CKD_DATA[[#All],[08-CKD]],WF_CKD_DATA[[#All],[OrgID]],$D44,WF_CKD_DATA[[#All],[Rel_D]],Locations!$E$17)","v":97},{"$f":"SUMIFS(WF_CKD_DATA[[#All],[NIS08-CKD01]],WF_CKD_DATA[[#All],[OrgID]],$D44,WF_CKD_DATA[[#All],[Rel_D]],Locations!$E$17)","v":81},0.83505154639175261,{"$f":"SUMIFS(WF_CKD_DATA[[#All],[NIS08-CKD02]],WF_CKD_DATA[[#All],[OrgID]],$D44,WF_CKD_DATA[[#All],[Rel_D]],Locations!$E$17)","v":54},0.55670103092783507,{"$f":"SUMIFS(WF_CKD_DATA[[#All],[NIS08-CKD03]],WF_CKD_DATA[[#All],[OrgID]],$D44,WF_CKD_DATA[[#All],[Rel_D]],Locations!$E$17)","v":80},0.82474226804123707,{"$f":"SUMIFS(WF_CKD_DATA[[#All],[NIS08-CKD04]],WF_CKD_DATA[[#All],[OrgID]],$D44,WF_CKD_DATA[[#All],[Rel_D]],Locations!$E$17)","v":55},0.67901234567901236]
[null,null,"Waltham Forest Community & Family Health Services Ltd","F86644","WF-6",{"$f":"SUMIFS(WF_CKD_DATA[[#All],[00-00]],WF_CKD_DATA[[#All],[OrgID]],$D45,WF_CKD_DATA[[#All],[Rel_D]],Locations!$E$17)","v":9183},{"$f":"SUMIFS(WF_CKD_DATA[[#All],[08-CKD]],WF_CKD_DATA[[#All],[OrgID]],$D45,WF_CKD_DATA[[#All],[Rel_D]],Locations!$E$17)","v":227},{"$f":"SUMIFS(WF_CKD_DATA[[#All],[NIS08-CKD01]],WF_CKD_DATA[[#All],[OrgID]],$D45,WF_CKD_DATA[[#All],[Rel_D]],Locations!$E$17)","v":191},0.84140969162995594,{"$f":"SUMIFS(WF_CKD_DATA[[#All],[NIS08-CKD02]],WF_CKD_DATA[[#All],[OrgID]],$D45,WF_CKD_DATA[[#All],[Rel_D]],Locations!$E$17)","v":140},0.61674008810572689,{"$f":"SUMIFS(WF_CKD_DATA[[#All],[NIS08-CKD03]],WF_CKD_DATA[[#All],[OrgID]],$D45,WF_CKD_DATA[[#All],[Rel_D]],Locations!$E$17)","v":159},0.70044052863436124,{"$f":"SUMIFS(WF_CKD_DATA[[#All],[NIS08-CKD04]],WF_CKD_DATA[[#All],[OrgID]],$D45,WF_CKD_DATA[[#All],[Rel_D]],Locations!$E$17)","v":109},0.5706806282722513]
[null,null,"Central Walthamstow","WF-6","WF-6",{"$f":"SUM(F41:F45)","v":45640},{"$f":"SUM(G41:G45)","v":873},{"$f":"SUM(H41:H45)","v":789},0.90378006872852235,{"$f":"SUM(J41:J45)","v":532},0.60939289805269192,{"$f":"SUM(L41:L45)","v":651},{"$f":"L46/G46","v":0.74570446735395191},{"$f":"SUM(N41:N45)","v":467},0.59188846641318127]
[null,null,"Seymour Medical Centre","F86006","WF-7",{"$f":"SUMIFS(WF_CKD_DATA[[#All],[00-00]],WF_CKD_DATA[[#All],[OrgID]],$D47,WF_CKD_DATA[[#All],[Rel_D]],Locations!$E$17)","v":7016},{"$f":"SUMIFS(WF_CKD_DATA[[#All],[08-CKD]],WF_CKD_DATA[[#All],[OrgID]],$D47,WF_CKD_DATA[[#All],[Rel_D]],Locations!$E$17)","v":140},{"$f":"SUMIFS(WF_CKD_DATA[[#All],[NIS08-CKD01]],WF_CKD_DATA[[#All],[OrgID]],$D47,WF_CKD_DATA[[#All],[Rel_D]],Locations!$E$17)","v":93},0.66428571428571426,{"$f":"SUMIFS(WF_CKD_DATA[[#All],[NIS08-CKD02]],WF_CKD_DATA[[#All],[OrgID]],$D47,WF_CKD_DATA[[#All],[Rel_D]],Locations!$E$17)","v":78},0.55714285714285716,{"$f":"SUMIFS(WF_CKD_DATA[[#All],[NIS08-CKD03]],WF_CKD_DATA[[#All],[OrgID]],$D47,WF_CKD_DATA[[#All],[Rel_D]],Locations!$E$17)","v":96},{"$f":"L47/G47","v":0.68571428571428572},{"$f":"SUMIFS(WF_CKD_DATA[[#All],[NIS08-CKD04]],WF_CKD_DATA[[#All],[OrgID]],$D47,WF_CKD_DATA[[#All],[Rel_D]],Locations!$E$17)","v":42},0.45161290322580644]
[null,null," Queens Road Medical Centre","F86030","WF-7",{"$f":"SUMIFS(WF_CKD_DATA[[#All],[00-00]],WF_CKD_DATA[[#All],[OrgID]],$D48,WF_CKD_DATA[[#All],[Rel_D]],Locations!$E$17)","v":8086},{"$f":"SUMIFS(WF_CKD_DATA[[#All],[08-CKD]],WF_CKD_DATA[[#All],[OrgID]],$D48,WF_CKD_DATA[[#All],[Rel_D]],Locations!$E$17)","v":174},{"$f":"SUMIFS(WF_CKD_DATA[[#All],[NIS08-CKD01]],WF_CKD_DATA[[#All],[OrgID]],$D48,WF_CKD_DATA[[#All],[Rel_D]],Locations!$E$17)","v":162},0.93103448275862066,{"$f":"SUMIFS(WF_CKD_DATA[[#All],[NIS08-CKD02]],WF_CKD_DATA[[#All],[OrgID]],$D48,WF_CKD_DATA[[#All],[Rel_D]],Locations!$E$17)","v":115},0.66091954022988508,{"$f":"SUMIFS(WF_CKD_DATA[[#All],[NIS08-CKD03]],WF_CKD_DATA[[#All],[OrgID]],$D48,WF_CKD_DATA[[#All],[Rel_D]],Locations!$E$17)","v":147},{"$f":"L48/G48","v":0.84482758620689657},{"$f":"SUMIFS(WF_CKD_DATA[[#All],[NIS08-CKD04]],WF_CKD_DATA[[#All],[OrgID]],$D48,WF_CKD_DATA[[#All],[Rel_D]],Locations!$E$17)","v":118},0.72839506172839508]
[null,null,"Grove Surgery","F86062","WF-7",{"$f":"SUMIFS(WF_CKD_DATA[[#All],[00-00]],WF_CKD_DATA[[#All],[OrgID]],$D49,WF_CKD_DATA[[#All],[Rel_D]],Locations!$E$17)","v":6984},{"$f":"SUMIFS(WF_CKD_DATA[[#All],[08-CKD]],WF_CKD_DATA[[#All],[OrgID]],$D49,WF_CKD_DATA[[#All],[Rel_D]],Locations!$E$17)","v":156},{"$f":"SUMIFS(WF_CKD_DATA[[#All],[NIS08-CKD01]],WF_CKD_DATA[[#All],[OrgID]],$D49,WF_CKD_DATA[[#All],[Rel_D]],Locations!$E$17)","v":114},0.73076923076923073,{"$f":"SUMIFS(WF_CKD_DATA[[#All],[NIS08-CKD02]],WF_CKD_DATA[[#All],[OrgID]],$D49,WF_CKD_DATA[[#All],[Rel_D]],Locations!$E$17)","v":103},0.66025641025641024,{"$f":"SUMIFS(WF_CKD_DATA[[#All],[NIS08-CKD03]],WF_CKD_DATA[[#All],[OrgID]],$D49,WF_CKD_DATA[[#All],[Rel_D]],Locations!$E$17)","v":129},0.82692307692307687,{"$f":"SUMIFS(WF_CKD_DATA[[#All],[NIS08-CKD04]],WF_CKD_DATA[[#All],[OrgID]],$D49,WF_CKD_DATA[[#All],[Rel_D]],Locations!$E$17)","v":73},0.64035087719298245]
[null,null,"Higham Hill Medical Centre","F86679","WF-7",{"$f":"SUMIFS(WF_CKD_DATA[[#All],[00-00]],WF_CKD_DATA[[#All],[OrgID]],$D50,WF_CKD_DATA[[#All],[Rel_D]],Locations!$E$17)","v":6510},{"$f":"SUMIFS(WF_CKD_DATA[[#All],[08-CKD]],WF_CKD_DATA[[#All],[OrgID]],$D50,WF_CKD_DATA[[#All],[Rel_D]],Locations!$E$17)","v":75},{"$f":"SUMIFS(WF_CKD_DATA[[#All],[NIS08-CKD01]],WF_CKD_DATA[[#All],[OrgID]],$D50,WF_CKD_DATA[[#All],[Rel_D]],Locations!$E$17)","v":72},0.96,{"$f":"SUMIFS(WF_CKD_DATA[[#All],[NIS08-CKD02]],WF_CKD_DATA[[#All],[OrgID]],$D50,WF_CKD_DATA[[#All],[Rel_D]],Locations!$E$17)","v":53},0.70666666666666667,{"$f":"SUMIFS(WF_CKD_DATA[[#All],[NIS08-CKD03]],WF_CKD_DATA[[#All],[OrgID]],$D50,WF_CKD_DATA[[#All],[Rel_D]],Locations!$E$17)","v":55},0.73333333333333328,{"$f":"SUMIFS(WF_CKD_DATA[[#All],[NIS08-CKD04]],WF_CKD_DATA[[#All],[OrgID]],$D50,WF_CKD_DATA[[#All],[Rel_D]],Locations!$E$17)","v":57},0.79166666666666663]
[null,null,"St James Medical Practice Ltd","F86058","WF-7",{"$f":"SUMIFS(WF_CKD_DATA[[#All],[00-00]],WF_CKD_DATA[[#All],[OrgID]],$D51,WF_CKD_DATA[[#All],[Rel_D]],Locations!$E$17)","v":15742},{"$f":"SUMIFS(WF_CKD_DATA[[#All],[08-CKD]],WF_CKD_DATA[[#All],[OrgID]],$D51,WF_CKD_DATA[[#All],[Rel_D]],Locations!$E$17)","v":256},{"$f":"SUMIFS(WF_CKD_DATA[[#All],[NIS08-CKD01]],WF_CKD_DATA[[#All],[OrgID]],$D51,WF_CKD_DATA[[#All],[Rel_D]],Locations!$E$17)","v":203},0.79296875,{"$f":"SUMIFS(WF_CKD_DATA[[#All],[NIS08-CKD02]],WF_CKD_DATA[[#All],[OrgID]],$D51,WF_CKD_DATA[[#All],[Rel_D]],Locations!$E$17)","v":176},0.6875,{"$f":"SUMIFS(WF_CKD_DATA[[#All],[NIS08-CKD03]],WF_CKD_DATA[[#All],[OrgID]],$D51,WF_CKD_DATA[[#All],[Rel_D]],Locations!$E$17)","v":211},0.82421875,{"$f":"SUMIFS(WF_CKD_DATA[[#All],[NIS08-CKD04]],WF_CKD_DATA[[#All],[OrgID]],$D51,WF_CKD_DATA[[#All],[Rel_D]],Locations!$E$17)","v":135},0.66502463054187189]
[null,null,"Walthamstow West","WF-7","WF-7",{"$f":"SUM(F47:F51)","v":44338},{"$f":"SUM(G47:G51)","v":801},{"$f":"SUM(H47:H51)","v":644},0.80399500624219722,{"$f":"SUM(J47:J51)","v":525},0.65543071161048694,{"$f":"SUM(L47:L51)","v":638},0.79650436953807735,{"$f":"SUM(N47:N51)","v":425},0.65993788819875776]
[null,null,null,"Total",null,{"$f":"SUM(F15,F21,F25, F33, F40, F46, F52)","v":329026},{"$f":"SUM(G15,G21,G25, G33, G40, G46, G52)","v":8349},{"$f":"SUM(H15,H21,H25, H33, H40, H46, H52)","v":7155},0.85698886094143012,{"$f":"SUM(J15,J21,J25, J33, J40, J46, J52)","v":5641},{"$f":"J53/G53","v":0.67564977841657681},{"$f":"SUM(L15,L21,L25, L33, L40, L46, L52)","v":6192},{"$f":"L53/G53","v":0.74164570607258351},{"$f":"SUM(N15,N21,N25, N33, N40, N46, N52)","v":4574},0.63927323549965065]
[null,null,null,"Min Aim",null,null,null,null,null,null,{"$f":"VLOOKUP(J$3,TRENDS!$B$17:$C$19,2,0)","v":0.5},null,{"$f":"VLOOKUP(L$3,TRENDS!$B$17:$C$19,2,0)","v":0.5},null,{"$f":"VLOOKUP(N$3,TRENDS!$B$17:$C$19,2,0)","v":0.5}]
[null,null,null,null,null,null,null,null,{"$f":"VLOOKUP(I$3,INDIRECT(Locations!$B$39),6,0)","v":0},null,{"$f":"VLOOKUP(K$3,INDIRECT(Locations!$B$39),6,0)","v":0},null,{"$f":"VLOOKUP(L$3,INDIRECT(Locations!$B$39),6,0)","v":0}]
[null,null,"CKD v9.0","Target: % of evidence of CKD to have BP below 140/90 by 31/3/2024",null,null,null,"Target: % of evidence of CKD to be prescribed Statins by 31/03/2024",null,null,null,"Target: % of evidence of CKD to have ACR by 31/03/2024"]
[null,null,"Red -","Below 30%",null,null,null,"Red -","Below 30%",null,null,"Red -","Below 30%"]
[null,null,"Brown","Between 30% - 39%",null,null,null,"Brown","Between 30% - 39%",null,null,"Brown","Between 30% - 39%"]
[null,null,"Amber -","Between 40% - 49%",null,null,null,"Amber -","Between 40% - 49%",null,null,"Amber -","Between 40% - 49%"]
[null,null,"Green -","50% - 100% ",null,null,null,"Green -","50% - 100% ",null,null,"Green -","50% - 100% "]

{"sheet":"TRENDS","index":5,"n_rows":64,"n_cols":31,"rows_kept":64,"cut":false,"hidden":true,"merged":[[14,0,14,2]]}
["Practice Trend: Trend Chart"]
[{"$f":"B2&\"%\"","v":"NIS08-CKD04%"},{"$f":"CHART!C1","v":"NIS08-CKD04"},{"$f":"Locations!E21","v":"01/04/2024"}]
["Practice","NACS","Locality",null,"Listsize","2023-04-01","2023-05-01","2023-06-01","2023-07-01","2023-08-01","2023-09-01","2023-10-01","2023-11-01","2023-12-01","2024-01-01","2024-02-01","2024-03-01","2024-04-01","2024-05-01"]
[{"$f":"PRACTICE!E1","v":"Churchill Medical Centre"},{"$f":"PRACTICE!E2","v":"F86627"},{"$f":"PRACTICE!E5","v":"WF-2"},null,null,{"$f":"IF(TEXT(F3,0)<=TEXT($C$2,0),VLOOKUP(F3,$E$13:$H$26,3,0)/VLOOKUP(F3,$E$13:$H$26,2,0),#N/A)","v":0.31163708086785008},{"$f":"IF(TEXT(G3,0)<=TEXT($C$2,0),VLOOKUP(G3,$E$13:$H$26,3,0)/VLOOKUP(G3,$E$13:$H$26,2,0),#N/A)","v":{"$error":"#N/A"}},{"$f":"IF(TEXT(H3,0)<=TEXT($C$2,0),VLOOKUP(H3,$E$13:$H$25,3,0)/VLOOKUP(H3,$E$13:$H$25,2,0),#N/A)","v":6.7061143984220903E-2},9.6192384769539077E-2,0.15322580645161291,0.20445344129554655,0.24746450304259635,0.32172131147540983,0.38095238095238093,0.4209445585215606,0.46611909650924027,0.50099009900990099,0.52277227722772279,{"$error":"#N/A"}]
["Target",null,null,null,null,{"$f":"VLOOKUP($B$2,$B$16:$C$19,2)","v":0.5},{"$f":"VLOOKUP($B$2,$B$16:$C$19,2)","v":0.5},0.5,0.5,0.5,0.5,0.5,0.5,0.5,0.5,0.5,0.5,0.5,0.5]
[]
["Selected"]
["OrgID"]
[]
[null,null,null,null,null,null,null,null,null,null,null,null,null,null,null,null,null,null,null,null,"Practices","OrgID","[08-CKD]","NIS08-CKD01","NIS08-CKD01%","NIS08-CKD02","NIS08-CKD02%","NIS08-CKD03","NIS08-CKD03%","NIS08-CKD04","NIS08-CKD04%"]
[null,null,null,null,null,null,null,null,null,null,null,null,null,null,null,null,null,null,null,null,"Kings Head Medical Practice","F86700",{"$f":"SUMIFS(WF_CKD_DATA[[#All],[08-CKD]],WF_CKD_DATA[[#All],[OrgID]],V11,WF_CKD_DATA[[#All],[Rel_D]],Locations!$E$17)","v":161},{"$f":"SUMIFS(WF_CKD_DATA[[#All],[NIS08-CKD01]],WF_CKD_DATA[[#All],[OrgID]],V11,WF_CKD_DATA[[#All],[Rel_D]],Locations!$E$17)","v":160},{"$f":"X11/W11","v":0.99378881987577639},{"$f":"SUMIFS(WF_CKD_DATA[[#All],[NIS08-CKD02]],WF_CKD_DATA[[#All],[OrgID]],V11,WF_CKD_DATA[[#All],[Rel_D]],Locations!$E$17)","v":134},{"$f":"IFERROR(Z11/W11,\"-\")","v":0.83229813664596275},{"$f":"SUMIFS(WF_CKD_DATA[[#All],[NIS08-CKD03]],WF_CKD_DATA[[#All],[OrgID]],V11,WF_CKD_DATA[[#All],[Rel_D]],Locations!$E$17)","v":136},{"$f":"IFERROR(AB11/W11,\"-\")","v":0.84472049689440998},{"$f":"SUMIFS(WF_CKD_DATA[[#All],[NIS08-CKD04]],WF_CKD_DATA[[#All],[OrgID]],V11,WF_CKD_DATA[[#All],[Rel_D]],Locations!$E$17)","v":113},{"$f":"IFERROR(AD11/X11, \"-\")","v":0.70625000000000004}]
[null,null,null,null,"Date","Denominator","Numerator ",null,null,null,null,null,null,null,null,null,null,null,null,null,"Larkshall Medical Centre","F86664",{"$f":"SUMIFS(WF_CKD_DATA[[#All],[08-CKD]],WF_CKD_DATA[[#All],[OrgID]],V12,WF_CKD_DATA[[#All],[Rel_D]],Locations!$E$17)","v":186},{"$f":"SUMIFS(WF_CKD_DATA[[#All],[NIS08-CKD01]],WF_CKD_DATA[[#All],[OrgID]],V12,WF_CKD_DATA[[#All],[Rel_D]],Locations!$E$17)","v":167},{"$f":"X12/W12","v":0.89784946236559138},{"$f":"SUMIFS(WF_CKD_DATA[[#All],[NIS08-CKD02]],WF_CKD_DATA[[#All],[OrgID]],V12,WF_CKD_DATA[[#All],[Rel_D]],Locations!$E$17)","v":109},{"$f":"IFERROR(Z12/W12,\"-\")","v":0.58602150537634412},{"$f":"SUMIFS(WF_CKD_DATA[[#All],[NIS08-CKD03]],WF_CKD_DATA[[#All],[OrgID]],V12,WF_CKD_DATA[[#All],[Rel_D]],Locations!$E$17)","v":124},{"$f":"IFERROR(AB12/W12,\"-\")","v":0.66666666666666663},{"$f":"SUMIFS(WF_CKD_DATA[[#All],[NIS08-CKD04]],WF_CKD_DATA[[#All],[OrgID]],V12,WF_CKD_DATA[[#All],[Rel_D]],Locations!$E$17)","v":114},{"$f":"IFERROR(AD12/X12, \"-\")","v":0.68263473053892221}]
[null,null,null,null,"2023-04-01",{"$f":"IF(SUMIFS(WF_CKD_DATA[[#All],[08-CKD]],WF_CKD_DATA[[#All],[OrgID]],$B$4,WF_CKD_DATA[[#All],[Rel_D]],E13)=0,#N/A,(SUMIFS(WF_CKD_DATA[[#All],[08-CKD]],WF_CKD_DATA[[#All],[OrgID]],$B$4,WF_CKD_DATA[[#All],[Rel_D]],E13)))","v":507},{"$f":"IF(SUMIFS(INDIRECT(\"WF_CKD_DATA[[#All],[\"&$B$2&\"]]\"),WF_CKD_DATA[[#All],[OrgID]],$B$4,WF_CKD_DATA[[#All],[Rel_D]],TRENDS!E13)=0,#N/A,(SUMIFS(INDIRECT(\"WF_CKD_DATA[[#All],[\"&$B$2&\"]]\"),WF_CKD_DATA[[#All],[OrgID]],$B$4,WF_CKD_DATA[[#All],[Rel_D]],TRENDS!E13)))","v":158},{"$f":"SUMIFS(INDIRECT(\"WF_CKD_DATA[[#All],[\"&$B$2&\"]]\"),#REF!,$B$4,#REF!,TRENDS!C13)","v":{"$error":"#REF!"}},null,null,null,null,null,null,null,null,null,null,null,null,"The Microfaculty","F86638",{"$f":"SUMIFS(WF_CKD_DATA[[#All],[08-CKD]],WF_CKD_DATA[[#All],[OrgID]],V13,WF_CKD_DATA[[#All],[Rel_D]],Locations!$E$17)","v":239},{"$f":"SUMIFS(WF_CKD_DATA[[#All],[NIS08-CKD01]],WF_CKD_DATA[[#All],[OrgID]],V13,WF_CKD_DATA[[#All],[Rel_D]],Locations!$E$17)","v":188},{"$f":"IFERROR(X13/W13,\"-\")","v":0.78661087866108792},{"$f":"SUMIFS(WF_CKD_DATA[[#All],[NIS08-CKD02]],WF_CKD_DATA[[#All],[OrgID]],V13,WF_CKD_DATA[[#All],[Rel_D]],Locations!$E$17)","v":193},0.80753138075313813,{"$f":"SUMIFS(WF_CKD_DATA[[#All],[NIS08-CKD03]],WF_CKD_DATA[[#All],[OrgID]],V13,WF_CKD_DATA[[#All],[Rel_D]],Locations!$E$17)","v":193},{"$f":"IFERROR(AB13/W13,\"-\")","v":0.80753138075313813},{"$f":"SUMIFS(WF_CKD_DATA[[#All],[NIS08-CKD04]],WF_CKD_DATA[[#All],[OrgID]],V13,WF_CKD_DATA[[#All],[Rel_D]],Locations!$E$17)","v":133},0.70744680851063835]
[null,null,null,null,"2023-05-01",{"$f":"IF(SUMIFS(WF_CKD_DATA[[#All],[08-CKD]],WF_CKD_DATA[[#All],[OrgID]],$B$4,WF_CKD_DATA[[#All],[Rel_D]],E14)=0,#N/A,(SUMIFS(WF_CKD_DATA[[#All],[08-CKD]],WF_CKD_DATA[[#All],[OrgID]],$B$4,WF_CKD_DATA[[#All],[Rel_D]],E14)))","v":{"$error":"#N/A"}},{"$f":"IF(SUMIFS(INDIRECT(\"WF_CKD_DATA[[#All],[\"&$B$2&\"]]\"),WF_CKD_DATA[[#All],[OrgID]],$B$4,WF_CKD_DATA[[#All],[Rel_D]],TRENDS!E14)=0,#N/A,(SUMIFS(INDIRECT(\"WF_CKD_DATA[[#All],[\"&$B$2&\"]]\"),WF_CKD_DATA[[#All],[OrgID]],$B$4,WF_CKD_DATA[[#All],[Rel_D]],TRENDS!E14)))","v":{"$error":"#N/A"}},{"$f":"SUMIFS(INDIRECT(\"WF_CKD_DATA[[#All],[\"&$B$2&\"]]\"),#REF!,$B$4,#REF!,TRENDS!C14)","v":{"$error":"#REF!"}},null,null,null,null,null,null,null,null,null,null,null,null," The Penryhn Surgery","F86005",{"$f":"SUMIFS(WF_CKD_DATA[[#All],[08-CKD]],WF_CKD_DATA[[#All],[OrgID]],V14,WF_CKD_DATA[[#All],[Rel_D]],Locations!$E$17)","v":179},{"$f":"SUMIFS(WF_CKD_DATA[[#All],[NIS08-CKD01]],WF_CKD_DATA[[#All],[OrgID]],V14,WF_CKD_DATA[[#All],[Rel_D]],Locations!$E$17)","v":170},0.94972067039106145,{"$f":"SUMIFS(WF_CKD_DATA[[#All],[NIS08-CKD02]],WF_CKD_DATA[[#All],[OrgID]],V14,WF_CKD_DATA[[#All],[Rel_D]],Locations!$E$17)","v":130},0.72625698324022347,{"$f":"SUMIFS(WF_CKD_DATA[[#All],[NIS08-CKD03]],WF_CKD_DATA[[#All],[OrgID]],V14,WF_CKD_DATA[[#All],[Rel_D]],Locations!$E$17)","v":138},0.77094972067039103,{"$f":"SUMIFS(WF_CKD_DATA[[#All],[NIS08-CKD04]],WF_CKD_DATA[[#All],[OrgID]],V14,WF_CKD_DATA[[#All],[Rel_D]],Locations!$E$17)","v":132},0.77647058823529413]
["Target table ",null,null,null,"2023-06-01",{"$f":"IF(SUMIFS(WF_CKD_DATA[[#All],[08-CKD]],WF_CKD_DATA[[#All],[OrgID]],$B$4,WF_CKD_DATA[[#All],[Rel_D]],E15)=0,#N/A,(SUMIFS(WF_CKD_DATA[[#All],[08-CKD]],WF_CKD_DATA[[#All],[OrgID]],$B$4,WF_CKD_DATA[[#All],[Rel_D]],E15)))","v":507},{"$f":"IF(SUMIFS(INDIRECT(\"WF_CKD_DATA[[#All],[\"&$B$2&\"]]\"),WF_CKD_DATA[[#All],[OrgID]],$B$4,WF_CKD_DATA[[#All],[Rel_D]],TRENDS!E15)=0,#N/A,(SUMIFS(INDIRECT(\"WF_CKD_DATA[[#All],[\"&$B$2&\"]]\"),WF_CKD_DATA[[#All],[OrgID]],$B$4,WF_CKD_DATA[[#All],[Rel_D]],TRENDS!E15)))","v":34},{"$f":"SUMIFS(INDIRECT(\"WF_CKD_DATA[[#All],[\"&$B$2&\"]]\"),#REF!,$B$4,#REF!,TRENDS!C15)","v":{"$error":"#REF!"}},null,null,null,null,null,null,null,null,null,null,null,null,"Dr Shantir Practice","F86626",{"$f":"SUMIFS(WF_CKD_DATA[[#All],[08-CKD]],WF_CKD_DATA[[#All],[OrgID]],V15,WF_CKD_DATA[[#All],[Rel_D]],Locations!$E$17)","v":114},{"$f":"SUMIFS(WF_CKD_DATA[[#All],[NIS08-CKD01]],WF_CKD_DATA[[#All],[OrgID]],V15,WF_CKD_DATA[[#All],[Rel_D]],Locations!$E$17)","v":90},0.78947368421052633,{"$f":"SUMIFS(WF_CKD_DATA[[#All],[NIS08-CKD02]],WF_CKD_DATA[[#All],[OrgID]],V15,WF_CKD_DATA[[#All],[Rel_D]],Locations!$E$17)","v":76},0.66666666666666663,{"$f":"SUMIFS(WF_CKD_DATA[[#All],[NIS08-CKD03]],WF_CKD_DATA[[#All],[OrgID]],V15,WF_CKD_DATA[[#All],[Rel_D]],Locations!$E$17)","v":77},0.67543859649122806,{"$f":"SUMIFS(WF_CKD_DATA[[#All],[NIS08-CKD04]],WF_CKD_DATA[[#All],[OrgID]],V15,WF_CKD_DATA[[#All],[Rel_D]],Locations!$E$17)","v":61},0.67777777777777781]
[null,null,"Targets",null,"2023-07-01",{"$f":"IF(SUMIFS(WF_CKD_DATA[[#All],[08-CKD]],WF_CKD_DATA[[#All],[OrgID]],$B$4,WF_CKD_DATA[[#All],[Rel_D]],E16)=0,#N/A,(SUMIFS(WF_CKD_DATA[[#All],[08-CKD]],WF_CKD_DATA[[#All],[OrgID]],$B$4,WF_CKD_DATA[[#All],[Rel_D]],E16)))","v":499},{"$f":"IF(SUMIFS(INDIRECT(\"WF_CKD_DATA[[#All],[\"&$B$2&\"]]\"),WF_CKD_DATA[[#All],[OrgID]],$B$4,WF_CKD_DATA[[#All],[Rel_D]],TRENDS!E16)=0,#N/A,(SUMIFS(INDIRECT(\"WF_CKD_DATA[[#All],[\"&$B$2&\"]]\"),WF_CKD_DATA[[#All],[OrgID]],$B$4,WF_CKD_DATA[[#All],[Rel_D]],TRENDS!E16)))","v":48},{"$f":"SUMIFS(INDIRECT(\"WF_CKD_DATA[[#All],[\"&$B$2&\"]]\"),#REF!,$B$4,#REF!,TRENDS!C16)","v":{"$error":"#REF!"}},null,null,null,null,null,null,null,null,null,null,null,null,"Lime Tree & Sinnott Healthcare Ltd","Y01839",{"$f":"SUMIFS(WF_CKD_DATA[[#All],[08-CKD]],WF_CKD_DATA[[#All],[OrgID]],V16,WF_CKD_DATA[[#All],[Rel_D]],Locations!$E$17)","v":146},{"$f":"SUMIFS(WF_CKD_DATA[[#All],[NIS08-CKD01]],WF_CKD_DATA[[#All],[OrgID]],V16,WF_CKD_DATA[[#All],[Rel_D]],Locations!$E$17)","v":126},0.86301369863013699,{"$f":"SUMIFS(WF_CKD_DATA[[#All],[NIS08-CKD02]],WF_CKD_DATA[[#All],[OrgID]],V16,WF_CKD_DATA[[#All],[Rel_D]],Locations!$E$17)","v":99},0.67808219178082196,{"$f":"SUMIFS(WF_CKD_DATA[[#All],[NIS08-CKD03]],WF_CKD_DATA[[#All],[OrgID]],V16,WF_CKD_DATA[[#All],[Rel_D]],Locations!$E$17)","v":115},0.78767123287671237,{"$f":"SUMIFS(WF_CKD_DATA[[#All],[NIS08-CKD04]],WF_CKD_DATA[[#All],[OrgID]],V16,WF_CKD_DATA[[#All],[Rel_D]],Locations!$E$17)","v":97},0.76984126984126988]
["evidence of CKD with BP below 140/90","NIS08-CKD02",0.5,null,"2023-08-01",{"$f":"IF(SUMIFS(WF_CKD_DATA[[#All],[08-CKD]],WF_CKD_DATA[[#All],[OrgID]],$B$4,WF_CKD_DATA[[#All],[Rel_D]],E17)=0,#N/A,(SUMIFS(WF_CKD_DATA[[#All],[08-CKD]],WF_CKD_DATA[[#All],[OrgID]],$B$4,WF_CKD_DATA[[#All],[Rel_D]],E17)))","v":496},{"$f":"IF(SUMIFS(INDIRECT(\"WF_CKD_DATA[[#All],[\"&$B$2&\"]]\"),WF_CKD_DATA[[#All],[OrgID]],$B$4,WF_CKD_DATA[[#All],[Rel_D]],TRENDS!E17)=0,#N/A,(SUMIFS(INDIRECT(\"WF_CKD_DATA[[#All],[\"&$B$2&\"]]\"),WF_CKD_DATA[[#All],[OrgID]],$B$4,WF_CKD_DATA[[#All],[Rel_D]],TRENDS!E17)))","v":76},{"$f":"SUMIFS(INDIRECT(\"WF_CKD_DATA[[#All],[\"&$B$2&\"]]\"),#REF!,$B$4,#REF!,TRENDS!C17)","v":{"$error":"#REF!"}},null,null,null,null,null,null,null,null,null,null,null,null,"The Bailey Practice","F86689",{"$f":"SUMIFS(WF_CKD_DATA[[#All],[08-CKD]],WF_CKD_DATA[[#All],[OrgID]],V17,WF_CKD_DATA[[#All],[Rel_D]],Locations!$E$17)","v":80},{"$f":"SUMIFS(WF_CKD_DATA[[#All],[NIS08-CKD01]],WF_CKD_DATA[[#All],[OrgID]],V17,WF_CKD_DATA[[#All],[Rel_D]],Locations!$E$17)","v":68},0.85,{"$f":"SUMIFS(WF_CKD_DATA[[#All],[NIS08-CKD02]],WF_CKD_DATA[[#All],[OrgID]],V17,WF_CKD_DATA[[#All],[Rel_D]],Locations!$E$17)","v":55},0.6875,{"$f":"SUMIFS(WF_CKD_DATA[[#All],[NIS08-CKD03]],WF_CKD_DATA[[#All],[OrgID]],V17,WF_CKD_DATA[[#All],[Rel_D]],Locations!$E$17)","v":58},0.72499999999999998,{"$f":"SUMIFS(WF_CKD_DATA[[#All],[NIS08-CKD04]],WF_CKD_DATA[[#All],[OrgID]],V17,WF_CKD_DATA[[#All],[Rel_D]],Locations!$E$17)","v":44},0.6470588235294118]
["evidence of CKD on Statins","NIS08-CKD03",0.5,null,"2023-09-01",{"$f":"IF(SUMIFS(WF_CKD_DATA[[#All],[08-CKD]],WF_CKD_DATA[[#All],[OrgID]],$B$4,WF_CKD_DATA[[#All],[Rel_D]],E18)=0,#N/A,(SUMIFS(WF_CKD_DATA[[#All],[08-CKD]],WF_CKD_DATA[[#All],[OrgID]],$B$4,WF_CKD_DATA[[#All],[Rel_D]],E18)))","v":494},{"$f":"IF(SUMIFS(INDIRECT(\"WF_CKD_DATA[[#All],[\"&$B$2&\"]]\"),WF_CKD_DATA[[#All],[OrgID]],$B$4,WF_CKD_DATA[[#All],[Rel_D]],TRENDS!E18)=0,#N/A,(SUMIFS(INDIRECT(\"WF_CKD_DATA[[#All],[\"&$B$2&\"]]\"),WF_CKD_DATA[[#All],[OrgID]],$B$4,WF_CKD_DATA[[#All],[Rel_D]],TRENDS!E18)))","v":101},{"$f":"SUMIFS(INDIRECT(\"WF_CKD_DATA[[#All],[\"&$B$2&\"]]\"),#REF!,$B$4,#REF!,TRENDS!C18)","v":{"$error":"#REF!"}},null,null,null,null,null,null,null,null,null,null,null,null,"Forest Surgery","F86026",{"$f":"SUMIFS(WF_CKD_DATA[[#All],[08-CKD]],WF_CKD_DATA[[#All],[OrgID]],V18,WF_CKD_DATA[[#All],[Rel_D]],Locations!$E$17)","v":284},{"$f":"SUMIFS(WF_CKD_DATA[[#All],[NIS08-CKD01]],WF_CKD_DATA[[#All],[OrgID]],V18,WF_CKD_DATA[[#All],[Rel_D]],Locations!$E$17)","v":218},{"$f":"IFERROR(X18/W18,\"-\")","v":0.76760563380281688},{"$f":"SUMIFS(WF_CKD_DATA[[#All],[NIS08-CKD02]],WF_CKD_DATA[[#All],[OrgID]],V18,WF_CKD_DATA[[#All],[Rel_D]],Locations!$E$17)","v":227},0.79929577464788737,{"$f":"SUMIFS(WF_CKD_DATA[[#All],[NIS08-CKD03]],WF_CKD_DATA[[#All],[OrgID]],V18,WF_CKD_DATA[[#All],[Rel_D]],Locations!$E$17)","v":185},0.65140845070422537,{"$f":"SUMIFS(WF_CKD_DATA[[#All],[NIS08-CKD04]],WF_CKD_DATA[[#All],[OrgID]],V18,WF_CKD_DATA[[#All],[Rel_D]],Locations!$E$17)","v":192},0.88073394495412849]
["evidence of CKD with ACR","NIS08-CKD04",0.5,null,"2023-10-01",{"$f":"IF(SUMIFS(WF_CKD_DATA[[#All],[08-CKD]],WF_CKD_DATA[[#All],[OrgID]],$B$4,WF_CKD_DATA[[#All],[Rel_D]],E19)=0,#N/A,(SUMIFS(WF_CKD_DATA[[#All],[08-CKD]],WF_CKD_DATA[[#All],[OrgID]],$B$4,WF_CKD_DATA[[#All],[Rel_D]],E19)))","v":493},{"$f":"IF(SUMIFS(INDIRECT(\"WF_CKD_DATA[[#All],[\"&$B$2&\"]]\"),WF_CKD_DATA[[#All],[OrgID]],$B$4,WF_CKD_DATA[[#All],[Rel_D]],TRENDS!E19)=0,#N/A,(SUMIFS(INDIRECT(\"WF_CKD_DATA[[#All],[\"&$B$2&\"]]\"),WF_CKD_DATA[[#All],[OrgID]],$B$4,WF_CKD_DATA[[#All],[Rel_D]],TRENDS!E19)))","v":122},{"$f":"SUMIFS(INDIRECT(\"WF_CKD_DATA[[#All],[\"&$B$2&\"]]\"),#REF!,$B$4,#REF!,TRENDS!C19)","v":{"$error":"#REF!"}},null,null,null,null,null,null,null,null,null,null,null,null,"Handsworth Medical Centre","F86004",{"$f":"SUMIFS(WF_CKD_DATA[[#All],[08-CKD]],WF_CKD_DATA[[#All],[OrgID]],V19,WF_CKD_DATA[[#All],[Rel_D]],Locations!$E$17)","v":793},{"$f":"SUMIFS(WF_CKD_DATA[[#All],[NIS08-CKD01]],WF_CKD_DATA[[#All],[OrgID]],V19,WF_CKD_DATA[[#All],[Rel_D]],Locations!$E$17)","v":604},{"$f":"IFERROR(X19/W19,\"-\")","v":0.76166456494325352},{"$f":"SUMIFS(WF_CKD_DATA[[#All],[NIS08-CKD02]],WF_CKD_DATA[[#All],[OrgID]],V19,WF_CKD_DATA[[#All],[Rel_D]],Locations!$E$17)","v":604},0.76166456494325352,{"$f":"SUMIFS(WF_CKD_DATA[[#All],[NIS08-CKD03]],WF_CKD_DATA[[#All],[OrgID]],V19,WF_CKD_DATA[[#All],[Rel_D]],Locations!$E$17)","v":517},0.65195460277427486,{"$f":"SUMIFS(WF_CKD_DATA[[#All],[NIS08-CKD04]],WF_CKD_DATA[[#All],[OrgID]],V19,WF_CKD_DATA[[#All],[Rel_D]],Locations!$E$17)","v":402},0.66556291390728473]
[null,null,null,null,"2023-11-01",{"$f":"IF(SUMIFS(WF_CKD_DATA[[#All],[08-CKD]],WF_CKD_DATA[[#All],[OrgID]],$B$4,WF_CKD_DATA[[#All],[Rel_D]],E20)=0,#N/A,(SUMIFS(WF_CKD_DATA[[#All],[08-CKD]],WF_CKD_DATA[[#All],[OrgID]],$B$4,WF_CKD_DATA[[#All],[Rel_D]],E20)))","v":488},{"$f":"IF(SUMIFS(INDIRECT(\"WF_CKD_DATA[[#All],[\"&$B$2&\"]]\"),WF_CKD_DATA[[#All],[OrgID]],$B$4,WF_CKD_DATA[[#All],[Rel_D]],TRENDS!E20)=0,#N/A,(SUMIFS(INDIRECT(\"WF_CKD_DATA[[#All],[\"&$B$2&\"]]\"),WF_CKD_DATA[[#All],[OrgID]],$B$4,WF_CKD_DATA[[#All],[Rel_D]],TRENDS!E20)))","v":157},{"$f":"SUMIFS(INDIRECT(\"WF_CKD_DATA[[#All],[\"&$B$2&\"]]\"),#REF!,$B$4,#REF!,TRENDS!C20)","v":{"$error":"#REF!"}},null,null,null,null,null,null,null,null,null,null,null,null,"Chingford Medical Practice","Y01291",{"$f":"SUMIFS(WF_CKD_DATA[[#All],[08-CKD]],WF_CKD_DATA[[#All],[OrgID]],V20,WF_CKD_DATA[[#All],[Rel_D]],Locations!$E$17)","v":393},{"$f":"SUMIFS(WF_CKD_DATA[[#All],[NIS08-CKD01]],WF_CKD_DATA[[#All],[OrgID]],V20,WF_CKD_DATA[[#All],[Rel_D]],Locations!$E$17)","v":372},0.94656488549618323,{"$f":"SUMIFS(WF_CKD_DATA[[#All],[NIS08-CKD02]],WF_CKD_DATA[[#All],[OrgID]],V20,WF_CKD_DATA[[#All],[Rel_D]],Locations!$E$17)","v":233},0.59287531806615779,{"$f":"SUMIFS(WF_CKD_DATA[[#All],[NIS08-CKD03]],WF_CKD_DATA[[#All],[OrgID]],V20,WF_CKD_DATA[[#All],[Rel_D]],Locations!$E$17)","v":291},0.74045801526717558,{"$f":"SUMIFS(WF_CKD_DATA[[#All],[NIS08-CKD04]],WF_CKD_DATA[[#All],[OrgID]],V20,WF_CKD_DATA[[#All],[Rel_D]],Locations!$E$17)","v":219},0.58870967741935487]
[null,null,null,null,"2023-12-01",{"$f":"IF(SUMIFS(WF_CKD_DATA[[#All],[08-CKD]],WF_CKD_DATA[[#All],[OrgID]],$B$4,WF_CKD_DATA[[#All],[Rel_D]],E21)=0,#N/A,(SUMIFS(WF_CKD_DATA[[#All],[08-CKD]],WF_CKD_DATA[[#All],[OrgID]],$B$4,WF_CKD_DATA[[#All],[Rel_D]],E21)))","v":483},{"$f":"IF(SUMIFS(INDIRECT(\"WF_CKD_DATA[[#All],[\"&$B$2&\"]]\"),WF_CKD_DATA[[#All],[OrgID]],$B$4,WF_CKD_DATA[[#All],[Rel_D]],TRENDS!E21)=0,#N/A,(SUMIFS(INDIRECT(\"WF_CKD_DATA[[#All],[\"&$B$2&\"]]\"),WF_CKD_DATA[[#All],[OrgID]],$B$4,WF_CKD_DATA[[#All],[Rel_D]],TRENDS!E21)))","v":184},{"$f":"SUMIFS(INDIRECT(\"WF_CKD_DATA[[#All],[\"&$B$2&\"]]\"),#REF!,$B$4,#REF!,TRENDS!C21)","v":{"$error":"#REF!"}},null,null,null,null,null,null,null,null,null,null,null,null,"Churchill Medical Centre","F86627",{"$f":"SUMIFS(WF_CKD_DATA[[#All],[08-CKD]],WF_CKD_DATA[[#All],[OrgID]],V21,WF_CKD_DATA[[#All],[Rel_D]],Locations!$E$17)","v":505},{"$f":"SUMIFS(WF_CKD_DATA[[#All],[NIS08-CKD01]],WF_CKD_DATA[[#All],[OrgID]],V21,WF_CKD_DATA[[#All],[Rel_D]],Locations!$E$17)","v":429},{"$f":"X21/W21","v":0.84950495049504948},{"$f":"SUMIFS(WF_CKD_DATA[[#All],[NIS08-CKD02]],WF_CKD_DATA[[#All],[OrgID]],V21,WF_CKD_DATA[[#All],[Rel_D]],Locations!$E$17)","v":307},0.60792079207920791,{"$f":"SUMIFS(WF_CKD_DATA[[#All],[NIS08-CKD03]],WF_CKD_DATA[[#All],[OrgID]],V21,WF_CKD_DATA[[#All],[Rel_D]],Locations!$E$17)","v":373},0.7386138613861386,{"$f":"SUMIFS(WF_CKD_DATA[[#All],[NIS08-CKD04]],WF_CKD_DATA[[#All],[OrgID]],V21,WF_CKD_DATA[[#All],[Rel_D]],Locations!$E$17)","v":264},0.61538461538461542]
[null,null,null,null,"2024-01-01",{"$f":"IF(SUMIFS(WF_CKD_DATA[[#All],[08-CKD]],WF_CKD_DATA[[#All],[OrgID]],$B$4,WF_CKD_DATA[[#All],[Rel_D]],E22)=0,#N/A,(SUMIFS(WF_CKD_DATA[[#All],[08-CKD]],WF_CKD_DATA[[#All],[OrgID]],$B$4,WF_CKD_DATA[[#All],[Rel_D]],E22)))","v":487},{"$f":"IF(SUMIFS(INDIRECT(\"WF_CKD_DATA[[#All],[\"&$B$2&\"]]\"),WF_CKD_DATA[[#All],[OrgID]],$B$4,WF_CKD_DATA[[#All],[Rel_D]],TRENDS!E22)=0,#N/A,(SUMIFS(INDIRECT(\"WF_CKD_DATA[[#All],[\"&$B$2&\"]]\"),WF_CKD_DATA[[#All],[OrgID]],$B$4,WF_CKD_DATA[[#All],[Rel_D]],TRENDS!E22)))","v":205},{"$f":"SUMIFS(INDIRECT(\"WF_CKD_DATA[[#All],[\"&$B$2&\"]]\"),#REF!,$B$4,#REF!,TRENDS!C22)","v":{"$error":"#REF!"}},null,null,null,null,null,null,null,null,null,null,null,null,"The Ridgeway Surgery","F86078",{"$f":"SUMIFS(WF_CKD_DATA[[#All],[08-CKD]],WF_CKD_DATA[[#All],[OrgID]],V22,WF_CKD_DATA[[#All],[Rel_D]],Locations!$E$17)","v":311},{"$f":"SUMIFS(WF_CKD_DATA[[#All],[NIS08-CKD01]],WF_CKD_DATA[[#All],[OrgID]],V22,WF_CKD_DATA[[#All],[Rel_D]],Locations!$E$17)","v":253},0.81350482315112538,{"$f":"SUMIFS(WF_CKD_DATA[[#All],[NIS08-CKD02]],WF_CKD_DATA[[#All],[OrgID]],V22,WF_CKD_DATA[[#All],[Rel_D]],Locations!$E$17)","v":167},0.53697749196141475,{"$f":"SUMIFS(WF_CKD_DATA[[#All],[NIS08-CKD03]],WF_CKD_DATA[[#All],[OrgID]],V22,WF_CKD_DATA[[#All],[Rel_D]],Locations!$E$17)","v":212},0.68167202572347263,{"$f":"SUMIFS(WF_CKD_DATA[[#All],[NIS08-CKD04]],WF_CKD_DATA[[#All],[OrgID]],V22,WF_CKD_DATA[[#All],[Rel_D]],Locations!$E$17)","v":97},0.38339920948616601]
[null,null,null,null,"2024-02-01",{"$f":"IF(SUMIFS(WF_CKD_DATA[[#All],[08-CKD]],WF_CKD_DATA[[#All],[OrgID]],$B$4,WF_CKD_DATA[[#All],[Rel_D]],E23)=0,#N/A,(SUMIFS(WF_CKD_DATA[[#All],[08-CKD]],WF_CKD_DATA[[#All],[OrgID]],$B$4,WF_CKD_DATA[[#All],[Rel_D]],E23)))","v":487},{"$f":"IF(SUMIFS(INDIRECT(\"WF_CKD_DATA[[#All],[\"&$B$2&\"]]\"),WF_CKD_DATA[[#All],[OrgID]],$B$4,WF_CKD_DATA[[#All],[Rel_D]],TRENDS!E23)=0,#N/A,(SUMIFS(INDIRECT(\"WF_CKD_DATA[[#All],[\"&$B$2&\"]]\"),WF_CKD_DATA[[#All],[OrgID]],$B$4,WF_CKD_DATA[[#All],[Rel_D]],TRENDS!E23)))","v":227},{"$f":"SUMIFS(INDIRECT(\"WF_CKD_DATA[[#All],[\"&$B$2&\"]]\"),#REF!,$B$4,#REF!,TRENDS!C23)","v":{"$error":"#REF!"}},null,null,null,null,null,null,null,null,null,null,null,null,"Old Church Surgery","F86616",{"$f":"SUMIFS(WF_CKD_DATA[[#All],[08-CKD]],WF_CKD_DATA[[#All],[OrgID]],V23,WF_CKD_DATA[[#All],[Rel_D]],Locations!$E$17)","v":292},{"$f":"SUMIFS(WF_CKD_DATA[[#All],[NIS08-CKD01]],WF_CKD_DATA[[#All],[OrgID]],V23,WF_CKD_DATA[[#All],[Rel_D]],Locations!$E$17)","v":249},0.85273972602739723,{"$f":"SUMIFS(WF_CKD_DATA[[#All],[NIS08-CKD02]],WF_CKD_DATA[[#All],[OrgID]],V23,WF_CKD_DATA[[#All],[Rel_D]],Locations!$E$17)","v":196},0.67123287671232879,{"$f":"SUMIFS(WF_CKD_DATA[[#All],[NIS08-CKD03]],WF_CKD_DATA[[#All],[OrgID]],V23,WF_CKD_DATA[[#All],[Rel_D]],Locations!$E$17)","v":211},0.7226027397260274,{"$f":"SUMIFS(WF_CKD_DATA[[#All],[NIS08-CKD04]],WF_CKD_DATA[[#All],[OrgID]],V23,WF_CKD_DATA[[#All],[Rel_D]],Locations!$E$17)","v":144},0.57831325301204817]
[null,null,null,null,"2024-03-01",{"$f":"IF(SUMIFS(WF_CKD_DATA[[#All],[08-CKD]],WF_CKD_DATA[[#All],[OrgID]],$B$4,WF_CKD_DATA[[#All],[Rel_D]],E24)=0,#N/A,(SUMIFS(WF_CKD_DATA[[#All],[08-CKD]],WF_CKD_DATA[[#All],[OrgID]],$B$4,WF_CKD_DATA[[#All],[Rel_D]],E24)))","v":505},{"$f":"IF(SUMIFS(INDIRECT(\"WF_CKD_DATA[[#All],[\"&$B$2&\"]]\"),WF_CKD_DATA[[#All],[OrgID]],$B$4,WF_CKD_DATA[[#All],[Rel_D]],TRENDS!E24)=0,#N/A,(SUMIFS(INDIRECT(\"WF_CKD_DATA[[#All],[\"&$B$2&\"]]\"),WF_CKD_DATA[[#All],[OrgID]],$B$4,WF_CKD_DATA[[#All],[Rel_D]],TRENDS!E24)))","v":253},{"$f":"SUMIFS(INDIRECT(\"WF_CKD_DATA[[#All],[\"&$B$2&\"]]\"),#REF!,$B$4,#REF!,TRENDS!C24)","v":{"$error":"#REF!"}},null,null,null,null,null,null,null,null,null,null,null,null,"The Manor Practice","F86011",{"$f":"SUMIFS(WF_CKD_DATA[[#All],[08-CKD]],WF_CKD_DATA[[#All],[OrgID]],V24,WF_CKD_DATA[[#All],[Rel_D]],Locations!$E$17)","v":213},{"$f":"SUMIFS(WF_CKD_DATA[[#All],[NIS08-CKD01]],WF_CKD_DATA[[#All],[OrgID]],V24,WF_CKD_DATA[[#All],[Rel_D]],Locations!$E$17)","v":194},0.91079812206572774,{"$f":"SUMIFS(WF_CKD_DATA[[#All],[NIS08-CKD02]],WF_CKD_DATA[[#All],[OrgID]],V24,WF_CKD_DATA[[#All],[Rel_D]],Locations!$E$17)","v":135},0.63380281690140849,{"$f":"SUMIFS(WF_CKD_DATA[[#All],[NIS08-CKD03]],WF_CKD_DATA[[#All],[OrgID]],V24,WF_CKD_DATA[[#All],[Rel_D]],Locations!$E$17)","v":146},0.68544600938967137,{"$f":"SUMIFS(WF_CKD_DATA[[#All],[NIS08-CKD04]],WF_CKD_DATA[[#All],[OrgID]],V24,WF_CKD_DATA[[#All],[Rel_D]],Locations!$E$17)","v":111},0.57216494845360821]
[null,null,null,null,"2024-04-01",{"$f":"IF(SUMIFS(WF_CKD_DATA[[#All],[08-CKD]],WF_CKD_DATA[[#All],[OrgID]],$B$4,WF_CKD_DATA[[#All],[Rel_D]],E25)=0,#N/A,(SUMIFS(WF_CKD_DATA[[#All],[08-CKD]],WF_CKD_DATA[[#All],[OrgID]],$B$4,WF_CKD_DATA[[#All],[Rel_D]],E25)))","v":505},{"$f":"IF(SUMIFS(INDIRECT(\"WF_CKD_DATA[[#All],[\"&$B$2&\"]]\"),WF_CKD_DATA[[#All],[OrgID]],$B$4,WF_CKD_DATA[[#All],[Rel_D]],TRENDS!E25)=0,#N/A,(SUMIFS(INDIRECT(\"WF_CKD_DATA[[#All],[\"&$B$2&\"]]\"),WF_CKD_DATA[[#All],[OrgID]],$B$4,WF_CKD_DATA[[#All],[Rel_D]],TRENDS!E25)))","v":264},{"$f":"SUMIFS(INDIRECT(\"WF_CKD_DATA[[#All],[\"&$B$2&\"]]\"),#REF!,$B$4,#REF!,TRENDS!C25)","v":{"$error":"#REF!"}},null,null,null,null,null,null,null,null,null,null,null,null,"Sma Medical Centre","F86038",{"$f":"SUMIFS(WF_CKD_DATA[[#All],[08-CKD]],WF_CKD_DATA[[#All],[OrgID]],V25,WF_CKD_DATA[[#All],[Rel_D]],Locations!$E$17)","v":209},{"$f":"SUMIFS(WF_CKD_DATA[[#All],[NIS08-CKD01]],WF_CKD_DATA[[#All],[OrgID]],V25,WF_CKD_DATA[[#All],[Rel_D]],Locations!$E$17)","v":203},0.9712918660287081,{"$f":"SUMIFS(WF_CKD_DATA[[#All],[NIS08-CKD02]],WF_CKD_DATA[[#All],[OrgID]],V25,WF_CKD_DATA[[#All],[Rel_D]],Locations!$E$17)","v":161},0.77033492822966509,{"$f":"SUMIFS(WF_CKD_DATA[[#All],[NIS08-CKD03]],WF_CKD_DATA[[#All],[OrgID]],V25,WF_CKD_DATA[[#All],[Rel_D]],Locations!$E$17)","v":174},{"$f":"IFERROR(AB25/W25,\"-\")","v":0.83253588516746413},{"$f":"SUMIFS(WF_CKD_DATA[[#All],[NIS08-CKD04]],WF_CKD_DATA[[#All],[OrgID]],V25,WF_CKD_DATA[[#All],[Rel_D]],Locations!$E$17)","v":134},0.66009852216748766]
[null,null,null,null,"2024-05-01",{"$f":"IF(SUMIFS(WF_CKD_DATA[[#All],[08-CKD]],WF_CKD_DATA[[#All],[OrgID]],$B$4,WF_CKD_DATA[[#All],[Rel_D]],E26)=0,#N/A,(SUMIFS(WF_CKD_DATA[[#All],[08-CKD]],WF_CKD_DATA[[#All],[OrgID]],$B$4,WF_CKD_DATA[[#All],[Rel_D]],E26)))","v":{"$error":"#N/A"}},{"$f":"IF(SUMIFS(INDIRECT(\"WF_CKD_DATA[[#All],[\"&$B$2&\"]]\"),WF_CKD_DATA[[#All],[OrgID]],$B$4,WF_CKD_DATA[[#All],[Rel_D]],TRENDS!E26)=0,#N/A,(SUMIFS(INDIRECT(\"WF_CKD_DATA[[#All],[\"&$B$2&\"]]\"),WF_CKD_DATA[[#All],[OrgID]],$B$4,WF_CKD_DATA[[#All],[Rel_D]],TRENDS!E26)))","v":{"$error":"#N/A"}},null,null,null,null,null,null,null,null,null,null,null,null,null,null,null,{"$f":"SUMIFS(WF_CKD_DATA[[#All],[08-CKD]],WF_CKD_DATA[[#All],[OrgID]],V26,WF_CKD_DATA[[#All],[Rel_D]],Locations!$E$17)","v":0},{"$f":"SUMIFS(WF_CKD_DATA[[#All],[NIS08-CKD01]],WF_CKD_DATA[[#All],[OrgID]],V26,WF_CKD_DATA[[#All],[Rel_D]],Locations!$E$17)","v":0},null,{"$f":"SUMIFS(WF_CKD_DATA[[#All],[NIS08-CKD02]],WF_CKD_DATA[[#All],[OrgID]],V26,WF_CKD_DATA[[#All],[Rel_D]],Locations!$E$17)","v":0},"-",{"$f":"SUMIFS(WF_CKD_DATA[[#All],[NIS08-CKD03]],WF_CKD_DATA[[#All],[OrgID]],V26,WF_CKD_DATA[[#All],[Rel_D]],Locations!$E$17)","v":0},null,{"$f":"SUMIFS(WF_CKD_DATA[[#All],[NIS08-CKD04]],WF_CKD_DATA[[#All],[OrgID]],V26,WF_CKD_DATA[[#All],[Rel_D]],Locations!$E$17)","v":0},"-"]
[null,null,null,null,null,null,null,null,null,null,null,null,null,null,null,null,null,null,null,null,"Leyton Healthcare (Oliver Road)","F86074",{"$f":"SUMIFS(WF_CKD_DATA[[#All],[08-CKD]],WF_CKD_DATA[[#All],[OrgID]],V27,WF_CKD_DATA[[#All],[Rel_D]],Locations!$E$17)","v":389},{"$f":"SUMIFS(WF_CKD_DATA[[#All],[NIS08-CKD01]],WF_CKD_DATA[[#All],[OrgID]],V27,WF_CKD_DATA[[#All],[Rel_D]],Locations!$E$17)","v":303},{"$f":"IFERROR(X27/W27,\"-\")","v":0.77892030848329052},{"$f":"SUMIFS(WF_CKD_DATA[[#All],[NIS08-CKD02]],WF_CKD_DATA[[#All],[OrgID]],V27,WF_CKD_DATA[[#All],[Rel_D]],Locations!$E$17)","v":283},0.72750642673521848,{"$f":"SUMIFS(WF_CKD_DATA[[#All],[NIS08-CKD03]],WF_CKD_DATA[[#All],[OrgID]],V27,WF_CKD_DATA[[#All],[Rel_D]],Locations!$E$17)","v":270},0.6940874035989717,{"$f":"SUMIFS(WF_CKD_DATA[[#All],[NIS08-CKD04]],WF_CKD_DATA[[#All],[OrgID]],V27,WF_CKD_DATA[[#All],[Rel_D]],Locations!$E$17)","v":166},0.54785478547854782]
[null,null,null,null,null,null,null,null,null,null,null,null,null,null,null,null,null,null,null,null,"The Allum Medical Centre","F86036",{"$f":"SUMIFS(WF_CKD_DATA[[#All],[08-CKD]],WF_CKD_DATA[[#All],[OrgID]],V28,WF_CKD_DATA[[#All],[Rel_D]],Locations!$E$17)","v":289},{"$f":"SUMIFS(WF_CKD_DATA[[#All],[NIS08-CKD01]],WF_CKD_DATA[[#All],[OrgID]],V28,WF_CKD_DATA[[#All],[Rel_D]],Locations!$E$17)","v":209},{"$f":"X28/W28","v":0.72318339100346019},{"$f":"SUMIFS(WF_CKD_DATA[[#All],[NIS08-CKD02]],WF_CKD_DATA[[#All],[OrgID]],V28,WF_CKD_DATA[[#All],[Rel_D]],Locations!$E$17)","v":185},0.64013840830449831,{"$f":"SUMIFS(WF_CKD_DATA[[#All],[NIS08-CKD03]],WF_CKD_DATA[[#All],[OrgID]],V28,WF_CKD_DATA[[#All],[Rel_D]],Locations!$E$17)","v":210},0.72664359861591699,{"$f":"SUMIFS(WF_CKD_DATA[[#All],[NIS08-CKD04]],WF_CKD_DATA[[#All],[OrgID]],V28,WF_CKD_DATA[[#All],[Rel_D]],Locations!$E$17)","v":104},0.49760765550239233]
[null,null,null,null,null,null,null,null,null,null,null,null,null,null,null,null,null,null,null,null," Crawley Road Medical Centre","F86044",{"$f":"SUMIFS(WF_CKD_DATA[[#All],[08-CKD]],WF_CKD_DATA[[#All],[OrgID]],V29,WF_CKD_DATA[[#All],[Rel_D]],Locations!$E$17)","v":135},{"$f":"SUMIFS(WF_CKD_DATA[[#All],[NIS08-CKD01]],WF_CKD_DATA[[#All],[OrgID]],V29,WF_CKD_DATA[[#All],[Rel_D]],Locations!$E$17)","v":121},0.89629629629629626,{"$f":"SUMIFS(WF_CKD_DATA[[#All],[NIS08-CKD02]],WF_CKD_DATA[[#All],[OrgID]],V29,WF_CKD_DATA[[#All],[Rel_D]],Locations!$E$17)","v":96},0.71111111111111114,{"$f":"SUMIFS(WF_CKD_DATA[[#All],[NIS08-CKD03]],WF_CKD_DATA[[#All],[OrgID]],V29,WF_CKD_DATA[[#All],[Rel_D]],Locations!$E$17)","v":106},0.78518518518518521,{"$f":"SUMIFS(WF_CKD_DATA[[#All],[NIS08-CKD04]],WF_CKD_DATA[[#All],[OrgID]],V29,WF_CKD_DATA[[#All],[Rel_D]],Locations!$E$17)","v":80},0.66115702479338845]
[null,null,null,null,null,null,null,null,null,null,null,null,null,null,null,null,null,null,null,null,"Francis Road Medical Centre","F86696",{"$f":"SUMIFS(WF_CKD_DATA[[#All],[08-CKD]],WF_CKD_DATA[[#All],[OrgID]],V30,WF_CKD_DATA[[#All],[Rel_D]],Locations!$E$17)","v":115},{"$f":"SUMIFS(WF_CKD_DATA[[#All],[NIS08-CKD01]],WF_CKD_DATA[[#All],[OrgID]],V30,WF_CKD_DATA[[#All],[Rel_D]],Locations!$E$17)","v":103},0.89565217391304353,{"$f":"SUMIFS(WF_CKD_DATA[[#All],[NIS08-CKD02]],WF_CKD_DATA[[#All],[OrgID]],V30,WF_CKD_DATA[[#All],[Rel_D]],Locations!$E$17)","v":64},0.55652173913043479,{"$f":"SUMIFS(WF_CKD_DATA[[#All],[NIS08-CKD03]],WF_CKD_DATA[[#All],[OrgID]],V30,WF_CKD_DATA[[#All],[Rel_D]],Locations!$E$17)","v":95},0.82608695652173914,{"$f":"SUMIFS(WF_CKD_DATA[[#All],[NIS08-CKD04]],WF_CKD_DATA[[#All],[OrgID]],V30,WF_CKD_DATA[[#All],[Rel_D]],Locations!$E$17)","v":40},0.38834951456310679]
[null,null,null,null,null,null,null,null,null,null,null,null,null,null,null,null,null,null,null,null,"Hampton Medical Centre","F86712",{"$f":"SUMIFS(WF_CKD_DATA[[#All],[08-CKD]],WF_CKD_DATA[[#All],[OrgID]],V31,WF_CKD_DATA[[#All],[Rel_D]],Locations!$E$17)","v":66},{"$f":"SUMIFS(WF_CKD_DATA[[#All],[NIS08-CKD01]],WF_CKD_DATA[[#All],[OrgID]],V31,WF_CKD_DATA[[#All],[Rel_D]],Locations!$E$17)","v":63},0.95454545454545459,{"$f":"SUMIFS(WF_CKD_DATA[[#All],[NIS08-CKD02]],WF_CKD_DATA[[#All],[OrgID]],V31,WF_CKD_DATA[[#All],[Rel_D]],Locations!$E$17)","v":52},0.78787878787878785,{"$f":"SUMIFS(WF_CKD_DATA[[#All],[NIS08-CKD03]],WF_CKD_DATA[[#All],[OrgID]],V31,WF_CKD_DATA[[#All],[Rel_D]],Locations!$E$17)","v":54},0.81818181818181823,{"$f":"SUMIFS(WF_CKD_DATA[[#All],[NIS08-CKD04]],WF_CKD_DATA[[#All],[OrgID]],V31,WF_CKD_DATA[[#All],[Rel_D]],Locations!$E$17)","v":53},0.84126984126984128]
[null,null,null,null,null,null,null,null,null,null,null,null,null,null,null,null,null,null,null,null,"Lime Tree Surgery","F86650",{"$f":"SUMIFS(WF_CKD_DATA[[#All],[08-CKD]],WF_CKD_DATA[[#All],[OrgID]],V32,WF_CKD_DATA[[#All],[Rel_D]],Locations!$E$17)","v":160},{"$f":"SUMIFS(WF_CKD_DATA[[#All],[NIS08-CKD01]],WF_CKD_DATA[[#All],[OrgID]],V32,WF_CKD_DATA[[#All],[Rel_D]],Locations!$E$17)","v":132},0.82499999999999996,{"$f":"SUMIFS(WF_CKD_DATA[[#All],[NIS08-CKD02]],WF_CKD_DATA[[#All],[OrgID]],V32,WF_CKD_DATA[[#All],[Rel_D]],Locations!$E$17)","v":85},0.53125,{"$f":"SUMIFS(WF_CKD_DATA[[#All],[NIS08-CKD03]],WF_CKD_DATA[[#All],[OrgID]],V32,WF_CKD_DATA[[#All],[Rel_D]],Locations!$E$17)","v":126},0.78749999999999998,{"$f":"SUMIFS(WF_CKD_DATA[[#All],[NIS08-CKD04]],WF_CKD_DATA[[#All],[OrgID]],V32,WF_CKD_DATA[[#All],[Rel_D]],Locations!$E$17)","v":78},0.59090909090909094]
[null,null,null,null,null,null,null,null,null,null,null,null,null,null,null,null,null,null,null,null,"The Lyndhurst Surgery","F86088",{"$f":"SUMIFS(WF_CKD_DATA[[#All],[08-CKD]],WF_CKD_DATA[[#All],[OrgID]],V33,WF_CKD_DATA[[#All],[Rel_D]],Locations!$E$17)","v":117},{"$f":"SUMIFS(WF_CKD_DATA[[#All],[NIS08-CKD01]],WF_CKD_DATA[[#All],[OrgID]],V33,WF_CKD_DATA[[#All],[Rel_D]],Locations!$E$17)","v":111},0.94871794871794868,{"$f":"SUMIFS(WF_CKD_DATA[[#All],[NIS08-CKD02]],WF_CKD_DATA[[#All],[OrgID]],V33,WF_CKD_DATA[[#All],[Rel_D]],Locations!$E$17)","v":78},0.66666666666666663,{"$f":"SUMIFS(WF_CKD_DATA[[#All],[NIS08-CKD03]],WF_CKD_DATA[[#All],[OrgID]],V33,WF_CKD_DATA[[#All],[Rel_D]],Locations!$E$17)","v":95},0.81196581196581197,{"$f":"SUMIFS(WF_CKD_DATA[[#All],[NIS08-CKD04]],WF_CKD_DATA[[#All],[OrgID]],V33,WF_CKD_DATA[[#All],[Rel_D]],Locations!$E$17)","v":57},0.51351351351351349]
[null,null,null,null,null,null,null,null,null,null,null,null,null,null,null,null,null,null,null,null,"The Ecclesbourne Practice","F86018",{"$f":"SUMIFS(WF_CKD_DATA[[#All],[08-CKD]],WF_CKD_DATA[[#All],[OrgID]],V34,WF_CKD_DATA[[#All],[Rel_D]],Locations!$E$17)","v":488},{"$f":"SUMIFS(WF_CKD_DATA[[#All],[NIS08-CKD01]],WF_CKD_DATA[[#All],[OrgID]],V34,WF_CKD_DATA[[#All],[Rel_D]],Locations!$E$17)","v":449},{"$f":"IFERROR(X34/W34,\"-\")","v":0.92008196721311475},{"$f":"SUMIFS(WF_CKD_DATA[[#All],[NIS08-CKD02]],WF_CKD_DATA[[#All],[OrgID]],V34,WF_CKD_DATA[[#All],[Rel_D]],Locations!$E$17)","v":353},0.72336065573770492,{"$f":"SUMIFS(WF_CKD_DATA[[#All],[NIS08-CKD03]],WF_CKD_DATA[[#All],[OrgID]],V34,WF_CKD_DATA[[#All],[Rel_D]],Locations!$E$17)","v":311},0.63729508196721307,{"$f":"SUMIFS(WF_CKD_DATA[[#All],[NIS08-CKD04]],WF_CKD_DATA[[#All],[OrgID]],V34,WF_CKD_DATA[[#All],[Rel_D]],Locations!$E$17)","v":274},0.61024498886414258]
[null,null,null,null,null,null,null,null,null,null,null,null,null,null,null,null,null,null,null,null,"Green Man Medical Centre","F86621",{"$f":"SUMIFS(WF_CKD_DATA[[#All],[08-CKD]],WF_CKD_DATA[[#All],[OrgID]],V35,WF_CKD_DATA[[#All],[Rel_D]],Locations!$E$17)","v":160},{"$f":"SUMIFS(WF_CKD_DATA[[#All],[NIS08-CKD01]],WF_CKD_DATA[[#All],[OrgID]],V35,WF_CKD_DATA[[#All],[Rel_D]],Locations!$E$17)","v":128},{"$f":"X35/W35","v":0.8},{"$f":"SUMIFS(WF_CKD_DATA[[#All],[NIS08-CKD02]],WF_CKD_DATA[[#All],[OrgID]],V35,WF_CKD_DATA[[#All],[Rel_D]],Locations!$E$17)","v":109},0.68125000000000002,{"$f":"SUMIFS(WF_CKD_DATA[[#All],[NIS08-CKD03]],WF_CKD_DATA[[#All],[OrgID]],V35,WF_CKD_DATA[[#All],[Rel_D]],Locations!$E$17)","v":153},0.95625000000000004,{"$f":"SUMIFS(WF_CKD_DATA[[#All],[NIS08-CKD04]],WF_CKD_DATA[[#All],[OrgID]],V35,WF_CKD_DATA[[#All],[Rel_D]],Locations!$E$17)","v":95},0.7421875]
[null,null,null,null,null,null,null,null,null,null,null,null,null,null,null,null,null,null,null,null,"High Road Surgery","F86045",{"$f":"SUMIFS(WF_CKD_DATA[[#All],[08-CKD]],WF_CKD_DATA[[#All],[OrgID]],V36,WF_CKD_DATA[[#All],[Rel_D]],Locations!$E$17)","v":50},{"$f":"SUMIFS(WF_CKD_DATA[[#All],[NIS08-CKD01]],WF_CKD_DATA[[#All],[OrgID]],V36,WF_CKD_DATA[[#All],[Rel_D]],Locations!$E$17)","v":48},0.96,{"$f":"SUMIFS(WF_CKD_DATA[[#All],[NIS08-CKD02]],WF_CKD_DATA[[#All],[OrgID]],V36,WF_CKD_DATA[[#All],[Rel_D]],Locations!$E$17)","v":32},0.64,{"$f":"SUMIFS(WF_CKD_DATA[[#All],[NIS08-CKD03]],WF_CKD_DATA[[#All],[OrgID]],V36,WF_CKD_DATA[[#All],[Rel_D]],Locations!$E$17)","v":39},0.78,{"$f":"SUMIFS(WF_CKD_DATA[[#All],[NIS08-CKD04]],WF_CKD_DATA[[#All],[OrgID]],V36,WF_CKD_DATA[[#All],[Rel_D]],Locations!$E$17)","v":36},0.75]
[null,null,null,null,null,null,null,null,null,null,null,null,null,null,null,null,null,null,null,null,"Kiyani Medical Practice","F86701",{"$f":"SUMIFS(WF_CKD_DATA[[#All],[08-CKD]],WF_CKD_DATA[[#All],[OrgID]],V37,WF_CKD_DATA[[#All],[Rel_D]],Locations!$E$17)","v":93},{"$f":"SUMIFS(WF_CKD_DATA[[#All],[NIS08-CKD01]],WF_CKD_DATA[[#All],[OrgID]],V37,WF_CKD_DATA[[#All],[Rel_D]],Locations!$E$17)","v":91},0.978494623655914,{"$f":"SUMIFS(WF_CKD_DATA[[#All],[NIS08-CKD02]],WF_CKD_DATA[[#All],[OrgID]],V37,WF_CKD_DATA[[#All],[Rel_D]],Locations!$E$17)","v":70},0.75268817204301075,{"$f":"SUMIFS(WF_CKD_DATA[[#All],[NIS08-CKD03]],WF_CKD_DATA[[#All],[OrgID]],V37,WF_CKD_DATA[[#All],[Rel_D]],Locations!$E$17)","v":90},0.967741935483871,{"$f":"SUMIFS(WF_CKD_DATA[[#All],[NIS08-CKD04]],WF_CKD_DATA[[#All],[OrgID]],V37,WF_CKD_DATA[[#All],[Rel_D]],Locations!$E$17)","v":80},0.87912087912087911]
[null,null,null,null,null,null,null,null,null,null,null,null,null,null,null,null,null,null,null,null,"LL Medical Care (Agarwal & Agrwal Practice)","F86625",{"$f":"SUMIFS(WF_CKD_DATA[[#All],[08-CKD]],WF_CKD_DATA[[#All],[OrgID]],V38,WF_CKD_DATA[[#All],[Rel_D]],Locations!$E$17)","v":147},{"$f":"SUMIFS(WF_CKD_DATA[[#All],[NIS08-CKD01]],WF_CKD_DATA[[#All],[OrgID]],V38,WF_CKD_DATA[[#All],[Rel_D]],Locations!$E$17)","v":125},0.85034013605442171,{"$f":"SUMIFS(WF_CKD_DATA[[#All],[NIS08-CKD02]],WF_CKD_DATA[[#All],[OrgID]],V38,WF_CKD_DATA[[#All],[Rel_D]],Locations!$E$17)","v":111},0.75510204081632648,{"$f":"SUMIFS(WF_CKD_DATA[[#All],[NIS08-CKD03]],WF_CKD_DATA[[#All],[OrgID]],V38,WF_CKD_DATA[[#All],[Rel_D]],Locations!$E$17)","v":119},0.80952380952380953,{"$f":"SUMIFS(WF_CKD_DATA[[#All],[NIS08-CKD04]],WF_CKD_DATA[[#All],[OrgID]],V38,WF_CKD_DATA[[#All],[Rel_D]],Locations!$E$17)","v":87},0.69599999999999995]
[null,null,null,null,null,null,null,null,null,null,null,null,null,null,null,null,null,null,null,null,"The Harrow Road Surgery","F86666",{"$f":"SUMIFS(WF_CKD_DATA[[#All],[08-CKD]],WF_CKD_DATA[[#All],[OrgID]],V39,WF_CKD_DATA[[#All],[Rel_D]],Locations!$E$17)","v":297},{"$f":"SUMIFS(WF_CKD_DATA[[#All],[NIS08-CKD01]],WF_CKD_DATA[[#All],[OrgID]],V39,WF_CKD_DATA[[#All],[Rel_D]],Locations!$E$17)","v":285},0.95959595959595956,{"$f":"SUMIFS(WF_CKD_DATA[[#All],[NIS08-CKD02]],WF_CKD_DATA[[#All],[OrgID]],V39,WF_CKD_DATA[[#All],[Rel_D]],Locations!$E$17)","v":194},0.65319865319865322,{"$f":"SUMIFS(WF_CKD_DATA[[#All],[NIS08-CKD03]],WF_CKD_DATA[[#All],[OrgID]],V39,WF_CKD_DATA[[#All],[Rel_D]],Locations!$E$17)","v":226},0.76094276094276092,{"$f":"SUMIFS(WF_CKD_DATA[[#All],[NIS08-CKD04]],WF_CKD_DATA[[#All],[OrgID]],V39,WF_CKD_DATA[[#All],[Rel_D]],Locations!$E$17)","v":226},0.7929824561403509]
[null,null,null,null,null,null,null,null,null,null,null,null,null,null,null,null,null,null,null,null,"The Langthorne Sharma Family Practice","F86705",{"$f":"SUMIFS(WF_CKD_DATA[[#All],[08-CKD]],WF_CKD_DATA[[#All],[OrgID]],V40,WF_CKD_DATA[[#All],[Rel_D]],Locations!$E$17)","v":64},{"$f":"SUMIFS(WF_CKD_DATA[[#All],[NIS08-CKD01]],WF_CKD_DATA[[#All],[OrgID]],V40,WF_CKD_DATA[[#All],[Rel_D]],Locations!$E$17)","v":63},0.984375,{"$f":"SUMIFS(WF_CKD_DATA[[#All],[NIS08-CKD02]],WF_CKD_DATA[[#All],[OrgID]],V40,WF_CKD_DATA[[#All],[Rel_D]],Locations!$E$17)","v":46},0.71875,{"$f":"SUMIFS(WF_CKD_DATA[[#All],[NIS08-CKD03]],WF_CKD_DATA[[#All],[OrgID]],V40,WF_CKD_DATA[[#All],[Rel_D]],Locations!$E$17)","v":59},0.921875,{"$f":"SUMIFS(WF_CKD_DATA[[#All],[NIS08-CKD04]],WF_CKD_DATA[[#All],[OrgID]],V40,WF_CKD_DATA[[#All],[Rel_D]],Locations!$E$17)","v":49},0.77777777777777779]
[null,null,null,null,null,null,null,null,null,null,null,null,null,null,null,null,null,null,null,null,"Addison Road Medical Practice","F86607",{"$f":"SUMIFS(WF_CKD_DATA[[#All],[08-CKD]],WF_CKD_DATA[[#All],[OrgID]],V41,WF_CKD_DATA[[#All],[Rel_D]],Locations!$E$17)","v":297},{"$f":"SUMIFS(WF_CKD_DATA[[#All],[NIS08-CKD01]],WF_CKD_DATA[[#All],[OrgID]],V41,WF_CKD_DATA[[#All],[Rel_D]],Locations!$E$17)","v":283},0.95286195286195285,{"$f":"SUMIFS(WF_CKD_DATA[[#All],[NIS08-CKD02]],WF_CKD_DATA[[#All],[OrgID]],V41,WF_CKD_DATA[[#All],[Rel_D]],Locations!$E$17)","v":179},0.60269360269360273,{"$f":"SUMIFS(WF_CKD_DATA[[#All],[NIS08-CKD03]],WF_CKD_DATA[[#All],[OrgID]],V41,WF_CKD_DATA[[#All],[Rel_D]],Locations!$E$17)","v":219},0.73737373737373735,{"$f":"SUMIFS(WF_CKD_DATA[[#All],[NIS08-CKD04]],WF_CKD_DATA[[#All],[OrgID]],V41,WF_CKD_DATA[[#All],[Rel_D]],Locations!$E$17)","v":187},0.66077738515901063]
[null,null,null,null,null,null,null,null,null,null,null,null,null,null,null,null,null,null,null,null,"Claremont Medical Centre","F86708",{"$f":"SUMIFS(WF_CKD_DATA[[#All],[08-CKD]],WF_CKD_DATA[[#All],[OrgID]],V42,WF_CKD_DATA[[#All],[Rel_D]],Locations!$E$17)","v":62},{"$f":"SUMIFS(WF_CKD_DATA[[#All],[NIS08-CKD01]],WF_CKD_DATA[[#All],[OrgID]],V42,WF_CKD_DATA[[#All],[Rel_D]],Locations!$E$17)","v":61},0.9838709677419355,{"$f":"SUMIFS(WF_CKD_DATA[[#All],[NIS08-CKD02]],WF_CKD_DATA[[#All],[OrgID]],V42,WF_CKD_DATA[[#All],[Rel_D]],Locations!$E$17)","v":47},0.75806451612903225,{"$f":"SUMIFS(WF_CKD_DATA[[#All],[NIS08-CKD03]],WF_CKD_DATA[[#All],[OrgID]],V42,WF_CKD_DATA[[#All],[Rel_D]],Locations!$E$17)","v":51},0.82258064516129037,{"$f":"SUMIFS(WF_CKD_DATA[[#All],[NIS08-CKD04]],WF_CKD_DATA[[#All],[OrgID]],V42,WF_CKD_DATA[[#All],[Rel_D]],Locations!$E$17)","v":30},0.49180327868852458]
[null,null,null,null,null,null,null,null,null,null,null,null,null,null,null,null,null,null,null,null," The Firs","F86001",{"$f":"SUMIFS(WF_CKD_DATA[[#All],[08-CKD]],WF_CKD_DATA[[#All],[OrgID]],V43,WF_CKD_DATA[[#All],[Rel_D]],Locations!$E$17)","v":190},{"$f":"SUMIFS(WF_CKD_DATA[[#All],[NIS08-CKD01]],WF_CKD_DATA[[#All],[OrgID]],V43,WF_CKD_DATA[[#All],[Rel_D]],Locations!$E$17)","v":173},0.91052631578947374,{"$f":"SUMIFS(WF_CKD_DATA[[#All],[NIS08-CKD02]],WF_CKD_DATA[[#All],[OrgID]],V43,WF_CKD_DATA[[#All],[Rel_D]],Locations!$E$17)","v":112},0.58947368421052626,{"$f":"SUMIFS(WF_CKD_DATA[[#All],[NIS08-CKD03]],WF_CKD_DATA[[#All],[OrgID]],V43,WF_CKD_DATA[[#All],[Rel_D]],Locations!$E$17)","v":142},0.74736842105263157,{"$f":"SUMIFS(WF_CKD_DATA[[#All],[NIS08-CKD04]],WF_CKD_DATA[[#All],[OrgID]],V43,WF_CKD_DATA[[#All],[Rel_D]],Locations!$E$17)","v":86},0.49710982658959535]
[null,null,null,null,null,null,null,null,null,null,null,null,null,null,null,null,null,null,null,null,"Dr Dhital Practice","F86086",{"$f":"SUMIFS(WF_CKD_DATA[[#All],[08-CKD]],WF_CKD_DATA[[#All],[OrgID]],V44,WF_CKD_DATA[[#All],[Rel_D]],Locations!$E$17)","v":97},{"$f":"SUMIFS(WF_CKD_DATA[[#All],[NIS08-CKD01]],WF_CKD_DATA[[#All],[OrgID]],V44,WF_CKD_DATA[[#All],[Rel_D]],Locations!$E$17)","v":81},0.83505154639175261,{"$f":"SUMIFS(WF_CKD_DATA[[#All],[NIS08-CKD02]],WF_CKD_DATA[[#All],[OrgID]],V44,WF_CKD_DATA[[#All],[Rel_D]],Locations!$E$17)","v":54},0.55670103092783507,{"$f":"SUMIFS(WF_CKD_DATA[[#All],[NIS08-CKD03]],WF_CKD_DATA[[#All],[OrgID]],V44,WF_CKD_DATA[[#All],[Rel_D]],Locations!$E$17)","v":80},0.82474226804123707,{"$f":"SUMIFS(WF_CKD_DATA[[#All],[NIS08-CKD04]],WF_CKD_DATA[[#All],[OrgID]],V44,WF_CKD_DATA[[#All],[Rel_D]],Locations!$E$17)","v":55},0.67901234567901236]
[null,null,null,null,null,null,null,null,null,null,null,null,null,null,null,null,null,null,null,null,"Waltham Forest Community & Family Health Services Ltd","F86644",{"$f":"SUMIFS(WF_CKD_DATA[[#All],[08-CKD]],WF_CKD_DATA[[#All],[OrgID]],V45,WF_CKD_DATA[[#All],[Rel_D]],Locations!$E$17)","v":227},{"$f":"SUMIFS(WF_CKD_DATA[[#All],[NIS08-CKD01]],WF_CKD_DATA[[#All],[OrgID]],V45,WF_CKD_DATA[[#All],[Rel_D]],Locations!$E$17)","v":191},0.84140969162995594,{"$f":"SUMIFS(WF_CKD_DATA[[#All],[NIS08-CKD02]],WF_CKD_DATA[[#All],[OrgID]],V45,WF_CKD_DATA[[#All],[Rel_D]],Locations!$E$17)","v":140},0.61674008810572689,{"$f":"SUMIFS(WF_CKD_DATA[[#All],[NIS08-CKD03]],WF_CKD_DATA[[#All],[OrgID]],V45,WF_CKD_DATA[[#All],[Rel_D]],Locations!$E$17)","v":159},0.70044052863436124,{"$f":"SUMIFS(WF_CKD_DATA[[#All],[NIS08-CKD04]],WF_CKD_DATA[[#All],[OrgID]],V45,WF_CKD_DATA[[#All],[Rel_D]],Locations!$E$17)","v":109},0.5706806282722513]
[null,null,null,null,null,null,null,null,null,null,null,null,null,null,null,null,null,null,null,null,"Seymour Medical Centre","F86006",{"$f":"SUMIFS(WF_CKD_DATA[[#All],[08-CKD]],WF_CKD_DATA[[#All],[OrgID]],V46,WF_CKD_DATA[[#All],[Rel_D]],Locations!$E$17)","v":140},{"$f":"SUMIFS(WF_CKD_DATA[[#All],[NIS08-CKD01]],WF_CKD_DATA[[#All],[OrgID]],V46,WF_CKD_DATA[[#All],[Rel_D]],Locations!$E$17)","v":93},0.66428571428571426,{"$f":"SUMIFS(WF_CKD_DATA[[#All],[NIS08-CKD02]],WF_CKD_DATA[[#All],[OrgID]],V46,WF_CKD_DATA[[#All],[Rel_D]],Locations!$E$17)","v":78},0.55714285714285716,{"$f":"SUMIFS(WF_CKD_DATA[[#All],[NIS08-CKD03]],WF_CKD_DATA[[#All],[OrgID]],V46,WF_CKD_DATA[[#All],[Rel_D]],Locations!$E$17)","v":96},0.68571428571428572,{"$f":"SUMIFS(WF_CKD_DATA[[#All],[NIS08-CKD04]],WF_CKD_DATA[[#All],[OrgID]],V46,WF_CKD_DATA[[#All],[Rel_D]],Locations!$E$17)","v":42},0.45161290322580644]
[null,null,null,null,null,null,null,null,null,null,null,null,null,null,null,null,null,null,null,null," Queens Road Medical Centre","F86030",{"$f":"SUMIFS(WF_CKD_DATA[[#All],[08-CKD]],WF_CKD_DATA[[#All],[OrgID]],V47,WF_CKD_DATA[[#All],[Rel_D]],Locations!$E$17)","v":174},{"$f":"SUMIFS(WF_CKD_DATA[[#All],[NIS08-CKD01]],WF_CKD_DATA[[#All],[OrgID]],V47,WF_CKD_DATA[[#All],[Rel_D]],Locations!$E$17)","v":162},0.93103448275862066,{"$f":"SUMIFS(WF_CKD_DATA[[#All],[NIS08-CKD02]],WF_CKD_DATA[[#All],[OrgID]],V47,WF_CKD_DATA[[#All],[Rel_D]],Locations!$E$17)","v":115},0.66091954022988508,{"$f":"SUMIFS(WF_CKD_DATA[[#All],[NIS08-CKD03]],WF_CKD_DATA[[#All],[OrgID]],V47,WF_CKD_DATA[[#All],[Rel_D]],Locations!$E$17)","v":147},0.84482758620689657,{"$f":"SUMIFS(WF_CKD_DATA[[#All],[NIS08-CKD04]],WF_CKD_DATA[[#All],[OrgID]],V47,WF_CKD_DATA[[#All],[Rel_D]],Locations!$E$17)","v":118},0.72839506172839508]
[null,null,null,null,null,null,null,null,null,null,null,null,null,null,null,null,null,null,null,null,"Grove Surgery","F86062",{"$f":"SUMIFS(WF_CKD_DATA[[#All],[08-CKD]],WF_CKD_DATA[[#All],[OrgID]],V48,WF_CKD_DATA[[#All],[Rel_D]],Locations!$E$17)","v":156},{"$f":"SUMIFS(WF_CKD_DATA[[#All],[NIS08-CKD01]],WF_CKD_DATA[[#All],[OrgID]],V48,WF_CKD_DATA[[#All],[Rel_D]],Locations!$E$17)","v":114},0.73076923076923073,{"$f":"SUMIFS(WF_CKD_DATA[[#All],[NIS08-CKD02]],WF_CKD_DATA[[#All],[OrgID]],V48,WF_CKD_DATA[[#All],[Rel_D]],Locations!$E$17)","v":103},0.66025641025641024,{"$f":"SUMIFS(WF_CKD_DATA[[#All],[NIS08-CKD03]],WF_CKD_DATA[[#All],[OrgID]],V48,WF_CKD_DATA[[#All],[Rel_D]],Locations!$E$17)","v":129},0.82692307692307687,{"$f":"SUMIFS(WF_CKD_DATA[[#All],[NIS08-CKD04]],WF_CKD_DATA[[#All],[OrgID]],V48,WF_CKD_DATA[[#All],[Rel_D]],Locations!$E$17)","v":73},0.64035087719298245]
[null,null,null,null,null,null,null,null,null,null,null,null,null,null,null,null,null,null,null,null,"Higham Hill Medical Centre","F86679",{"$f":"SUMIFS(WF_CKD_DATA[[#All],[08-CKD]],WF_CKD_DATA[[#All],[OrgID]],V49,WF_CKD_DATA[[#All],[Rel_D]],Locations!$E$17)","v":75},{"$f":"SUMIFS(WF_CKD_DATA[[#All],[NIS08-CKD01]],WF_CKD_DATA[[#All],[OrgID]],V49,WF_CKD_DATA[[#All],[Rel_D]],Locations!$E$17)","v":72},0.96,{"$f":"SUMIFS(WF_CKD_DATA[[#All],[NIS08-CKD02]],WF_CKD_DATA[[#All],[OrgID]],V49,WF_CKD_DATA[[#All],[Rel_D]],Locations!$E$17)","v":53},0.70666666666666667,{"$f":"SUMIFS(WF_CKD_DATA[[#All],[NIS08-CKD03]],WF_CKD_DATA[[#All],[OrgID]],V49,WF_CKD_DATA[[#All],[Rel_D]],Locations!$E$17)","v":55},0.73333333333333328,{"$f":"SUMIFS(WF_CKD_DATA[[#All],[NIS08-CKD04]],WF_CKD_DATA[[#All],[OrgID]],V49,WF_CKD_DATA[[#All],[Rel_D]],Locations!$E$17)","v":57},0.79166666666666663]
[null,null,null,null,null,null,null,null,null,null,null,null,null,null,null,null,null,null,null,null,"St James Medical Practice Ltd","F86058",{"$f":"SUMIFS(WF_CKD_DATA[[#All],[08-CKD]],WF_CKD_DATA[[#All],[OrgID]],V50,WF_CKD_DATA[[#All],[Rel_D]],Locations!$E$17)","v":256},{"$f":"SUMIFS(WF_CKD_DATA[[#All],[NIS08-CKD01]],WF_CKD_DATA[[#All],[OrgID]],V50,WF_CKD_DATA[[#All],[Rel_D]],Locations!$E$17)","v":203},0.79296875,{"$f":"SUMIFS(WF_CKD_DATA[[#All],[NIS08-CKD02]],WF_CKD_DATA[[#All],[OrgID]],V50,WF_CKD_DATA[[#All],[Rel_D]],Locations!$E$17)","v":176},0.6875,{"$f":"SUMIFS(WF_CKD_DATA[[#All],[NIS08-CKD03]],WF_CKD_DATA[[#All],[OrgID]],V50,WF_CKD_DATA[[#All],[Rel_D]],Locations!$E$17)","v":211},0.82421875,{"$f":"SUMIFS(WF_CKD_DATA[[#All],[NIS08-CKD04]],WF_CKD_DATA[[#All],[OrgID]],V50,WF_CKD_DATA[[#All],[Rel_D]],Locations!$E$17)","v":135},0.66502463054187189]
[null,null,null,null,null,null,null,null,null,null,null,null,null,null,null,null,null,null,null,null,"Average",null,null,null,{"$f":"AVERAGE(Y11:Y50)","v":0.87390035122697385},null,{"$f":"AVERAGE(AA11:AA50)","v":0.67436006374331869},null,{"$f":"AVERAGE(AC11:AC50)","v":0.76957619689535761},null,{"$f":"AVERAGE(AE11:AE50)","v":0.65069886448449132}]
[]
[]
[]
[]
["Numerator"]
[]
[{"$f":"IF(A47=\"NIS08-CKD01\",SUMIFS(#REF!,#REF!,A49),IF(A47=\"NIS08-CKD02\",SUMIFS(#REF!,#REF!,A49 ),IF(A47=\"08-CKD\", SUMIFS(#REF!,#REF!,A49),0)))","v":0}]
[{"$f":"IF(A48=\"NIS08-CKD01\",SUMIFS(#REF!,#REF!,A50),IF(A48=\"NIS08-CKD02\",SUMIFS(#REF!,#REF!,A50 ),IF(A48=\"08-CKD\", SUMIFS(#REF!,#REF!,A50),0)))","v":0}]
[]
[]
[]
["Numerator "]
[{"$f":"SUMIFS(INDIRECT(\"WF_CKD_DATA[[#All],[\"&$B$2&\"]]\"),#REF!,TRENDS!$B$4,#REF!,TRENDS!C61)","v":{"$error":"#REF!"}}]

{"sheet":"PRACTICE","index":6,"n_rows":40,"n_cols":14,"rows_kept":40,"cut":false,"hidden":true,"merged":[]}
[" -","Select Practice","Area","Locality",{"$f":"Homepage!J3","v":"Churchill Medical Centre"}]
["Y01291","Chingford Medical Practice","Chingford E4","WF-2",{"$f":"INDEX($A$1:$D$45,MATCH($E$1,$B$1:$B$45,0),1)","v":"F86627"},null,null,null,"Y01291","Chingford Medical Practice","Chingford E4",{"$f":"IF($K2=$M$2,$N$2,IF($K2=$M$3,$N$3,$N$4))","v":"WF-2"},"Chingford/ Walthamstow","WF-1"]
["F86627","Churchill Medical Centre","Chingford E4","WF-2",9,null,null,null,"F86627","Churchill Medical Centre","Chingford E4","WF-2","Chingford E4","WF-2"]
["F86078","The Ridgeway Surgery","Chingford E4","WF-2",{"$f":"\"'TRENDTABLE'!$A$\"&E3&\":$T$\"&E3","v":"'TRENDTABLE'!$A$9:$T$9"},null,null,null,"F86078","The Ridgeway Surgery","Chingford E4","WF-2","Leyton Collaborative","WF-3"]
["F86700","Kings Head Medical Practice","Chingford/ Walthamstow","WF-1",{"$f":"VLOOKUP(E2,A1:D41, 4, 0)","v":"WF-2"},null,null,null,"F86700","Kings Head Medical Practice","Chingford/ Walthamstow","WF-1","Forest Integrated Health","WF-4"]
["F86664","Larkshall Medical Centre","Chingford/ Walthamstow","WF-1",null,null,null,null,"F86664","Larkshall Medical Centre","Chingford/ Walthamstow","WF-1","South Leytonstone","WF-5"]
["F86616","Old Church Surgery","Chingford E4","WF-2",null,null,null,null,"F86616","Old Church Surgery","Chingford E4","WF-2","Central Walthamstow","WF-6"]
["F86638","The Microfaculty **","Chingford/ Walthamstow","WF-1",null,null,null,null,"F86638","The Microfaculty","Chingford/ Walthamstow","WF-1","Walthamstow West","WF-7"]
["F86011","The Manor Practice","Leyton Collaborative","WF-3",null,null,null,null,"F86011","The Manor Practice","Leyton Collaborative","WF-3"]
["F86036","The Allum Medical Centre","Forest Integrated Health","WF-4",null,null,null,null,"F86036","The Allum Medical Centre","Forest Integrated Health","WF-3"]
["F86038","Sma Medical Centre","Leyton Collaborative","WF-3",{"$f":"VLOOKUP(Summary!C6,PRACTICE!$B$2:$B$40,1,0)","v":"Leyton Healthcare (Oliver Road) **"},{"$f":"INDEX($A$2:$A$40,MATCH($E$11,$B$2:$B$40,0))","v":"F86074"},null,null,"F86038","Sma Medical Centre","Leyton Collaborative","WF-3"]
["F86044"," Crawley Road Medical Centre","Forest Integrated Health","WF-4",null,null,null,null,"F86044"," Crawley Road Medical Centre","Forest Integrated Health","WF-3"]
["F86696","Francis Road Medical Centre","Forest Integrated Health","WF-4",null,null,null,null,"F86696","Francis Road Medical Centre","Forest Integrated Health","WF-3"]
["F86621","Green Man Medical Centre","South Leytonstone","WF-5",null,null,null,null,"F86621","Green Man Medical Centre","South Leytonstone","WF-3"]
["F86712","Hampton Medical Centre","Forest Integrated Health","WF-4",null,null,null,null,"F86712","Hampton Medical Centre","Forest Integrated Health","WF-3"]
["F86045","High Road Surgery","South Leytonstone","WF-5",null,null,null,null,"F86045","High Road Surgery","South Leytonstone","WF-3"]
["F86701","Kiyani Medical Practice","South Leytonstone","WF-5",null,null,null,null,"F86701","Kiyani Medical Practice","South Leytonstone","WF-3"]
["F86650","Lime Tree Surgery","Forest Integrated Health","WF-4",null,null,null,null,"F86650","Lime Tree Surgery","Forest Integrated Health","WF-3"]
["F86625","LL Medical Care (Agarwal & Agrwal Practice)","South Leytonstone","WF-5",null,null,null,null,"F86625","LL Medical Care (Agarwal & Agrwal Practice)","South Leytonstone","WF-3"]
["F86666","The Harrow Road Surgery","South Leytonstone","WF-5",null,null,null,null,"F86666","The Harrow Road Surgery","South Leytonstone","WF-3"]
["F86705","The Langthorne Sharma Family Practice","South Leytonstone","WF-5",null,null,null,null,"F86705","The Langthorne Sharma Family Practice","South Leytonstone","WF-3"]
["F86088","The Lyndhurst Surgery","Forest Integrated Health","WF-4",null,null,null,null,"F86088","The Lyndhurst Surgery","Forest Integrated Health","WF-3"]
["F86074","Leyton Healthcare (Oliver Road) **","Leyton Collaborative","WF-3",null,null,null,null,"F86074","Leyton Healthcare (Oliver Road)","Leyton Collaborative","WF-3"]
["F86018","The Ecclesbourne Practice **","Forest Integrated Health","WF-4",null,null,null,null,"F86018","The Ecclesbourne Practice","Forest Integrated Health","WF-3"]
["F86607","Addison Road Medical Practice","Central Walthamstow","WF-6",null,null,null,null,"F86607","Addison Road Medical Practice","Central Walthamstow","WF-3"]
["F86708","Claremont Medical Centre","Central Walthamstow","WF-6",null,null,null,null,"F86708","Claremont Medical Centre","Central Walthamstow","WF-3"]
["F86001"," The Firs","Central Walthamstow","WF-6",null,null,null,null,"F86001"," The Firs","Central Walthamstow","WF-3"]
["F86005"," The Penryhn Surgery","Chingford/ Walthamstow","WF-1",null,null,null,null,"F86005"," The Penryhn Surgery","Chingford/ Walthamstow","WF-1"]
["F86086","Dr Dhital Practice","Central Walthamstow","WF-6",null,null,null,null,"F86086","Dr Dhital Practice","Central Walthamstow","WF-3"]
["F86006","Seymour Medical Centre","Walthamstow West","WF-7",null,null,null,null,"F86006","Seymour Medical Centre","Walthamstow West","WF-3"]
["F86626","Dr Shantir Practice","Chingford/ Walthamstow","WF-1",null,null,null,null,"F86626","Dr Shantir Practice","Chingford/ Walthamstow","WF-1"]
["F86030"," Queens Road Medical Centre","Walthamstow West","WF-7",null,null,null,null,"F86030"," Queens Road Medical Centre","Walthamstow West","WF-3"]
["F86062","Grove Surgery","Walthamstow West","WF-7",null,null,null,null,"F86062","Grove Surgery","Walthamstow West","WF-3"]
["F86679","Higham Hill Medical Centre","Walthamstow West","WF-7",null,null,null,null,"F86679","Higham Hill Medical Centre","Walthamstow West","WF-3"]
["Y01839","Lime Tree & Sinnott Healthcare Ltd","Chingford/ Walthamstow","WF-1",null,null,null,null,"Y01839","Lime Tree & Sinnott Healthcare Ltd","Chingford/ Walthamstow","LC1"]
["F86058","St James Medical Practice Ltd","Walthamstow West","WF-7",null,null,null,null,"F86058","St James Medical Practice Ltd","Walthamstow West"]
["F86689","The Bailey Practice","Chingford/ Walthamstow","WF-1",null,null,null,null,"F86689","The Bailey Practice","Chingford/ Walthamstow"]
["F86644","Waltham Forest Community & Family Health Services Ltd","Central Walthamstow","WF-6",null,null,null,null,"F86644","Waltham Forest Community & Family Health Services Ltd","Central Walthamstow"]
["F86026","Forest Surgery **","Chingford/ Walthamstow","WF-1",null,null,null,null,"F86026","Forest Surgery","Chingford/ Walthamstow"]
["F86004","Handsworth Medical Centre **","Chingford/ Walthamstow","WF-1",null,null,null,null,"F86004","Handsworth Medical Centre","Chingford E4"]

{"sheet":"HEADERTOGGLE","index":7,"n_rows":40,"n_cols":10,"rows_kept":40,"cut":false,"hidden":true,"merged":[]}
["Condition","Indicator Type",true,"Condition","Indicator Type",false,"Alphabetical","Quadrant",true,false]
["iLTC01-RV01","iLTC10-RA01",null,"Complex Care","COPD",null,"F86607","Y01291",null,{"$f":"IF(J1,\"Y\",\"\")","v":""}]
["iLTC03-CP04","iLTC10-RA02",null,"IC101-ICC01","IC205-COPD01",null,"Y01291","F86627",null,{"$f":"IF(J1,\"in financial year\",\"in last 12 months\")","v":"in last 12 months"}]
["iLTC03-PS03","iLTC05-AS01",null,"IC101-ICC02","IC205-COPD02",null,"F86627","F86700"]
["iLTC03-RV04","iLTC01-RV01",null,"IC101-ICC03","IC205-COPD03",null,"F86708","F86664"]
["iLTC04-CP05","iLTC05-RV02",null,"IC101-ICC04","Cancer",null,"F86044","F86616"]
["iLTC04-RV05","iLTC06-RV03",null,"IC101-ICC05","IC206-CAN01",null,"F86086","F86078"]
["iLTC05-CP01","iLTC03-RV04",null,"IC101-ICC06","IC206-CAN02",null,"F86626","LC1"]
["iLTC05-CP02","iLTC04-RV05",null,"IC101-ICC07","IC206-CAN03",null,"F86696","F86044"]
["iLTC05-CP03","iLTC05-CP01",null,"Hypertension","AUA",null,"F86621","F86696"]
["iLTC05-PS01","iLTC05-CP02",null,"IC201-HYP01","IC301-AUA03",null,"F86712","F86621"]
["iLTC05-RV02","iLTC05-CP03",null,"IC201-HYP02","IC301-AUA04",null,"F86045","F86712"]
["iLTC05-Tb05","iLTC03-CP04",null,"IC201-HYP03","Complex Care",null,"F86679","F86045"]
["iLTC05-Tb06","iLTC04-CP05",null,"IC201-HYP04","IC101-ICC01",null,"F86700","F86701"]
["iLTC05-Tc04","iLTC07-Tb01",null,"CVD","IC101-ICC02",null,"F86701","F86625"]
["iLTC05-Th01","iLTC12-Tb02",null,"IC202-CVD02","IC101-ICC03",null,"F86625","F86705"]
["iLTC05-AS01","iLTC08-Tb03",null,"IC202-CVD03","IC101-ICC04",null,"F86705","F86073"]
["iLTC06-RV03","iLTC09-Tb04",null,"IC202-CVD04","IC101-ICC05",null,"F86664","F86650"]
["iLTC07-Tb01","iLTC05-Tb05",null,"ECG","IC101-ICC06",null,"F86073","F86038"]
["iLTC08-Tb03","iLTC05-Tb06",null,"IC203-ECG01","IC101-ICC07",null,"Y01839","F86036"]
["iLTC09-Tb04","iLTC11-Tb07",null,"Diabetes","Hypertension",null,"F86650","F86666"]
["iLTC09-Tc02","iLTC12-Tc01",null,"IC204-DM01","IC201-HYP01",null,"F86005","F86088"]
["iLTC10-RA01","iLTC09-Tc02",null,"IC204-DM02","IC201-HYP02",null,"F86030","F86011"]
["iLTC10-RA02","iLTC11-Tc03",null,"IC204-DM03","IC201-HYP03",null,"F86006","Y02585"]
["iLTC10-TA01","iLTC05-Tc04",null,"IC204-DM04","IC201-HYP04",null,"F86038","LC2"]
["iLTC11-Tb07","iLTC05-Th01",null,"IC204-DM05","CVD",null,"F86058","F86607"]
["iLTC11-Tc03","iLTC10-TA01",null,"COPD","IC202-CVD02",null,"F86036","F86708"]
["iLTC12-Tb02","iLTC05-PS01",null,"IC205-COPD01","IC202-CVD03",null,"F86689","F86086"]
["iLTC12-Tc01","iLTC03-PS03",null,"IC205-COPD02","IC202-CVD04",null,"F86001","F86626"]
[null,null,null,"IC205-COPD03","ECG",null,"F86062","F86679"]
[null,null,null,"Cancer","IC203-ECG01",null,"F86666","Y01839"]
[null,null,null,"IC206-CAN01","Diabetes",null,"F86088","F86005"]
[null,null,null,"IC206-CAN02","IC204-DM01",null,"F86011","F86030"]
[null,null,null,"IC206-CAN03","IC204-DM02",null,"F86616","F86006"]
[null,null,null,"AUA","IC204-DM03",null,"Y02585","F86058"]
[null,null,null,"IC301-AUA03","IC204-DM04",null,"F86078","F86689"]
[null,null,null,"IC301-AUA04","IC204-DM05",null,"F86644","F86001"]
[null,null,null,null,null,null,"LC1","F86062"]
[null,null,null,null,null,null,"LC2","F86644"]
[null,null,null,null,null,null,"LC3","LC3"]

{"sheet":"HEADERINFO2","index":8,"n_rows":88,"n_cols":9,"rows_kept":88,"cut":false,"hidden":true,"merged":[]}
["SearchID","FieldID","LTC","Type","Search Title","Target1","Target2","Pay1","Pay2"]
["[00-00]","[00-00]","Listsize",null,"Listsize"]
["[08-CKD]","[08-CKD]","Complex Care","A","eGFR evidence of CKD"]
["NIS08-CKD01","NIS08-CKD01","Complex Care","A","evidence of CKD coded CKD"]
["NIS08-CKD01%","NIS08-CKD01%","Complex Care","A","% evidence of CKD coded CKD",0.7,null,0.4]
["NIS08-CKD02","NIS08-CKD02","Complex Care","A","evidence of CKD with BP below 140/90"]
["NIS08-CKD02%","NIS08-CKD02%","Complex Care","A","% evidence of CKD with BP below 140/90",0.7,null,0.1]
["NIS08-CKD03","NIS08-CKD03","Complex Care","A","evidence of CKD on Statins"]
["NIS08-CKD03%","NIS08-CKD03%","Complex Care","A","% evidence of CKD on Statins",0.7,null,0.1]
["NIS08-CKD04","NIS08-CKD04","Complex Care","A","QOF CKD code with ACR recorded"]
["NIS08-CKD04%","NIS08-CKD04%",null,null,"% QOF CKD code with ACR recorded"]
["NIS08-CKD08","NIS08-CKD08","Complex Care","A","Referred to community renal clinic",null,null,20]
[]
[]
[]
[]
[]
[]
["[01-IC2]","[01-IC2]","Hypertension","B","Hypertension IC-LTC"]
["01-HYP01","01-HYP01","Hypertension","B","eligible for ACR/PCR"]
["IC201-HYP01","IC201-HYP01","Hypertension","B","Proteinuria ACR/PCR 15m"]
["IC201-HYP01%","IC201-HYP01%","Hypertension","B","% Proteinuria ACR/PCR 15m",0.7,null,0.1]
["01-HYP02","01-HYP02","Hypertension","B","eligible for BP"]
["IC201-HYP02","IC201-HYP02","Hypertension","B","On Target - BP <140/90 12m"]
["IC201-HYP02%","IC201-HYP02%","Hypertension","B","% On Target - BP <140/90 12m",0.7,null,0.15]
["01-HYP03","01-HYP03","Hypertension","B","eligible for Pulse Check"]
["IC201-HYP03","IC201-HYP03","Hypertension","B","65+ yrs with Pulse Checck 15m"]
["IC201-HYP03%","IC201-HYP03%","Hypertension","B","% 65+ yrs with Pulse Check 15m",0.7,null,0.05]
["01-HYP04","01-HYP04","Hypertension","B","eligible for Statin prescription"]
["IC201-HYP04","IC201-HYP04","Hypertension","B","High risk CVD with Statins prescribed 12m"]
["IC201-HYP04%","IC201-HYP04%","Hypertension","B","% High risk CVD with Statins prescribed 12m",0.7,null,0.05]
["[02-IC2]","[02-IC2]","CVD","C","CVD IC-LTC"]
["02-CVD02","02-CVD02","CVD","C","eligible for CVD Statins"]
["IC202-CVD02","IC202-CVD02","CVD","C","On Target CVD"]
["IC202-CVD02%","IC202-CVD02%","CVD","C","% On Target CVD",0.7,0.3,0.05,0.15]
["02-CVD03","02-CVD03","CVD","C","eligible for CVD care plan"]
["IC202-CVD03","IC202-CVD03","CVD","C","CHD/ Stroke/ TIA patients with Annual care plan 15m"]
["IC202-CVD03%","IC202-CVD03%","CVD","C","% CHD/ Stroke/ TIA patients with Annual care plan 15m",0.7,null,0.05]
["02-CVD04","02-CVD04","CVD","C","eligible for AF Anticoagulation"]
["IC202-CVD04","IC202-CVD04","CVD","C","AF patients on Anticoagulants"]
["IC202-CVD04%","IC202-CVD04%","CVD","C","% AF patients on Anticoagulants",0.7,0.7,0.05,0.1]
["IC203-ECG01","IC203-ECG01","ECG","D","ECG Tests 2016-2017",null,null,12.5]
["[04-IC2]","[04-IC2]","Diabetes","E","Diabetes IC-LTC"]
["04-DM01","04-DM01","Diabetes","E","eligible for care plan"]
["IC204-DM01","IC204-DM01","Diabetes","E","Care plan agreed with pulse check >=65 15m"]
["IC204-DM01%","IC204-DM01%","Diabetes","E","% Care plan agreed with pulse check >=65 15m",0.7,0.9,0.02,0.05]
["04-DM02","04-DM02","Diabetes","E","eligible for BP control"]
["IC204-DM02","IC204-DM02","Diabetes","E","BP control (>140/80) and statins**"]
["IC204-DM02%","IC204-DM02%","Diabetes","E","% BP control (>140/80) and statins**",0.7,null,0.15]
["04-DM03","04-DM03","Diabetes","E","eligible for Digital Retinal Screening"]
["IC204-DM03","IC204-DM03","Diabetes","E","Digital Retinal Screening"]
["IC204-DM03%","IC204-DM03%","Diabetes","E","% Digital Retinal Screening",0.7,0.8,0.02,0.05]
["04-DM04","04-DM04","Diabetes","E","eligible for HbA1c"]
["IC204-DM04","IC204-DM04","Diabetes","E","18-64 yrs + HbA1C <59mmol/mol "]
["IC204-DM04%","IC204-DM04%","Diabetes","E","% 18-64 yrs + HbA1C <59mmol/mol ",0.7,0.65,0.02,0.05]
["04-DM05","04-DM05","Diabetes","E","Eligible for Diabetes Medication Reviews"]
["IC204-DM05","IC204-DM05","Diabetes","E","Medication Reviews"]
["IC204-DM05%","IC204-DM05%","Diabetes","E","Medication Reviews (hypoglycaemia prevention)","NT",null,null,0.05]
["[05-IC2]","[05-IC2]","COPD","F","COPD IC-LTC"]
["05-COPD01","05-COPD01","COPD","F","Eligible for COPD Review"]
["IC205-COPD01","IC205-COPD01","COPD","F","COPD review with SMP"]
["IC205-COPD01%","IC205-COPD01%","COPD","F","% COPD review with SMP",0.7,null,0.2]
["05-COPD02","05-COPD02","COPD","F","eligible for Pul Rehab (MRC 3+)"]
["IC205-COPD02","IC205-COPD02","COPD","F","COPD MRC 3+ + Ref to Pulmonary Rehab"]
["IC205-COPD02%","IC205-COPD02%","COPD","F","% COPD MRC 3+ + Ref to Pulmonary Rehab",0.7,null,0.1]
["05-COPD03","05-COPD03","COPD","F","eligible for reduced steriod inhalers"]
["IC205-COPD03","IC205-COPD03","COPD","F","Reduced Steriod Inhalers"]
["IC205-COPD03%","IC205-COPD03%","COPD","F","% Reduced Steriod Inhalers","-",null,0.05]
["[06-IC2]","[06-IC2]","Cancer","G","Cancer IC-LTC"]
["IC206-CAN01","IC206-CAN01","Cancer","G","RCGP Tool",null,null,70]
["IC206-CAN02","IC206-CAN02","Cancer","G","Cancer Care Review",null,null,40]
["IC206-CAN03","IC206-CAN03","Cancer","G","Zoladex/Prostap injections",null,null,43.5]
["IC301-AUA03","IC301-AUA03","AUA","H","Post-Admission Review",null,null,1.1499999999999999]
["IC301-AUA04","IC301-AUA04","AUA","H","Newly Consented LTC 2016-2017",null,null,0.28999999999999998]
["IC101-S01","IC101-S01",null,null,"IC Complex - Mandatory"]
["IC101-S02","IC101-S02",null,null,"IC Complex - Discretionary"]
["IC201-S01","IC201-S01",null,null,"Hypertension - On Target"]
["IC201-S02","IC201-S02",null,null,"Hypertension - Off Target"]
["IC202-S01","IC202-S01",null,null,"CVD - Newly Diagnosed"]
["IC202-S02","IC202-S02",null,null,"CVD - On Target"]
["IC204-S01","IC204-S01",null,null,"Diabetes - Newly Diagnosed"]
["IC204-S02","IC204-S02",null,null,"Diabetes - Controlled"]
["IC204-S03","IC204-S03",null,null,"Diabetes - Off Target"]
["IC204-S04","IC204-S04",null,null,"Diabetes - Off Target Complex"]
["IC204-S05","IC204-S05",null,null,"Diabetes - Off Target Non-Complex"]
["IC205-S01","IC205-S01",null,null,"COPD - Mild /Moderate/Severe"]
["IC205-S02","IC205-S02",null,null,"COPD - Very Severe"]
["IC205-S03","IC205-S03",null,null,"COPD - Housebound"]

{"sheet":"Locations","index":9,"n_rows":40,"n_cols":16,"rows_kept":40,"cut":false,"hidden":true,"merged":[]}
["Blank","01/04/2019","2019-05-01","2019-06-01","2019-07-01","2019-08-01","2019-09-01","2019-10-01","2019-11-01","2019-12-01","2020-01-01","2020-02-01","2020-03-01","2020-04-01","BLANK"]
["Data (Y/N)","Y","Y","Y","Y","Y","Y","Y","Y","Y","Y","Y","Y","Y"]
["File Name"]
["Q Work Sheet","Compiled_04_2018","Compiled_05_2018","Compiled_06_2018","Compiled_07_2018","Compiled_08_2018","Compiled_09_2018","Compiled_10_2018","Compiled_11_2018","Compiled_12_2018","Compiled_01_2019","Compiled_02_2019","Compiled_03_2019","Compiled_04_2019","BLANK",{"$f":"COUNTA(B4:N4)","v":13}]
["Sheet Address",{"$f":"\"'\"&IF(B3<>\"\",\"[\"&B3&\".xlsx]\",\"\")&IF(B2=\"N\",$O$5,B4)&\"'!\"","v":"'Compiled_04_2018'!"},"'Compiled_05_2018'!","'Compiled_06_2018'!","'Compiled_07_2018'!","'Compiled_08_2018'!","'Compiled_09_2018'!","'Compiled_10_2018'!","'Compiled_11_2018'!","'Compiled_12_2018'!","'Compiled_01_2019'!","'Compiled_02_2019'!","'Compiled_03_2019'!","'Compiled_04_2019'!",{"$f":"IF(O3<>\"\",\"[\"&O3&\".xlsx]\",\"\")&IF(O2=\"N\",\"\",O4)","v":"BLANK"}]
["Sheet Check",{"$f":"IF(ISREF(INDIRECT(B5&\"A1\")),\"OK\",\"WORKSHEET NOT FOUND\")","v":"WORKSHEET NOT FOUND"},"WORKSHEET NOT FOUND","OK","WORKSHEET NOT FOUND","WORKSHEET NOT FOUND","WORKSHEET NOT FOUND","WORKSHEET NOT FOUND","WORKSHEET NOT FOUND","WORKSHEET NOT FOUND","WORKSHEET NOT FOUND","WORKSHEET NOT FOUND","WORKSHEET NOT FOUND","WORKSHEET NOT FOUND"]
["Rows",{"$f":"MAX(IF(NOT(ISBLANK(INDIRECT(B5&\"A1:A500\"))),ROW($A$1:$A$500),0))","v":500},{"$f":"MAX(IF(NOT(ISBLANK(INDIRECT(C5&\"A1:A500\"))),ROW($A$1:$A$500),0))","v":500},{"$f":"MAX(IF(NOT(ISBLANK(INDIRECT(D5&\"A1:A500\"))),ROW($A$1:$A$500),0))","v":62},{"$f":"MAX(IF(NOT(ISBLANK(INDIRECT(E5&\"A1:A500\"))),ROW($A$1:$A$500),0))","v":500},{"$f":"MAX(IF(NOT(ISBLANK(INDIRECT(F5&\"A1:A500\"))),ROW($A$1:$A$500),0))","v":500},{"$f":"MAX(IF(NOT(ISBLANK(INDIRECT(G5&\"A1:A500\"))),ROW($A$1:$A$500),0))","v":500},{"$f":"MAX(IF(NOT(ISBLANK(INDIRECT(H5&\"A1:A500\"))),ROW($A$1:$A$500),0))","v":500},{"$f":"MAX(IF(NOT(ISBLANK(INDIRECT(I5&\"A1:A500\"))),ROW($A$1:$A$500),0))","v":500},{"$f":"MAX(IF(NOT(ISBLANK(INDIRECT(J5&\"A1:A500\"))),ROW($A$1:$A$500),0))","v":500},{"$f":"MAX(IF(NOT(ISBLANK(INDIRECT(K5&\"A1:A500\"))),ROW($A$1:$A$500),0))","v":500},{"$f":"MAX(IF(NOT(ISBLANK(INDIRECT(L5&\"A1:A500\"))),ROW($A$1:$A$500),0))","v":500},{"$f":"MAX(IF(NOT(ISBLANK(INDIRECT(M5&\"A1:A500\"))),ROW($A$1:$A$500),0))","v":500},{"$f":"MAX(IF(NOT(ISBLANK(INDIRECT(N5&\"A1:A500\"))),ROW($A$1:$A$500),0))","v":500}]
["Columns",{"$f":"COUNTA(INDIRECT(B5&\"1:1\"))","v":1},{"$f":"COUNTA(INDIRECT(C5&\"1:1\"))","v":1},{"$f":"COUNTA(INDIRECT(D5&\"1:1\"))","v":13},{"$f":"COUNTA(INDIRECT(E5&\"1:1\"))","v":1},{"$f":"COUNTA(INDIRECT(F5&\"1:1\"))","v":1},1,1,1,1,1,1,1,1]
["Data End",{"$f":"ADDRESS(B7,B8)","v":"$A$500"},"$A$500","$M$62","$A$500","$A$500","$A$500","$A$500","$A$500","$A$500","$A$500","$A$500","$A$500","$A$500"]
["NACS",{"$f":"ADDRESS(1,MATCH($A$10,INDIRECT(Locations!$B$5&\"A1:BZ1\"),0))","v":{"$error":"#REF!"}},{"$f":"ADDRESS(1,MATCH($A$10,INDIRECT(Locations!$B$5&\"A1:BZ1\"),0))","v":{"$error":"#REF!"}},{"$f":"ADDRESS(1,MATCH($A$10,INDIRECT(Locations!$B$5&\"A1:BZ1\"),0))","v":{"$error":"#REF!"}},{"$f":"ADDRESS(1,MATCH($A$10,INDIRECT(Locations!$B$5&\"A1:BZ1\"),0))","v":{"$error":"#REF!"}},{"$f":"ADDRESS(1,MATCH($A$10,INDIRECT(Locations!$B$5&\"A1:BZ1\"),0))","v":{"$error":"#REF!"}},{"$f":"ADDRESS(1,MATCH($A$10,INDIRECT(Locations!$B$5&\"A1:BZ1\"),0))","v":{"$error":"#REF!"}},{"$f":"ADDRESS(1,MATCH($A$10,INDIRECT(Locations!$B$5&\"A1:BZ1\"),0))","v":{"$error":"#REF!"}},{"$f":"ADDRESS(1,MATCH($A$10,INDIRECT(Locations!$B$5&\"A1:BZ1\"),0))","v":{"$error":"#REF!"}},{"$f":"ADDRESS(1,MATCH($A$10,INDIRECT(Locations!$B$5&\"A1:BZ1\"),0))","v":{"$error":"#REF!"}},{"$f":"ADDRESS(1,MATCH($A$10,INDIRECT(Locations!$B$5&\"A1:BZ1\"),0))","v":{"$error":"#REF!"}},{"$f":"ADDRESS(1,MATCH($A$10,INDIRECT(Locations!$B$5&\"A1:BZ1\"),0))","v":{"$error":"#REF!"}},{"$f":"ADDRESS(1,MATCH($A$10,INDIRECT(Locations!$B$5&\"A1:BZ1\"),0))","v":{"$error":"#REF!"}},{"$f":"ADDRESS(1,MATCH($A$10,INDIRECT(Locations!$B$5&\"A1:BZ1\"),0))","v":{"$error":"#REF!"}}]
["NACS Range",{"$f":"B5&B10&\":\"&ADDRESS(B7,COLUMN(INDIRECT(B10)))","v":{"$error":"#REF!"}},{"$error":"#REF!"},{"$error":"#REF!"},{"$error":"#REF!"},{"$error":"#REF!"},{"$error":"#REF!"},{"$error":"#REF!"},{"$error":"#REF!"},{"$error":"#REF!"},{"$error":"#REF!"},{"$error":"#REF!"},{"$error":"#REF!"},{"$error":"#REF!"}]
["Header Range",{"$f":"B$5&B10&\":\"&ADDRESS(1,B8)","v":{"$error":"#REF!"}},{"$error":"#REF!"},{"$error":"#REF!"},{"$error":"#REF!"},{"$error":"#REF!"},{"$error":"#REF!"},{"$error":"#REF!"},{"$error":"#REF!"},{"$error":"#REF!"},{"$error":"#REF!"},{"$error":"#REF!"},{"$error":"#REF!"},{"$error":"#REF!"}]
["Data Range",{"$f":"B$5&B10&\":\"&B9","v":{"$error":"#REF!"}},{"$error":"#REF!"},{"$error":"#REF!"},{"$error":"#REF!"},{"$error":"#REF!"},{"$error":"#REF!"},{"$error":"#REF!"},{"$error":"#REF!"},{"$error":"#REF!"},{"$error":"#REF!"},{"$error":"#REF!"},{"$error":"#REF!"},{"$error":"#REF!"}]
[]
["Data Run","01/12/2018"]
[null,null,null,null,null,null,"01/04/2023","2023-04-01"]
["Payment Month ",{"$f":"INDEX(B1:M1,1,B21)","v":{"$error":"#REF!"}},null,"Audit Select ",{"$f":"VLOOKUP(E21,G16:H28,2,0)","v":"2024-04-01"},null,"01/05/2023","2023-05-01"]
["NACS Range",{"$f":"OFFSET($A$1,MATCH($A18,Locations!$A$1:$A$13,0)-1,MATCH($B$17,$A$1:$O$1,0)-1)","v":{"$error":"#REF!"}},null,"NACS Range",{"$f":"OFFSET($A$1,MATCH($A18,Locations!$A$1:$A$13,0)-1,MATCH($E$17,$A$1:$O$1,0)-1)","v":{"$error":"#N/A"}},null,"01/06/2023","2023-06-01"]
["Header Range",{"$f":"OFFSET($A$1,MATCH($A19,Locations!$A$1:$A$13,0)-1,MATCH($B$17,$A$1:$O$1,0)-1)","v":{"$error":"#REF!"}},null,"Header Range",{"$f":"OFFSET($A$1,MATCH($A19,Locations!$A$1:$A$13,0)-1,MATCH($E$17,$A$1:$O$1,0)-1)","v":{"$error":"#N/A"}},null,"01/07/2023","2023-07-01"]
["Data Range",{"$f":"OFFSET($A$1,MATCH($A20,Locations!$A$1:$A$13,0)-1,MATCH($B$17,$A$1:$O$1,0)-1)","v":{"$error":"#REF!"}},null,"Data Range",{"$f":"SUMIFS(#REF!,Locations!E17,#REF!)","v":{"$error":"#REF!"}},null,"01/08/2023","2023-08-01"]
["Current Month #",{"$f":"COUNTA($B$4:$N$4)","v":13},null,"Selection ",{"$f":"Homepage!$G$3","v":"01/04/2024"},null,"01/09/2023","2023-09-01"]
[null,null,null,null,null,null,"01/10/2023","2023-10-01"]
["Listsize","2018-12-01",null,null,null,null,"01/11/2023","2023-11-01"]
["NACS Range",{"$f":"OFFSET($A$1,MATCH($A24,Locations!$A$1:$A$13,0)-1,MATCH($B$23,$A$1:$O$1,0)-1)","v":{"$error":"#N/A"}},null,null,null,null,"01/12/2023","2023-12-01"]
["Header Range",{"$f":"OFFSET($A$1,MATCH($A25,Locations!$A$1:$A$13,0)-1,MATCH($B$23,$A$1:$O$1,0)-1)","v":{"$error":"#N/A"}},null,null,null,null,"01/01/2024","2024-01-01"]
["Data Range",{"$f":"OFFSET($A$1,MATCH($A26,Locations!$A$1:$A$13,0)-1,MATCH($B$23,$A$1:$O$1,0)-1)","v":{"$error":"#N/A"}},null,null,null,null,"01/02/2024","2024-02-01"]
[null,null,null,null,null,null,"01/03/2024","2024-03-01"]
["Version","CKD v5.0.5",null,null,null,null,"01/04/2024","2024-04-01"]
[null,"Header Info:"]
["File Name"]
["Work Sheet","HEADERINFO2"]
["Rows",{"$f":"MAX(IF(NOT(ISBLANK(INDIRECT(B34&\"B1:B500\"))),ROW(A3:A501),0))","v":90}]
["Columns",{"$f":"COUNTA(INDIRECT(B34&\"A1:NZ1\"))","v":9}]
["Sheet Address",{"$f":"\"'\"&B31&\"'!\"","v":"'HEADERINFO2'!"}]
["Data End",{"$f":"ADDRESS(B32,B33)","v":"$I$90"}]
["FieldID","$B$1"]
["FieldID Range",{"$f":"B34&B36&\":\"&ADDRESS(B32,COLUMN(INDIRECT(B36)))","v":"'HEADERINFO2'!$B$1:$B$90"}]
["Header Range",{"$f":"B34&B36&\":\"&ADDRESS(1,B33)","v":"'HEADERINFO2'!$B$1:$I$1"}]
["Data Range",{"$f":"B34&B36&\":\"&B35","v":"'HEADERINFO2'!$B$1:$I$90"}]
["Search Title","$E$1"]

{"sheet":"BLANK","index":10,"n_rows":61,"n_cols":12,"rows_kept":61,"cut":false,"hidden":true,"merged":[]}
["PracName","NW","NACS","Worksheet","[00-00]","[08-CKD]","NIS08-CKD01","NIS08-CKD01%","NIS08-CKD02","NIS08-CKD02%","NIS08-CKD03","NIS08-CKD03%"]
[null,null,null,"Seach Code:","[00-00]","[08-CKD]","NIS08-CKD01","NIS08-CKD01%","NIS08-CKD02","NIS08-CKD02%","NIS08-CKD03","NIS08-CKD03%"]
["BLANK",null,null,"Found EMISweb Search:","[00-00] Listsize","[08-CKD] eGFR evidence of CKD","NIS08-CKD01: evidence of CKD coded CKD (QOF v33)",null,"NIS08-CKD02: evidence of CKD with appropriate BP",null,"NIS08-CKD03: evidence of CKD on Statins"]
[null,null,null,"Top Left EMISweb Data:","$A$1","$A$46","$A$92",null,"$A$137",null,"$A$183"]
[null,null,null,"EMISweb Array Start:","$B$1","$B$46","$B$92",null,"$B$137",null,"$B$183"]
["2016-07-01",null,null,"EMISweb Array End:","$C$45","$C$91","$C$136",null,"$C$182",null,"$C$227"]
["Payment",null,"Payment"]
["Bethnal Green Health Centre","NW1","F84083",null,"-","-","-","-","-","-","-","-"]
["The Mission Practice","NW1","F84016",null,"-","-","-","-","-","-","-","-"]
["Globe Town Surgery","NW1","F84123",null,"-","-","-","-","-","-","-","-"]
["Pollard Row Surgery","NW1","Y00212",null,"-","-","-","-","-","-","-","-"]
["Strouts Place Medical Centre","NW1","F84051",null,"-","-","-","-","-","-","-","-"]
["Spitalfields Practice","NW2","F84081",null,"-","-","-","-","-","-","-","-"]
["Blithehale Medical Centre","NW2","F84718",null,"-","-","-","-","-","-","-","-"]
["Health E1","NW2","F84733",null,"-","-","-","-","-","-","-","-"]
["Albion Health Centre","NW2","F84012",null,"-","-","-","-","-","-","-","-"]
["Harford Health Centre","NW3","F84087",null,"-","-","-","-","-","-","-","-"]
["Brayford Square (Dr Varma)","NW3","F84046",null,"-","-","-","-","-","-","-","-"]
["Whitechapel Health (Shah Jalal)","NW3","F84039",null,"-","-","-","-","-","-","-","-"]
["City Wellbeing Practice (Tower Medical)","NW3","F84114",null,"-","-","-","-","-","-","-","-"]
["Wapping Group Practice","NW4","F84079",null,"-","-","-","-","-","-","-","-"]
["Jubilee Street Practice","NW4","F84031",null,"-","-","-","-","-","-","-","-"]
["St Katharine Docks Practice","NW4","F84731",null,"-","-","-","-","-","-","-","-"]
["East One Health","NW4","F84682",null,"-","-","-","-","-","-","-","-"]
["Harley Grove Medical Centre","NW5","F84044",null,"-","-","-","-","-","-","-","-"]
["St Stephens Health Centre","NW5","F84034",null,"-","-","-","-","-","-","-","-"]
["Ruston Street Clinic (Dr Amin)","NW5","F84030",null,"-","-","-","-","-","-","-","-"]
["Grove Road Surgery (Dr Shah)","NW5","F84055",null,"-","-","-","-","-","-","-","-"]
["The Tredegar Practice","NW5","F84696",null,"-","-","-","-","-","-","-","-"]
["Stroudley Walk Centre","NW6","F84676",null,"-","-","-","-","-","-","-","-"]
["St Andrews Health Centre","NW6","Y03023",null,"-","-","-","-","-","-","-","-"]
["Merchant Street (Dr Rana)","NW6","F84118",null,"-","-","-","-","-","-","-","-"]
["St Pauls Way Medical Centre","NW6","F84714",null,"-","-","-","-","-","-","-","-"]
["Limehouse Practice (Gill Street)","NW7","F84054",null,"-","-","-","-","-","-","-","-"]
["Chrisp Street Health Centre","NW7","F84062",null,"-","-","-","-","-","-","-","-"]
["Aberfeldy Practice","NW7","F84698",null,"-","-","-","-","-","-","-","-"]
["All Saints Practice","NW7","F84702",null,"-","-","-","-","-","-","-","-"]
["Gough Walk (Dr Selvan)","NW7","F84025",null,"-","-","-","-","-","-","-","-"]
["Island Health","NW8","F84710",null,"-","-","-","-","-","-","-","-"]
["Docklands Medical Centre","NW8","F84656",null,"-","-","-","-","-","-","-","-"]
["Island Medical Centre","NW8","F84647",null,"-","-","-","-","-","-","-","-"]
["Barkantine Practice","NW8","F84747",null,"-","-","-","-","-","-","-","-"]
["Bromley-By-Bow Health Centre","NW6","F841229B1G",null,"-","-","-","-","-","-","-","-"]
["XX Place Surgery","NW2","F841229B1F",null,"-","-","-","-","-","-","-","-"]
[null,null,null,"Found EMISweb Search:","-","-","-","-","-","-","-","-"]
[null,null,null,"Top Left EMISweb Data:","-","-","-","-","-","-","-","-"]
[null,null,null,"EMISweb Array Start:","-","-","-","-","-","-","-","-"]
[null,null,null,"EMISweb Array End:","-","-","-","-","-","-","-","-"]
["The One Network",null,"NW1",null,"-","-","-","-","-","-","-","-"]
["East End Health Network",null,"NW2",null,"-","-","-","-","-","-","-","-"]
["Stepney and Whitechapel Network",null,"NW3",null,"-","-","-","-","-","-","-","-"]
["The Highway Network",null,"NW4",null,"-","-","-","-","-","-","-","-"]
["Bow Health Network",null,"NW5",null,"-","-","-","-","-","-","-","-"]
["Mile End East and Bromley by Bow Network",null,"NW6",null,"-","-","-","-","-","-","-","-"]
["Poplar and Limehouse Network",null,"NW7",null,"-","-","-","-","-","-","-","-"]
["Healthy Island Network",null,"NW8",null,"-","-","-","-","-","-","-","-"]
[null,null,"Total","Networks","-","-","-","-","-","-","-","-"]
[null,null,null,"Practices","-","-","-","-","-","-","-","-"]
[null,null," -"," -"," -"," -"," -"," -"," -",{"$error":"#VALUE!"}," -"," -"]
["Target3",null,"Target3"]
["Target4",null,"Target4"]

{"sheet":"CHART","index":11,"n_rows":46,"n_cols":6,"rows_kept":46,"cut":false,"hidden":true,"merged":[[45,1,46,2],[45,3,46,3],[39,1,40,2],[39,3,40,3],[41,1,42,2],[41,3,42,3],[43,1,44,2],[43,3,44,3],[33,1,34,2],[33,3,34,3],[35,1,36,2],[35,3,36,3],[37,1,38,2],[37,3,38,3]]}
["Chart Selection ",{"$f":"Homepage!$M$3","v":"QOF CKD code with ACR recorded"},{"$f":"VLOOKUP(B1,B2:C4,2,0)","v":"NIS08-CKD04"}]
["Chart List ","evidence of CKD with BP below 140/90","NIS08-CKD02","evidence of CKD not coded CKD","NIS08-CKD02%",{"$f":"IFERROR(TRENDS!AA51,#N/A)","v":0.67436006374331869}]
[null,"evidence of CKD on Statins","NIS08-CKD03","evidence of CKD with BP below 140/90","NIS08-CKD03%",{"$f":"IFERROR(TRENDS!AC51,#N/A)","v":0.76957619689535761}]
[null,"QOF CKD code with ACR recorded","NIS08-CKD04","evidence of CKD not on Statins","NIS08-CKD04%",{"$f":"IFERROR(TRENDS!AE51,#N/A)","v":0.65069886448449132}]
[]
[]
[{"$f":"PRACTICE!E2","v":"F86627"},null,"Completed","< Min","Remain to min"]
[{"$f":"IF(B9=B4,Detail!H3,Detail!G3)","v":"NIS08-CKD01"},{"$f":"IF(B9=B4,Detail!H6,Detail!G6)","v":"evidence of CKD coded CKD"},{"$f":"IF(SUMIFS(WF_CKD_DATA[[#All],[08-CKD]],WF_CKD_DATA[[#All],[OrgID]],CHART!A7,WF_CKD_DATA[[#All],[Rel_D]],Locations!E17)=0,\"-\",IF(A8=Detail!G3,(SUMIFS(WF_CKD_DATA[[#All],[08-CKD]],WF_CKD_DATA[[#All],[OrgID]],CHART!A7,WF_CKD_DATA[[#All],[Rel_D]],Locations!E17)),(SUMIFS(WF_CKD_DATA[[#All],[NIS08-CKD01]],WF_CKD_DATA[[#All],[OrgID]],CHART!A7,WF_CKD_DATA[[#All],[Rel_D]],Locations!E17))))","v":429},{"$f":"C8","v":429}]
[{"$f":"C1","v":"NIS08-CKD04"},{"$f":"INDIRECT(\"B\"&(MATCH(A9,C2:C4)+1))","v":"QOF CKD code with ACR recorded"},{"$f":"IF(SUMIFS(INDIRECT(\"WF_CKD_DATA[[#All],[\"&$A$9&\"]]\"),WF_CKD_DATA[[#All],[OrgID]],$A$7,WF_CKD_DATA[[#All],[Rel_D]],Locations!$E$17)=0,\"-\",(SUMIFS(INDIRECT(\"WF_CKD_DATA[[#All],[\"&$A$9&\"]]\"),WF_CKD_DATA[[#All],[OrgID]],$A$7,WF_CKD_DATA[[#All],[Rel_D]],Locations!$E$17)))","v":264},{"$f":"IFERROR(C8*D12,\"-\")","v":214.5},{"$f":"IFERROR(ROUND(MAX(D9-C9,0),0),\"-\")","v":0}]
["xx",{"$f":"VLOOKUP(A9,C2:D4,2,0)","v":"evidence of CKD not on Statins"},{"$f":"IFERROR(C8-C9,\"-\")","v":165},{"$f":"IFERROR(D8-D9,\"-\")","v":214.5}]
[]
[{"$f":"A9&\"%\"","v":"NIS08-CKD04%"},null,{"$f":"IFERROR(C9/C8,\"-\")","v":0.61538461538461542},{"$f":"VLOOKUP(A9,TRENDS!$B$16:$C$19,2,0)","v":0.5},{"$f":"IFERROR(D12-C12,\"-\")","v":-0.11538461538461542}]
["not%",null,{"$f":"IFERROR(1-C12,\"-\")","v":0.38461538461538458},{"$f":"1-D12","v":0.5}]
["Ave",{"$f":"VLOOKUP(A12,E2:F4,2,0)","v":0.65069886448449132}]
[]
[]
[]
[]
[null,null,null,{"$f":"IFERROR(D9/D8,\"-\")","v":0.5}]
[]
[]
[]
[]
[]
[]
[]
[]
[]
[]
[]
[]
[]
[]
[null,"ELIGIBLE",null,{"$f":"_xlfn.IFNA( CHART!B35, \"-\")","v":0}]
[]
[null,"AIM%",null,{"$f":"_xlfn.IFNA(CHART!C39,\"-\")","v":0}]
[]
[null,"TOTAL REMAINING",null,{"$f":"_xlfn.IFNA(CHART!B37,\"-\")","v":0}]
[]
[null,"MIN REMAINING",null,{"$f":"_xlfn.IFNA(CHART!D36,\"-\")","v":0}]
[]
[null,"COMPLETED",null,{"$f":"_xlfn.IFNA(CHART!B36,\"-\")","v":"AIM%"}]
[]
[null,"ACHIEVED%",null,{"$f":"_xlfn.IFNA(CHART!B39,\"-\")","v":0}]
[]
[null,"WF AVERAGE%",null,{"$f":"_xlfn.IFNA(CHART!A41, \"-\")","v":0}]

{"sheet":"Sheet2","index":12,"n_rows":5,"n_cols":7,"rows_kept":5,"cut":false,"hidden":true,"merged":[]}
["Column1","Column2","Column3","Column4","Column5","Column6","Column7"]
["Column8","Column10","Column11","Column12","Column13","Column14","Column15"]
["Search","{00-00} Listsize","{08-CKD} eGFR evidence of CKD","{NIS08-CKD01}: evidence of CKD coded CKD (QOF v46)","{NIS08-CKD02}: evidence of CKD with BP below 140/90","{NIS08-CKD03}: evidence of CKD on Statins","NIS08-CKD04: evidence of CKD has ACR"]
["OrgID","00-00","08-CKD","NIS08-CKD01","NIS08-CKD02","NIS08-CKD03","NIS08-CKD04"]
["OrgID","Listsize","eGFR evidence of CKD"," evidence of CKD coded CKD (QOF v33","evidence of CKD with BP below 140/90","evidence of CKD on Statins","evidence of CKD has ACR"]

{"sheet":"Sheet3","index":13,"n_rows":10,"n_cols":4,"rows_kept":10,"cut":false,"hidden":true,"merged":[]}
["Metric","MetricID","Target1","Target2"]
["MHA Depression Review + Activity (12M)",1,0.35]
["MHA Depression Review + Activity (IN YEAR)",2,0.35]
["Anti-Psych non-SMI Review + Activity (12M)",3,0.7]
["Anti-Psych non-SMI Review + Activity (IN YEAR)",4,0.7]
["SMI Review + Activity (12M)",5,0.7]
["SMI Review + Activity (IN YEAR)",6,0.7]
["EPC Action Plan (FY)",7]
["EPC Post-Discharge Review (FY) + EPC (2FY)",8]
["Neuroleptic Injection Patients (Q1-Q4 Total)",9]

{"sheet":"Sheet4","index":14,"n_rows":267,"n_cols":18,"rows_kept":267,"cut":false,"hidden":true,"merged":[]}
["Status","Practice ID","Practice","Locality ID","Locality","SubLocality ID","SubLocality","PCN/Network","PCN code","Clinical System","Address 1","Address 2","Postcode","Grid Reference","X (easting)","Y (northing)","Latitude","Longitude"]
["Active","F82005","Church Elm Lane Medical Practice","BK","Barking and Dagenham","BK-1","East","Network East","U86967","EMISweb","Church Elm Lane","Dagenham","RM10 9RR","TQ 49667 84556",549667,184556,51.540066000000003,0.15673988]
["Active","Y01719","Broad Street Medical Centre","BK","Barking and Dagenham","BK-1","East","Network East","U86968","EMISweb","Broad Street Resource Centre","Dagenham","RM10 9HU","TQ 49367 83962",549367,183962,51.534807999999998,0.15216547999999999]
["Active","Y02575","Porters Avenue Doctors Surgery","BK","Barking and Dagenham","BK-1","East","Network East","U86969","EMISweb","234 Porters Avenue","Dagenham","RM8 2EQ","TQ 47283 85077",547283,185077,51.545372999999998,0.12260706]
["Active","F82003","First Avenue Surgery","BK","Barking and Dagenham","BK-2","East One","Network East One","U27362","EMISweb","2 First Avenue","Dagenham","RM10 9AT","TQ 49762 83388",549762,183388,51.529546000000003,0.15761231000000001]
["Active","F82015","Hedgemans Surgery","BK","Barking and Dagenham","BK-2","East One","Network East One","U27362","EMISweb","92 Hedgemans Road","Dagenham","RM9 6HT","TQ 48734 84495",548734,184495,51.539763999999998,0.14327081999999999]
["Active","F82017","St Albans Surgery ","BK","Barking and Dagenham","BK-2","East One","Network East One","U27362","EMISweb","Urswick Road","Dagenham","RM9 6EA","TQ 48052 84181",548052,184181,51.537121999999997,0.13331214999999999]
["Active","F82634","Heathway Medical Centre","BK","Barking and Dagenham","BK-2","East One","Network East One","U27362","EMISweb","Morland Road ","Dagenham","RM10 9HU","TQ 49367 83962",549367,183962,51.534807999999998,0.15216547999999999]
["Active","F82678","Dr Alkaisy Surgery ","BK","Barking and Dagenham","BK-2","East One","Network East One","U27362","EMISweb","Urswick Road","Dagenham","RM9 6EA","TQ 48052 84181",548052,184181,51.537121999999997,0.13331214999999999]
["Active","F82679","Parkview Medical Practice","BK","Barking and Dagenham","BK-2","East One","Network East One","U27362","EMISweb","199 Reede Road","Dagenham","RM10 8EJ","TQ 49877 85126",549877,185126,51.545130999999998,0.16000821000000001]
["Active","F82034","Victoria Medical Centre","BK","Barking and Dagenham","BK-3","New West","Network New West","U26744","EMISweb","1 Queens Road","Barking","IG11 8GD","TQ 44085 84494",544085,184494,51.540959999999998,7.6282445000000004E-2]
["Active","F82042","Aurora Medcare","BK","Barking and Dagenham","BK-3","New West","Network New West","U26744","EMISweb","1 King Edwards Road","Barking","IG11 7TB","TQ 44643 83708",544643,183708,51.533754999999999,8.4000310999999994E-2]
["Active","F82625","Abbey Medical centre","BK","Barking and Dagenham","BK-3","New West","Network New West","U26744","EMISweb","1 Harpour Road","Barking","IG11 8RJ","TQ 44215 84642",544215,184642,51.542256000000002,7.8216283999999997E-2]
["Active","Y01280","Shifa Medical Practice","BK","Barking and Dagenham","BK-3","New West","Network New West","U26744","EMISweb","Gasgoine Road","Barking","IG11 7RS","TQ 44478 83438",544478,183438,51.531371,8.1512427999999998E-2]
["Active","F82027","Faircross Health Centre","BK","Barking and Dagenham","BK-3","New West","Network New West","U26744","EMISweb","51 Upney Lane","Barking","IG11 9LP","TQ 45367 84850",545367,184850,51.54383,9.4902305000000006E-2]
["Active","F82001","Halbutt Street Surgery","BK","Barking and Dagenham","BK-4","West One","Network West One","U11211","EMISweb","2 Halbutt Street","Dagenham","RM9 5AS","TQ 48956 85305",548956,185305,51.546982999999997,0.14681208000000001]
["Active","F82018","Barking Medical  Group Practice","BK","Barking and Dagenham","BK-4","West One","Network West One","U11211","EMISweb","130 Upney lane","Barking","IG11 9LT","TQ 45536 84574",545536,184574,51.541307000000003,9.7223614999999999E-2]
["Active","F82040","John Smith House","BK","Barking and Dagenham","BK-4","West One","Network West One","U11211","EMISweb","145-207 Bevan Avenue","Barking","IG11 9NS","TQ 46496 84245",546496,184245,51.538102000000002,0.11091985]
["Active","F82612","The White House","BK","Barking and Dagenham","BK-4","West One","Network West One","U11211","EMISweb","12 Movers Lane","Barking","IG11 7UN","TQ 44930 83744",544930,183744,51.534005000000001,8.8149991999999996E-2]
["Active","F82647","Dr Gupta & Partner","BK","Barking and Dagenham","BK-4","West One","Network West One","U11211","EMISweb","7 Salisbury Avenue","Barking","IG11 9XQ","TQ 44605 84272",544605,184272,51.538831999999999,8.3684289999999995E-2]
["Active","F82650","Ripple Road Medical Centre","BK","Barking and Dagenham","BK-4","West One","Network West One","U11211","EMISweb","343 Ripple Road","Barking","IG11 7RJ","TQ 45217 83938",545217,183938,51.535674,9.2364823999999998E-2]
["Active","F82680","Highgrove Surgery","BK","Barking and Dagenham","BK-4","West One","Network West One","U11211","SystmOne","Upney Lane ","Barking","IG11 9LX","TQ 45644 84306",545644,184306,51.538871,9.8669044999999997E-2]
["Active","F82012","Five Elms","BK","Barking and Dagenham","BK-5","North","Network North","U55387","EMISweb","Five Elms Road","Dagenham","RM9 5TT","TQ 48622 86004",548622,186004,51.553351999999997,0.14229391]
["Active","F82025","Julia Engwell Surgery","BK","Barking and Dagenham","BK-5","North","Network North","U55387","EMISweb","Woodward Road","Dagenham","RM9 4SR","TQ 47520 84362",547520,184362,51.538887000000003,0.12572291999999999]
["Active","F82051","Laburnum Health centre","BK","Barking and Dagenham","BK-5","North","Network North","U55387","EMISweb","11 Althorne Way","Dagenham","RM10 7DF","TQ 49234 86817",549234,186817,51.560495000000003,0.15145929999999999]
["Active","F82642","Gables Surgery","BK","Barking and Dagenham","BK-5","North","Network North","U55387","EMISweb","Markyate Road","Dagenham","RM8 2LD","TQ 46953 85105",546953,185105,51.545710999999997,0.11786323999999999]
["Active","F82661","Green Lane Surgery","BK","Barking and Dagenham","BK-5","North","Network North","U55387","EMISweb","872 Green Lane","Dagenham","RM8 1BX","TQ 48005 86869",548005,186869,51.561286000000003,0.13376487000000001]
["Active","F86040","The Surgery","BK","Barking and Dagenham","BK-5","North","Network North","U55387","EMISweb","620 Longbridge Road","Dagenham","RM8 2AJ","TQ 46755 85732",546755,185732,51.551395999999997,0.11527123]
["Active","Y01795","The Oval Practice","BK","Barking and Dagenham","BK-5","North","Network North","U55388","EMISweb","69 Oval Road North","Dagenham","RM10 9ET","TQ 49697 83763",549697,183763,51.532933,0.15683522999999999]
["Active","F82038","Valence Medical Centre","BK","Barking and Dagenham","BK-5","North","Network North","U55389","EMISweb","563 Valence Avenue","Dagenham","RM8 3RH","TQ 47822 85951",547822,185951,51.553086,0.13074125]
["Active","F82604","Marks Gate Medical Practice","BK","Barking and Dagenham","BK-6","Central","Network Central","U92874","EMISweb","Lawn Farm Grove","Dagenham","RM6 5LL","TQ 48155 89472",548155,189472,51.584634999999999,0.13702396999999999]
["Active","F82660","Tulasi Medical Centre","BK","Barking and Dagenham","BK-6","Central","Network Central","U92874","EMISweb","10 Bennetts Castle Lane","Dagenham","RM8 3XU","TQ 47363 86819",547363,186819,51.561005000000002,0.12448914]
["Active","F82677","Becontree Medical Centre","BK","Barking and Dagenham","BK-6","Central","Network Central","U92874","EMISweb","645 Becontree Avenue","Dagenham","RM8 3HP","TQ 48516 86671",548516,186671,51.559373000000001,0.1410476]
["Active","F84013","Stamford Hill Surgery ","CH","City & Hackney","CH-NE1","Springfield Park (NE1)","Springfield Park (NE1)","U89154","EMISweb","2 Egerton Road","Stamford Hill","N16 6UA","TQ 33741 87885",533741,187885,51.573976000000002,-7.1492951999999999E-2]
["Active","F84686","Cranwich Road Surgery ","CH","City & Hackney","CH-NE1","Springfield Park (NE1)","Springfield Park (NE1)","U89154","EMISweb","62 Cranwich Road",null,"N16 5JF","TQ 33045 87827",533045,187827,51.573619000000001,-8.1552204000000003E-2]
["Active","Y03049","Spring Hill Practice","CH","City & Hackney","CH-NE1","Springfield Park (NE1)","Springfield Park (NE1)","U89154","EMISweb","19-21 Oldhill Street",null,"N16 6LU","TQ 34202 87381",534202,187381,51.569336999999997,-6.5037069000000003E-2]
["Active","F84018","The Nightingale Practice","CH","City & Hackney","CH-NE2","Hackney Downs (NE2)","Hackney Downs (NE2)","U21268","EMISweb","10 Kenninghall Rd","Clapton","E5 8BY","TQ 34412 86145",534412,186145,51.55818,-6.2481117000000003E-2]
["Active","F84080","The Gadvhi Practice","CH","City & Hackney","CH-NE2","Hackney Downs (NE2)","Hackney Downs (NE2)","U21268","EMISweb","1a Fountayne Road",null,"N16 7EA","TQ 34209 86834",534209,186834,51.564419999999998,-6.5144830000000001E-2]
["Active","F84619","The Riverside Practice","CH","City & Hackney","CH-NE2","Hackney Downs (NE2)","Hackney Downs (NE2)","U21268","EMISweb","14 Urban Hive, Theydon Rd",null,"E5 9BQ","TQ 35164 86953",535164,186953,51.565261999999997,-5.1329751999999999E-2]
["Active","F84668","Clapton Surgery","CH","City & Hackney","CH-NE2","Hackney Downs (NE2)","Hackney Downs (NE2)","U21268","EMISweb","14 Theydon Road",null,"E5 9BQ","TQ 35164 86953",535164,186953,51.565261999999997,-5.1329751999999999E-2]
["Active","F84685","Elm Practice","CH","City & Hackney","CH-NE2","Hackney Downs (NE2)","Hackney Downs (NE2)","U21268","EMISweb","1a Fountayne Road",null,"N16 7EA","TQ 34209 86834",534209,186834,51.564419999999998,-6.5144830000000001E-2]
["Active","F84711","Rosewood Practice","CH","City & Hackney","CH-NE2","Hackney Downs (NE2)","Hackney Downs (NE2)","U21268","EMISweb","1a Fountayne Road",null,"N16 7EA","TQ 34209 86834",534209,186834,51.564419999999998,-6.5144830000000001E-2]
["Active","F84720","Healy Medical Centre","CH","City & Hackney","CH-NE2","Hackney Downs (NE2)","Hackney Downs (NE2)","U21268","EMISweb","200 Upper Clapton Road",null,"E5 9HD","TQ 35028 87268",535028,187268,51.568125000000002,-5.3169741999999999E-2]
["Active","F84036","Cedar Practice ","CH","City & Hackney","CH-NW1","Woodberry Wetlands (NW1)","Woodberry Wetlands (NW1)","U46293","EMISweb","John Scott Health Centre","Green Lanes","N4 2NU","TQ 32221 87203",532221,187203,51.568204999999999,-9.3670042999999995E-2]
["Active","F84115","Statham Grove Surgery","CH","City & Hackney","CH-NW1","Woodberry Wetlands (NW1)","Woodberry Wetlands (NW1)","U46293","EMISweb","Statham Grove",null,"N16 9DP","TQ 32544 86016",532544,186016,51.557462999999998,-8.9459644000000005E-2]
["Active","F84119","The Heron Practice","CH","City & Hackney","CH-NW1","Woodberry Wetlands (NW1)","Woodberry Wetlands (NW1)","U46293","EMISweb","John Scott Health Centre","Green Lanes","N4 2NU","TQ 32221 87203",532221,187203,51.568204999999999,-9.3670042999999995E-2]
["Active","F84716","Allerton Road Medical Centre","CH","City & Hackney","CH-NW1","Woodberry Wetlands (NW1)","Woodberry Wetlands (NW1)","U46293","EMISweb","34a Allerton Road",null,"N16 5UF","TQ 32456 86933",532456,186933,51.565724000000003,-9.0383086000000001E-2]
["Active","F84008","Barton House Health Centre","CH","City & Hackney","CH-NW2","Clissold Park (NW2)","Clissold Park (NW2)","U51492","EMISweb","233 Albion Road","Stoke Newington","N16 9JT","TQ 32926 86369",532926,186369,51.560544999999998,-8.3819307999999995E-2]
["Active","F84033","Somerford Grove Practice","CH","City & Hackney","CH-NW2","Clissold Park (NW2)","Clissold Park (NW2)","U51492","EMISweb","Somerford Grove",null,"N16 7UA","TQ 33722 85639",533722,185639,51.553797000000003,-7.2620630000000005E-2]
["Active","F84636","Barretts Grove Surgery","CH","City & Hackney","CH-NW2","Clissold Park (NW2)","Clissold Park (NW2)","U51492","EMISweb","6 Barretts Grove",null,"N16 8AR","TQ 33334 85451",533334,185451,51.552199999999999,-7.8284858999999998E-2]
["Active","F84694","Brooke Road Surgery","CH","City & Hackney","CH-NW2","Clissold Park (NW2)","Clissold Park (NW2)","U51492","EMISweb","40-42 Brooke Road",null,"N16 7LR","TQ 33833 86338",533833,186338,51.560051999999999,-7.0754775000000006E-2]
["Active","F84003","Lower Clapton Group Practice","CH","City & Hackney","CH-SE1","Hackney Marshes (SE1)","Hackney Marshes (SE1)","U05451","EMISweb","36 Lower Clapton Road",null,"E5 0PD","TQ 35145 85320",535145,185320,51.550592000000002,-5.2230775E-2]
["Active","F84015","Kingsmead Healthcare","CH","City & Hackney","CH-SE1","Hackney Marshes (SE1)","Hackney Marshes (SE1)","U05451","EMISweb","4 Kingsmead Way",null,"E9 5QG","TQ 36351 85487",536351,185487,51.551803,-3.4783215999999999E-2]
["Active","F84060","Athena Medical Centre","CH","City & Hackney","CH-SE1","Hackney Marshes (SE1)","Hackney Marshes (SE1)","U05451","EMISweb","21 Atherden Road","Clapton","E5 0QP","TQ 35057 85799",535057,185799,51.554917000000003,-5.3315426999999999E-2]
["Active","F84105","The Lea Surgery","CH","City & Hackney","CH-SE1","Hackney Marshes (SE1)","Hackney Marshes (SE1)","U05451","EMISweb","186 Homerton High Street",null,"E9 6AG","TQ 35784 85079",535784,185079,51.548273000000002,-4.311334E-2]
["Active","F84719","Latimer Health Centre","CH","City & Hackney","CH-SE1","Hackney Marshes (SE1)","Hackney Marshes (SE1)","U05451","EMISweb","4 Homerton Terrace",null,"E9 6RT","TQ 35346 84880",535346,184880,51.546590000000002,-4.9502727000000003E-2]
["Active","F84069","The Well Street Surgery","CH","City & Hackney","CH-SE2","Well Street Common (SE2)","Well Street Common (SE2)","U58256","EMISweb","28 Shore Road",null,"E9 7TA","TQ 35138 84055",535138,184055,51.539225999999999,-5.2817041000000002E-2]
["Active","F84601","Elsdale Street Surgery ","CH","City & Hackney","CH-SE2","Well Street Common (SE2)","Well Street Common (SE2)","U58256","EMISweb","28 Elsdale Street",null,"E9 6QY","TQ 35380 84483",535380,184483,51.543013999999999,-4.9165300000000002E-2]
["Active","F84620","The Wick Health Centre","CH","City & Hackney","CH-SE2","Well Street Common (SE2)","Well Street Common (SE2)","U58256","EMISweb","200 Wick Rd",null,"E9 5AN","TQ 36085 84711",536085,184711,51.544893999999999,-3.8917245000000003E-2]
["Active","F84632","The Greenhouse","CH","City & Hackney","CH-SE2","Well Street Common (SE2)","Well Street Common (SE2)","U58256","EMISweb","19 Tudor Road",null,"E9 7SN","TQ 34985 83975",534985,183975,51.538544000000002,-5.5052455E-2]
["Active","Y00403","Trowbridge Surgery ","CH","City & Hackney","CH-SE2","Well Street Common (SE2)","Well Street Common (SE2)","U58256","EMISweb","18 Merriam Avenue",null,"E9 5NE","TQ 36747 84792",536747,184792,51.545462000000001,-2.9345178999999999E-2]
["Active","F84021","London Fields Medical Centre","CH","City & Hackney","CH-SW1","London Fields (SW1)","London Fields (SW1)","U40100","EMISweb","38-44 Broadway Market",null,"E8 4QJ","TQ 34536 83745",534536,183745,51.536583999999998,-6.1610386000000003E-2]
["Active","F84035","Richmond Road Medical Centre","CH","City & Hackney","CH-SW1","London Fields (SW1)","London Fields (SW1)","U40100","EMISweb","136 Richmond Road",null,"E8 3HN","TQ 34245 84457",534245,184457,51.543050999999998,-6.5532240000000005E-2]
["Active","F84038","Beechwood Medical Centre","CH","City & Hackney","CH-SW1","London Fields (SW1)","London Fields (SW1)","U40100","EMISweb","86-86a Dalston Lane",null,"E8 3AH","TQ 33890 84780",533890,184780,51.546038000000003,-7.0525556000000003E-2]
["Active","F84063","Dalston Practice","CH","City & Hackney","CH-SW1","London Fields (SW1)","London Fields (SW1)","U40100","EMISweb","1b Madinah Road",null,"E8 1PG","TQ 34111 84978",534111,184978,51.547764999999998,-6.7264995999999994E-2]
["Active","F84117","Queensbridge Group Practice","CH","City & Hackney","CH-SW1","London Fields (SW1)","London Fields (SW1)","U40100","EMISweb","24, Holly Street",null,"E8 3XP","TQ 33838 84271",533838,184271,51.541476000000003,-7.1468413999999994E-2]
["Active","F84621","The Sandringham Practice","CH","City & Hackney","CH-SW1","London Fields (SW1)","London Fields (SW1)","U40100","EMISweb","1a Madinah Road",null,"E8 1PG","TQ 34111 84978",534111,184978,51.547764999999998,-6.7264995999999994E-2]
["Active","F84640","The Neaman Practice","CH","City & Hackney","CH-SW2","Shoreditch Park & City (SW2)","Shoreditch Park & City (SW2)","U07169","EMISweb","15 Half Moon Court",null,"EC1A 7HF","TQ 32048 81725",532048,181725,51.519018000000003,-9.8218282000000004E-2]
["Active","F84072","De Beauvoir Surgery","CH","City & Hackney","CH-SW2","Shoreditch Park & City (SW2)","Shoreditch Park & City (SW2)","U07169","EMISweb","30 Hertford Road",null,"N1 5QT","TQ 33377 83922",533377,183922,51.538449,-7.8244064000000002E-2]
["Active","F84096","The Lawson Practice","CH","City & Hackney","CH-SW2","Shoreditch Park & City (SW2)","Shoreditch Park & City (SW2)","U07169","EMISweb","St Leonard's Hospital, Nuttall St","Nuttall Street","N1 5HZ","TQ 33302 83395",533302,183395,51.533731000000003,-7.9524182999999998E-2]
["Active","F84635","Shoreditch Park Surgery","CH","City & Hackney","CH-SW2","Shoreditch Park & City (SW2)","Shoreditch Park & City (SW2)","U07169","EMISweb","10 Rushton Street",null,"N1 5DR","TQ 32796 83359",532796,183359,51.533526999999999,-8.6828572000000007E-2]
["Active","F84692","The Hoxton Surgery","CH","City & Hackney","CH-SW2","Shoreditch Park & City (SW2)","Shoreditch Park & City (SW2)","U07169","EMISweb","12 Rushton Street",null,"N1 5DR","TQ 32796 83359",532796,183359,51.533526999999999,-8.6828572000000007E-2]
["Active","F82011","St Edwards Surgery","HV","Havering","HV-1","Havering Crest","Havering Crest Network","U29424","EMISweb","7 St Edwards Way","Romford","RM1 3DQ","TQ 51307 89056",551307,189056,51.580061000000001,0.18230462]
["Active","F82019","Chadwell Heath Health Centre - The Upstairs Surgery (Dr Hamilton-Smith)","HV","Havering","HV-1","Havering Crest","Havering Crest Network","U29424","EMISweb","Ashton Garden","Chadwell Heath","RM6 6RT","TQ 48405 88264",548405,188264,51.573715,0.14011965000000001]
["Active","F82638","The Modern Medical Centre","HV","Havering","HV-1","Havering Crest","Havering Crest Network","U29424","EMISweb","195 Rush Green Road","Rush Green","RM7 0PX","TQ 51030 87418",551030,187418,51.565418000000001,0.17760643000000001]
["Active","F82039","Rush Green Medical Centre (Dr Poologanathan & Partners)","HV","Havering","HV-1","Havering Crest","Havering Crest Network","U29424","EMISweb","261 Dagenham Road","Rush Green","RM7 0XR","TQ 50932 86893",550932,186893,51.560727,0.1759684]
["Active","F82031","Rush Green Medical Centre (Dr Sanomi)","HV","Havering","HV-1","Havering Crest","Havering Crest Network","U29424","EMISweb","261 Dagenham Road","Rush Green","RM7 0XR","TQ 50932 86893",550932,186893,51.560727,0.1759684]
["Active","F82023","High Street Surgery (Dr Pervez)","HV","Havering","HV-1","Havering Crest","Havering Crest Network","U29424","EMISweb","219 High Street","Hornchurch","RM11 3XT","TQ 54233 87089",554233,187089,51.561596000000002,0.22363675]
["Active","F82663","Brentwood Road Surgery (Dr Marks)","HV","Havering","HV-1","Havering Crest","Havering Crest Network","U29424","EMISweb","107 Brentwood Road","Romford","RM1 2SB","TQ 52030 88243",552030,188243,51.572561999999998,0.19237934000000001]
["Active","F82013","Western Road Medical Centre ","HV","Havering","HV-2","Havering Marshall","Marshall Network","U50107","EMISweb","99 Western Road","Romford","RM1 3LS","TQ 51671 88948",551671,188948,51.578992,0.18750723]
["Active","F82021","The New Medical Centre","HV","Havering","HV-2","Havering Marshall","Marshall Network","U50107","EMISweb","264 Brentwood Road","Romford","RM2 5SU","TQ 52819 88475",552819,188475,51.574432999999999,0.20385631000000001]
["Active","F82009","North Street Medical Care","HV","Havering","HV-2","Havering Marshall","Marshall Network","U50107","EMISweb","274 North Street","Romford","RM1 4QJ","TQ 50672 89720",550672,189720,51.586196000000001,0.17343195]
["Active","F82686","Ashton Gardens Surgery","HV","Havering","HV-3","Havering North","North Network","U55939","EMISweb","Ashton Gardens","Chadwell Heath","RM6 6RT","TQ 48405 88264",548405,188264,51.573715,0.14011965000000001]
["Active","F82010","Petersfield Surgery","HV","Havering","HV-3","Havering North","North Network","U55939","EMISweb","70 Petersfield Ave","Harold Hill","RM3 9PD","TQ 54717 92014",554717,192014,51.605711999999997,0.23278188999999999]
["Active","F82648","Ingrebourne Medical Centre","HV","Havering","HV-3","Havering North","North Network","U55939","EMISweb","135 Straight Road","Harold Hill","RM3 7JJ","TQ 53197 91366",553197,191366,51.600304999999999,0.21056731000000001]
["Active","F82671","Straight Road Doctors Surgery (Dr Prasad)","HV","Havering","HV-3","Havering North","North Network","U55939","EMISweb","137 Straight Road","Harold Hill","RM3 7JJ","TQ 53197 91366",553197,191366,51.600304999999999,0.21056731000000001]
["Active","F82670","AbbaMoor Surgery","HV","Havering","HV-3","Havering North","North Network","U55939","EMISweb","Gooshays Drive","Harold Hill","RM3 9SU","TQ 54169 92056",554169,192056,51.606239000000002,0.22489343000000001]
["Active","F82014","Harold Hill Health Centre (Dr Kuchhai)","HV","Havering","HV-3","Havering North","North Network","U55939","EMISweb","Gooshays Drive","Harold Hill","RM3 9SU","TQ 54169 92056",554169,192056,51.606239000000002,0.22489343000000001]
["Active","F82016","Central Park Surgery (Dr Kakad)","HV","Havering","HV-3","Havering North","North Network","U55939","EMISweb","Gooshays Drive","Harold Hill","RM3 9SU","TQ 54169 92056",554169,192056,51.606239000000002,0.22489343000000001]
["Active","Y00312","The Robins Surgery","HV","Havering","HV-3","Havering North","North Network","U55939","EMISweb","Gooshays Drive","Harold Hill","RM3 9SU","TQ 54169 92056",554169,192056,51.606239000000002,0.22489343000000001]
["Active","F82007","The Greenwood Practice","HV","Havering","HV-3","Havering North","North Network","U55939","EMISweb","89 Gubbins Lane","Harold Wood","RM3 0DR","TQ 54748 90860",554748,190860,51.595334999999999,0.23272048000000001]
["Active","F82045","Oak Lodge Surgery (Dr Chowdhury)","HV","Havering","HV-3","Havering North","North Network","U55939","EMISweb","6 Oak Road","Harold Wood","RM3 0PT","TQ 54849 90533",554849,190533,51.592370000000003,0.23403325]
["Active","Y02973","Kings Park Surgery","HV","Havering","HV-3","Havering North","North Network","U55939","EMISweb","St Clements Avenue","Harold Wood","RM3 0FE","TQ 54268 90605",554268,190605,51.593176,0.22568427999999999]
["Active","F82030","Lynwood Medical Centre","HV","Havering","HV-3","Havering North","North Network","U55939","EMISweb","4 Lynwood Drive","Collier Row","RM5 3QL","TQ 49970 91426",549970,191426,51.601711999999999,0.16403546999999999]
["Active","F82630","Chase Cross Medical Centre (Dr Kulendran)","HV","Havering","HV-3","Havering North","North Network","U55939","EMISweb","Chase Cross Road","Collier Row","RM5 3PJ","TQ 50027 91251",550027,191251,51.600124000000001,0.16478307]
["Active","F82610","Dr N K Gupta Surgery","HV","Havering","HV-3","Havering North","North Network","U55939","EMISweb","206 Mawney Road","Romford","RM7 8BU","TQ 50077 89338",550077,189338,51.582923000000001,0.16468706999999999]
["Active","F82675","Billet Lane Medical Centre","HV","Havering","HV-4","Havering South","South Network","U00367","EMISweb","58b Billet Lane","Hornchurch","RM11 1XA","TQ 53895 87670",553895,187670,51.566907999999998,0.21901872]
["Active","F82055","Hornchurch Healthcare","HV","Havering","HV-4","Havering South","South Network","U00367","EMISweb","58b Billet Lane","Hornchurch","RM11 1XA","TQ 53895 87670",553895,187670,51.566907999999998,0.21901872]
["Active","F82609","Sutton Ave Surgery","HV","Havering","HV-4","Havering South","South Network","U00367","EMISweb","24 Suttons Ave","Hornchurch","RM12 4LF","TQ 53941 86488",553941,186488,51.556274999999999,0.21916472000000001]
["Active","F82002","Haiderian Medical Centre","HV","Havering","HV-4","Havering South","South Network","U00367","EMISweb","181 Corbets Tey Road","Upminster","RM14 2YN","TQ 55913 85795",555913,185795,51.549508000000003,0.24727998000000001]
["Active","F82008","Maylands Health Care","HV","Havering","HV-4","Havering South","South Network","U00367","EMISweb","300 Upper Rainham Road","Elm Park","RM12 4EQ","TQ 51980 86056",551980,186056,51.552925000000002,0.19071367]
["Active","F82028","Wood Lane Medical Centre","HV","Havering","HV-4","Havering South","South Network","U00367","EMISweb","39 Wood Lane","Elm Park","RM12 5HX","TQ 52375 85087",552375,185087,51.544113000000003,0.19598719000000001]
["Active","F82022","The Rosewood Medical Centre","HV","Havering","HV-4","Havering South","South Network","U00367","EMISweb","30 Astra Close","Hornchurch","RM12 5NJ","TQ 52722 84935",552722,184935,51.542653000000001,0.20092135999999999]
["Active","F82619","Harlow Road Surgery (Dr N Tariq)","HV","Havering","HV-4","Havering South","South Network","U00367","EMISweb","1 Harlow Road","Rainham","RM13 7UP","TQ 51752 83712",551752,183712,51.531925999999999,0.18641779999999999]
["Active","F82627","Rainham Health Centre","HV","Havering","HV-4","Havering South","South Network","U00367","EMISweb","Upminster Road South","Rainham","RM13 9AB","TQ 52533 82337",552533,182337,51.519362000000001,0.19707374999999999]
["Active","F82649","Berwick Surgery","HV","Havering","HV-4","Havering South","South Network","U00367","EMISweb","17 Berwick Road","Rainham","RM13 9QU","TQ 53679 83242",553679,183242,51.527183000000001,0.21397231999999999]
["Active","F82607","South Hornchurch Medical Practice","HV","Havering","HV-4","Havering South","South Network","U00367","EMISweb","382 Upminster Road North","North Rainham","RM13 9RZ","TQ 53703 82663",553703,182663,51.521974,0.21406560999999999]
["Active","F82674","Avon Road Surgery (Cranham Health Centre)","HV","Havering","HV-4","Havering South","South Network","U00367","EMISweb","Avon Road","Cranham","RM14 1RG","TQ 57095 87988",557095,187988,51.568883,0.26529226]
["Active","F82006","Cranham Village Surgery (Dr C Dahs & Dr IP Humberstone Surgery)","HV","Havering","HV-4","Havering South","South Network","U00367","EMISweb","143 Ingrebourne Gardens","Cranham","RM14 1BJ","TQ 56984 87288",556984,187288,51.562624999999997,0.26337961999999998]
["Active","F82053","Upminster Medical Centre","HV","Havering","HV-4","Havering South","South Network","U00367","EMISweb","226 St Mary's Lane","Upminster","RM14 3DH","TQ 56440 86625",556440,186625,51.556818999999997,0.25524323999999998]
["Active","F82624","The Upminster Bridge Surgery (Dr O'Moore)","HV","Havering","HV-4","Havering South","South Network","U00367","EMISweb","126 Upminster Road","Upminster","RM12 6PL","TQ 55046 86819",555046,186819,51.558947000000003,0.23523689]
["Active","F82033","Dr V M Patel Surgery","HV","Havering","HV-4","Havering South","South Network","U00367","EMISweb","9 Glanville Drive","Hornchurch","RM11 3SZ","TQ 54586 87037",554586,187037,51.561031999999997,0.22870229]
["Active","F84047","Custom House Surgery ","NH","Newham","NH-PCN1","South One Newham","South One Newham","U23362","EMISweb","16 Freemasons Rd",null,"E16 3NA","TQ 40635 81244",540635,181244,51.512625,2.5271616E-2]
["Active","F84666","Dr Ruiz – St Lukes Medical Centre ","NH","Newham","NH-PCN1","South One Newham","South One Newham","U23362","EMISweb","2 St Luke's Square",null,"E16 1HT","TQ 39825 81135",539825,181135,51.511847000000003,1.3563443E-2]
["Active","F84017","Star Lane Medical Centre ","NH","Newham","NH-PCN1","South One Newham","South One Newham","U23362","EMISweb","121 Star Ln",null,"E16 4QH","TQ 39602 82012",539602,182012,51.519781999999999,1.0699055000000001E-2]
["Active","F84717","Royal Docks Medical Centre ","NH","Newham","NH-PCN10","Docklands","Docklands","U56681","EMISweb","21 East Ham Manor Way",null,"E6 5NA","TQ 43258 80969",543258,180969,51.509495999999999,6.2933420000000004E-2]
["Active","F84093","Tollgate Health Centre ","NH","Newham","NH-PCN10","Docklands","Docklands","U56681","EMISweb","220 Tollgate Rd",null,"E6 5JS","TQ 42787 81629",542787,181629,51.515546000000001,5.6418168999999997E-2]
["Active","Y02928","E16 Health","NH","Newham","NH-PCN10","Docklands","Docklands","U56681","EMISweb","76 Albert Rd",null,"E16 2DY","TQ 42593 80059",542593,180059,51.501486999999997,5.2989908000000002E-2]
["Active","F84735","The Azad Practice ","NH","Newham","NH-PCN2","Central 1","Central 1","U71739","EMISweb","152 Barking Road",null,"E6 3BD","TQ 41930 83350",541930,183350,51.531225999999997,4.4768458999999997E-2]
["Active","F84669","Newham Medical Centre ","NH","Newham","NH-PCN2","Central 1","Central 1","U71739","EMISweb","576 Green St",null,"E13 9DA","TQ 41405 83360",541405,183360,51.531447,3.7208861000000003E-2]
["Active","F84010","St Bartholomew Surgery ","NH","Newham","NH-PCN2","Central 1","Central 1","U71739","EMISweb","292A Barking Road ",null,"E6 3BA","TQ 42477 83507",542477,183507,51.532499000000001,5.2712424000000001E-2]
["Active","F84004","Market Street Health Group","NH","Newham","NH-PCN2","Central 1","Central 1","U71739","EMISweb","52 Market St",null,"E6 2RA","TQ 42814 83350",542814,183350,51.531002999999998,5.7504007000000003E-2]
["Active","F84053","Greengate Medical Practice ","NH","Newham","NH-PCN2","Central 1","Central 1","U71739","EMISweb","497 Barking Road",null,"E13 8PS","TQ 40757 82646",540757,182646,51.525193000000002,2.7588027000000001E-2]
["Active","F84124","The Project Surgery ","NH","Newham","NH-PCN2","Central 1","Central 1","U71739","EMISweb","10 Lettsom Walk",null,"E13 0LN","TQ 40253 83419",540253,183419,51.532263999999998,2.0635384999999999E-2]
["Active","F84050","Boleyn Medical Centre ","NH","Newham","NH-PCN2","Central 1","Central 1","U71739","EMISweb","152 Barking Road",null,"E6 3BD","TQ 41930 83350",541930,183350,51.531225999999997,4.4768458999999997E-2]
["Active","F84052","Essex Lodge ","NH","Newham","NH-PCN3","Newham Central","Newham Central","U11373","EMISweb","94 Greengate St",null,"E13 0AS","TQ 40684 82946",540684,182946,51.527906999999999,2.6656164E-2]
["Active","F84681","Balaam Street Practice ","NH","Newham","NH-PCN3","Newham Central","Newham Central","U11373","EMISweb","113 Balaam St",null,"E13 8AF","TQ 40488 82808",540488,182808,51.526716,2.3777605E-2]
["Active","F84642","Lucas Avenue Surgery","NH","Newham","NH-PCN3","Newham Central","Newham Central","U11373","EMISweb",null,null,"E13 0QP","TQ 40943 83883",540943,183883,51.536262000000001,3.0761987000000001E-2]
["Active","F84749","Carpenter's Practice","NH","Newham","NH-PCN3","Newham Central","Newham Central","U11373","EMISweb","236-252 High St",null,"E15 2JA","TQ 38568 83938",538568,183938,51.537343999999997,-3.4372387999999999E-3]
["Active","F84658","Sangam Surgery ","NH","Newham","NH-PCN4","North East 1","North East 1","U34188","EMISweb","Snowshill Rd",null,"E12 6BE","TQ 42142 85378",542142,185378,51.549394999999997,4.8640959999999997E-2]
["Active","F84660","Dr CM Patel ","NH","Newham","NH-PCN4","North East 1","North East 1","U34188","EMISweb","2 Jephson Rd",null,"E7 8LZ","TQ 41250 84414",541250,184414,51.540956999999999,3.5398279999999997E-2]
["Active","F84088","Plashet Medical Centre ","NH","Newham","NH-PCN4","North East 1","North East 1","U34188","EMISweb","152 Plashet Rd",null,"E13 0QT","TQ 41097 84021",541097,184021,51.537464,3.3036159000000002E-2]
["Active","F84670","Westbury Road Medical Practice","NH","Newham","NH-PCN4","North East 1","North East 1","U34188","EMISweb","45 Westbury Terrace",null,"E7 8BU","TQ 40876 84941",540876,184941,51.545786,3.0219711999999999E-2]
["Active","F84729","The Manor Park Practice","NH","Newham","NH-PCN4","North East 1","North East 1","U34188","EMISweb","778 Romford Rd",null,"E12 5JG","TQ 42725 85896",542725,185896,51.553902999999998,5.7253423999999997E-2]
["Active","F84641","Birchdale Road Medical Practice ","NH","Newham","NH-PCN4","North East 1","North East 1","U34188","EMISweb","2 Birchdale Rd",null,"E7 8AR","TQ 41441 85069",541441,185069,51.546795000000003,3.8413612E-2]
["Active","F84739","E12 Medical Practice ","NH","Newham","NH-PCN5","North East 2","North East 2","U06978","EMISweb","243 High Street North",null,"E12 6SJ","TQ 42286 84464",542286,184464,51.541145999999998,5.0347099999999999E-2]
["Active","F84006","Shrewsbury Road Surgery ","NH","Newham","NH-PCN5","North East 2","North East 2","U06978","EMISweb","Shrewsbury Annexe' Shrewsbury Road",null,"E7 8QP","TQ 41796 84426",541796,184426,51.540928000000001,4.3270927000000001E-2]
["Active","F84074","Wordsworth Health Centre ","NH","Newham","NH-PCN5","North East 2","North East 2","U06978","EMISweb","19 Wordsworth Avenue",null,"E12 6SU","TQ 42172 84503",542172,184503,51.541525,4.8720109999999997E-2]
["Active","F84741","Plashet Harmony Practice","NH","Newham","NH-PCN5","North East 2","North East 2","U06978","EMISweb","Eastham Memorial Hospital",null,"E7 8QP","TQ 41796 84426",541796,184426,51.540928000000001,4.3270927000000001E-2]
["Active","F84070","Lathom Medical Centre ","NH","Newham","NH-PCN5","North East 2","North East 2","U06978","EMISweb","2A Lathom Rd",null,"E6 2DU","TQ 42458 84130",542458,184130,51.538102000000002,5.2690542999999999E-2]
["Active","F84672","E7 Health - First 4 Health Group","NH","Newham","NH-PCN6","North Newham ","North Newham ","U52641","EMISweb","157 Leytonstone Rd",null,"E15 1LH","TQ 39102 85361",539102,185361,51.55,4.8192100999999996E-3]
["Active","F84097","Claremont Clinic ","NH","Newham","NH-PCN6","North Newham ","North Newham ","U52641","EMISweb","459-463 Romford Rd",null,"E7 8AB","TQ 41105 85137",541105,185137,51.547490000000003,3.3598484999999997E-2]
["Active","F84724","Woodgrange Medical Practice ","NH","Newham","NH-PCN6","North Newham ","North Newham ","U52641","EMISweb","40 Woodgrange Rd",null,"E7 0QH","TQ 40516 85243",540516,185243,51.548589,2.5152046000000001E-2]
["Active","F84092","Glen Road Medical Centre ","NH","Newham","NH-PCN8","Stratford","Stratford","U23362","EMISweb","1-9 Glen Rd",null,"E13 8RU","TQ 41109 82327",541109,182327,51.522238999999999,3.2530946999999998E-2]
["Active","F84111","Abbey Road Medical Practice ","NH","Newham","NH-PCN8","Stratford","Stratford","U76122","EMISweb","28a Abbey Rd",null,"E15 3LT","TQ 39225 83671",539225,183671,51.534782999999997,5.9240574000000001E-3]
["Active","Y04273","Liberty Bridge Road ","NH","Newham","NH-PCN8","Stratford","Stratford","U76122","EMISweb","40 Liberty Bridge Rd",null,"E20 1AS","TQ 38349 85140",538349,185140,51.548198999999997,-6.1207496000000002E-3]
["Active","F84730","The Vicarage Lane Surgery","NH","Newham","NH-PCN8","Stratford","Stratford","U76122","EMISweb","10 Vicarage Ln",null,"E15 4HG","TQ 39553 84332",539553,184332,51.540641999999998,1.0911766999999999E-2]
["Active","F84121","First4Health Church Road","NH","Newham","NH-PCN8","Stratford","Stratford","U76122","EMISweb","30 Church Road",null,"E12 6AQ","TQ 42460 85199",542460,185199,51.547707000000003,5.3151713000000003E-2]
["Active","F84009","Stratford Village Surgery ","NH","Newham","NH-PCN8","Stratford","Stratford","U76122","EMISweb","50C Romford Rd",null,"E15 4BZ","TQ 39233 84486",539233,184486,51.542104999999999,6.3613932999999996E-3]
["Active","F84740","Newham Transitional Team ","NH","Newham","NH-PCN8","Stratford","Stratford","U76122","EMISweb","30 Church Rd",null,"E12 6AQ","TQ 42460 85199",542460,185199,51.547707000000003,5.3151713000000003E-2]
["Active","F84077","Newham Vicarage Practice","NH","Newham","NH-PCN9","North West 2","North West 2","U94747","EMISweb","10 Vicarage Ln",null,"E15 4ES","TQ 39491 84416",539491,184416,51.541412000000001,1.0051602E-2]
["Active","F84677","East End Medical Centre ","NH","Newham","NH-PCN9","North West 2","North West 2","U94747","EMISweb","61 Plashet Rd",null,"E13 0QA","TQ 40567 83994",540567,183994,51.537353000000003,2.5388643999999998E-2]
["Active","F84022","Stratford Health Centre ","NH","Newham","NH-PCN9","North West 2","North West 2","U94747","EMISweb","123 The Grove",null,"E15 1EN","TQ 39112 84766",539112,184766,51.544649999999997,4.7282946000000003E-3]
["Active","F84086","The Forest Practice","NH","Newham","NH-PCN9","North West 2","North West 2","U94747","EMISweb","121 Woodgrange Rd",null,"E7 0EP","TQ 40492 85464",540492,185464,51.550581000000001,2.4894327000000001E-2]
["Active","F84014","Upton Lane Medical Centre ","NH","Newham","NH-PCN9","North West 2","North West 2","U94747","EMISweb","75-77 Upton Ln",null,"E7 9PB","TQ 40620 84636",540620,184636,51.543109000000001,2.6408576E-2]
["Active","F86652","Drive Surgery","RB","Redbridge","RB-1","Cranbrook","Cranbrook","U51307","EMISweb","68 The Drive","Ilford","IG1 3HZ","TQ 42899 87429",542899,187429,51.567633999999998,6.0384001E-2]
["Active","F86702","St Clements Surgery","RB","Redbridge","RB-1","Cranbrook","Cranbrook","U51307","EMISweb","38 Bathhurst Road","Ilford","IG1 4LA","TQ 43751 87002",543751,187002,51.563580999999999,7.2493724999999995E-2]
["Active","Y00918","Granville Medical Centre","RB","Redbridge","RB-1","Cranbrook","Cranbrook","U51307","EMISweb","4 Granville Road","Ilford","IG1 4JY","TQ 43646 86952",543646,186952,51.563158000000001,7.0959545999999998E-2]
["Active","F86042","Balfour Road Surgery","RB","Redbridge","RB-1","Cranbrook","Cranbrook","U51307","EMISweb","92 Balfour Road","Ilford","IG1 4JE","TQ 43990 86949",543990,186949,51.563043,7.5917640999999994E-2]
["Active","F86698","Cranbrook Surgery","RB","Redbridge","RB-1","Cranbrook","Cranbrook","U51307","EMISweb","465 Cranbrook Road","Ilford","IG2 6EW","TQ 43201 88032",543201,188032,51.572975,6.4983819999999998E-2]
["Active","F86008","Gants Hill Medical Centre","RB","Redbridge","RB-1","Cranbrook","Cranbrook","U51307","EMISweb","63-65 Ethelbert Gardens","Gants Hill","IG2 6UW","TQ 43151 88496",543151,188496,51.577157,6.4451751000000002E-2]
["Active","F86703","Redbridge Surgery","RB","Redbridge","RB-1","Cranbrook","Cranbrook","U51307","EMISweb","49 Windermere Gardens","Gants Hill","IG4 5BZ","TQ 42406 88530",542406,188530,51.577651000000003,5.3721702000000003E-2]
["Active","F86657","York Road Surgery","RB","Redbridge","RB-1","Cranbrook","Cranbrook","U51307","SystmOne","55 York Road","Ilford","IG1 3AF","TQ 43305 86498",543305,186498,51.559165,6.5858546000000004E-2]
["Active","F86081","Kenwood Medical Centre","RB","Redbridge","RB-2","Fairlop","Fairlop","U03653","EMISweb","Kenwood Gardens","Gants Hill","IG2 6YG","TQ 43661 88984",543661,188984,51.581412999999998,7.2005967000000004E-2]
["Active","F86083","Eastern Avenue Medical Centre","RB","Redbridge","RB-2","Fairlop","Fairlop","U03653","EMISweb","167 Eastern Avenue","Gants Hill","IG4 5AW","TQ 42226 88390",542226,188390,51.576439000000001,5.1069203000000001E-2]
["Active","F86612","Fullwell Avenue Surgery","RB","Redbridge","RB-2","Fairlop","Fairlop","U03653","EMISweb","272 Fullwell Avenue","Fullwell Cross","IG5 0SB","TQ 43621 90647",543621,190647,51.596366000000003,7.2108948000000006E-2]
["Active","F86624","Heathcote Primary Care Centre","RB","Redbridge","RB-2","Fairlop","Fairlop","U03653","EMISweb","Heathcote Avenue","Barkingside","IG5 0QS","TQ 42982 90347",542982,190347,51.593831999999999,6.2767795000000001E-2]
["Active","F86707","Fencepiece Road Medical Practice","RB","Redbridge","RB-2","Fairlop","Fairlop","U03653","EMISweb","83 Fencepiece Road","Fairlop","IG6 2NB","TQ 44453 91094",544453,191094,51.600169999999999,8.4296185999999995E-2]
["Active","F86057","The Willows Practice","RB","Redbridge","RB-2","Fairlop","Fairlop","U03653","EMISweb","Hainault Health Centre","Chigwell","IG7 4DF","TQ 45822 91978",545822,191978,51.607759999999999,0.10441554]
["Active","F86007","Forest Edge Practice","RB","Redbridge","RB-2","Fairlop","Fairlop","U03653","EMISweb","Hainault Health Centre","Chigwell","IG7 4DF","TQ 45822 91978",545822,191978,51.607759999999999,0.10441554]
["Active","F86009","The Palms Medical Centre","RB","Redbridge","RB-3","Seven Kings","Seven Kings","U27585","EMISweb","97-101 Netley Road","Newbury Park","IG2 7NW","TQ 44820 88524",544820,188524,51.576982999999998,8.8531907000000007E-2]
["Active","F86087","Goodmayes Medical Centre","RB","Redbridge","RB-3","Seven Kings","Seven Kings","U27585","EMISweb","4 Eastwood Road","Goodmayes","IG3 8XB","TQ 46331 87526",546331,187526,51.567625999999997,0.10990630999999999]
["Active","F86637","Seven Kings Practice","RB","Redbridge","RB-3","Seven Kings","Seven Kings","U27585","EMISweb","1 Salisbury Road","Seven Kings","IG3 8BG","TQ 45438 87037",545438,187037,51.563462999999999,9.6829019000000002E-2]
["Active","Y00090","Doctor's House","RB","Redbridge","RB-3","Seven Kings","Seven Kings","U27585","EMISweb","40 Cameron Road","Seven Kings","IG3 8LF","TQ 45249 87246",545249,187246,51.565389000000003,9.4190582999999994E-2]
["Active","F86034","Green Lane, Goodmayes Medical practice","RB","Redbridge","RB-3","Seven Kings","Seven Kings","U27585","EMISweb","595 Green Lane","Goodmayes","IG3 9RN","TQ 46598 87054",546598,187054,51.563316,0.11355912999999999]
["Active","F86642","Castleton Road Surgery","RB","Redbridge","RB-3","Seven Kings","Seven Kings","U27585","EMISweb","19 Castleton Road","Goodmayes","IG3 9QW","TQ 46532 87121",546532,187121,51.563935000000001,0.11263556]
["Active","F86028","Chadwell Heath Surgery","RB","Redbridge","RB-3","Seven Kings","Seven Kings","U27585","EMISweb","72 Chadwell Heath Lane","Chadwell Heath","RM6 4AF","TQ 47352 88216",547352,188216,51.573560000000001,0.12491581]
["Active","Y00155","Grove Surgery","RB","Redbridge","RB-3","Seven Kings","Seven Kings","U27585","SystmOne","200-202 Chadwell Heath Lane","Chadwell Heath","RM6 4YU","TQ 47178 88535",547178,188535,51.576472000000003,0.12254036]
["Active","F86013","Broadway Surgery","RB","Redbridge","RB-4","Wanstead & Woodford","Wanstead & Woodford","U78575","SystmOne","3 The Broadway","Woodford Green","IG8 0HF","TQ 40897 91927",540897,191927,51.608555000000003,3.3322327999999998E-2]
["Active","F86023","The Evergreen Practice","RB","Redbridge","RB-4","Wanstead & Woodford","Wanstead & Woodford","U78575","EMISweb","26 High Street","Wanstead","E11 2AQ","TQ 40453 88526",540453,188526,51.578105000000001,2.5554684000000001E-2]
["Active","F86032","Wanstead Place Surgery","RB","Redbridge","RB-4","Wanstead & Woodford","Wanstead & Woodford","U78575","EMISweb","45 Wanstead Place","Wanstead","E11 2SW","TQ 40289 88521",540289,188521,51.578100999999997,2.3187508999999999E-2]
["Active","F86731","Aldersbrook Medical Centre","RB","Redbridge","RB-4","Wanstead & Woodford","Wanstead & Woodford","U78575","EMISweb","65 Aldersbrook Road","Manor Park","E12 5DL","TQ 41394 86612",541394,186612,51.560670999999999,3.8356031999999998E-2]
["Active","F86066","Southdene Surgery","RB","Redbridge","RB-4","Wanstead & Woodford","Wanstead & Woodford","U78575","EMISweb","The Shrubberies, George Ln","South Woodford","E18 1BD","TQ 40404 90279",540404,190279,51.593868999999998,2.554851E-2]
["Active","F86641","Shrubberies Medical Centre","RB","Redbridge","RB-4","Wanstead & Woodford","Wanstead & Woodford","U78575","EMISweb","12 The Shrubberies, ","South Woodford","E18 1BD","TQ 40404 90279",540404,190279,51.593868999999998,2.554851E-2]
["Active","F86020","Glebelands Practice","RB","Redbridge","RB-4","Wanstead & Woodford","Wanstead & Woodford","U78575","EMISweb","2 Glebelands Avenue","South Woodford","E18 2AB","TQ 40310 90124",540310,190124,51.592500000000001,2.4130467999999999E-2]
["Active","F86064","Elmhurst Practice","RB","Redbridge","RB-4","Wanstead & Woodford","Wanstead & Woodford","U78575","EMISweb","114 High Road","South Woodford","E18 2QS","TQ 40129 90669",540129,190669,51.597442000000001,2.1736756999999999E-2]
["Active","F86691","Clayhall Clinic","RB","Redbridge","RB-4","Wanstead & Woodford","Wanstead & Woodford","U78575","EMISweb","14 Clayhall Avenue","Ilford","IG5 0LG","TQ 42206 90038",542206,190038,51.591251999999997,5.1447693000000003E-2]
["Active","F86012","Rydal Practice","RB","Redbridge","RB-4","Wanstead & Woodford","Wanstead & Woodford","U78575","EMISweb","375 High Road","Woodford Green","IG8 9QJ","TQ 39982 91888",539982,191888,51.608432000000001,2.0101964E-2]
["Active","F86658","Queen Mary Practice","RB","Redbridge","RB-4","Wanstead & Woodford","Wanstead & Woodford","U78575","EMISweb","114 High Road","South Woodford","E18 2QS","TQ 40129 90669",540129,190669,51.597442000000001,2.1736756999999999E-2]
["Active","F86022","Ilford Medical Centre","RB","Redbridge","RB-5","Loxford","Loxford","U20290","EMISweb","61 Cleveland Road","Ilford","IG1 1EE","TQ 43897 86254",543897,186254,51.556821999999997,7.4292691999999994E-2]
["Active","Y02987","The Practice Loxford","RB","Redbridge","RB-5","Loxford","Loxford","U20290","EMISweb","417 Ilford Lane","Ilford","IG1 2SN","TQ 44106 85110",544106,185110,51.546489000000001,7.6837077000000004E-2]
["Active","F86692","Mathukias Surgery","RB","Redbridge","RB-5","Loxford","Loxford","U20290","EMISweb","281 Ilford Lane","Ilford","IG1 2SF","TQ 43991 85477",543991,185477,51.549816,7.5329842999999994E-2]
["Active","F86082","Ilford Lane Surgery","RB","Redbridge","RB-5","Loxford","Loxford","U20290","SystmOne","417 Ilford Lane","Ilford","IG1 2SN","TQ 44106 85110",544106,185110,51.546489000000001,7.6837077000000004E-2]
["Active","F86025","Oak Tree Medical Practice","RB","Redbridge","RB-5","Loxford","Loxford","U20290","SystmOne","273-275 Green Lane","Seven Kings","IG3 9TJ","TQ 45422 86734",545422,186734,51.560744,9.6473119999999996E-2]
["Active","F86085","Hainault Surgery","RB","Redbridge","RB-6","NewCross Alliance","New Cross Alliance","U08578","EMISweb","34 New North Road","Hainault","IG6 2XG","TQ 44572 91321",544572,191321,51.602179,8.6106632000000002E-2]
["Active","F86010","Fullwell Cross Medical Centre","RB","Redbridge","RB-6","NewCross Alliance","New Cross Alliance","U08578","EMISweb","1 Tomswood Hill","Fairlop","IG6 2HG","TQ 44435 90476",544435,190476,51.594620999999997,8.3782263999999995E-2]
["Active","F86060","Newbury Group Practice","RB","Redbridge","RB-6","NewCross Alliance","New Cross Alliance","U08578","EMISweb","40 Perrymans Farm Road","Newbury Park","IG2 7LE","TQ 44654 88447",544654,188447,51.576334000000003,8.6106352999999997E-2]
["Active","F84083","Bethnal Green Health Centre","TH","Tower Hamlets","TH-NW1","The One Network","Network 1","U50771","EMISweb","60 Florida Street",null,"E2 6LL","TQ 34381 82665",534381,182665,51.526916,-6.4255604999999993E-2]
["Active","F84016","The Mission Practice","TH","Tower Hamlets","TH-NW1","The One Network","Network 1","U50771","EMISweb","208 Cambridge Heath Road",null,"E2 9LS","TQ 34907 83175",534907,183175,51.531373000000002,-5.6482689000000003E-2]
["Active","F84123","Globe Town Surgery","TH","Tower Hamlets","TH-NW1","The One Network","Network 1","U50771","EMISweb","82a Roman Road",null,"E2 0PJ","TQ 35420 82859",535420,182859,51.528410999999998,-4.9212931000000001E-2]
["Active","F84051","Strouts Place Medical Centre","TH","Tower Hamlets","TH-NW1","The One Network","Network 1","U50771","EMISweb","3 Strouts Place, Pelter Street",null,"E2 7QU","TQ 33683 82924",533683,182924,51.529409000000001,-7.4213118999999994E-2]
["Active","F84081","Spitalfields Practice","TH","Tower Hamlets","TH-NW2","East End Health Network","Network 2","U54453","EMISweb","20 Old Montague Street",null,"E1 5PB","TQ 34066 81571",534066,181571,51.517158999999999,-6.9209514E-2]
["Active","F84718","Blithehale Medical Centre","TH","Tower Hamlets","TH-NW2","East End Health Network","Network 2","U54453","EMISweb","22 Dunbridge Street",null,"E2 6JA","TQ 34306 82311",534306,182311,51.523752000000002,-6.5470924E-2]
["Active","F84733","Health E1","TH","Tower Hamlets","TH-NW2","East End Health Network","Network 2","U54453","EMISweb","9-11 Brick Lane",null,"E1 6PU","TQ 33910 81676",533910,181676,51.518140000000002,-7.1416585000000005E-2]
["Active","F84012","Albion Health Centre","TH","Tower Hamlets","TH-NW2","East End Health Network","Network 2","U54453","EMISweb","333 Whitechapel Road",null,"E1 1BU","TQ 34859 81910",534859,181910,51.520017000000003,-5.7658092000000001E-2]
["Active","F84087","Harford Health Centre","TH","Tower Hamlets","TH-NW3","Tower Network","Tower Network","U37286","EMISweb","79 Ben Jonson Road",null,"E1 4SA","TQ 35898 81752",535898,181752,51.518349000000001,-4.2753129000000001E-2]
["Active","F84039","Goodman’s Field Health Centre","TH","Tower Hamlets","TH-NW3","Tower Network","Tower Network","U37286","EMISweb","44-56 Hessel Street",null,"E1 2LP","TQ 34537 81246",534537,181246,51.514127000000002,-6.2549480000000005E-2]
["Active","F84114","City Square Medical Group","TH","Tower Hamlets","TH-NW3","Tower Network","Tower Network","U37286","EMISweb","129 Cannon Street Road",null,"E1 2LX","TQ 34595 81156",534595,181156,51.513303999999998,-6.1748474999999997E-2]
["Active","F84079","Wapping Group Practice","TH","Tower Hamlets","TH-NW3","Tower Network","Tower Network","U37286","EMISweb","22 Wapping Lane",null,"E1W 2RL","TQ 34810 80364",534810,180364,51.506135999999998,-5.8954558999999997E-2]
["Active","F84031","Jubilee Street Practice","TH","Tower Hamlets","TH-NW3","Tower Network","Tower Network","U37286","EMISweb","368-374 Commercial Road",null,"E1 0LS","TQ 35359 81212",535359,181212,51.513624999999998,-5.0723846000000003E-2]
["Active","F84731","St Katharine Docks Practice","TH","Tower Hamlets","TH-NW3","Tower Network","Tower Network","U37286","EMISweb","12-14 Nightingale House, 50 Thomas More Street",null,"E1W 1UA","TQ 34160 80441",534160,180441,51.506982999999998,-6.8285214999999996E-2]
["Active","F84044","Harley Grove Medical Centre","TH","Tower Hamlets","TH-NW4","Bow Health ","Network 5","U87199","EMISweb","15 Harley Grove",null,"E3 2AT","TQ 36903 82836",536903,182836,51.527847000000001,-2.7856860000000001E-2]
["Active","F84034","St Stephens Health Centre","TH","Tower Hamlets","TH-NW4","Bow Health ","Network 5","U87199","EMISweb","Bow Community Hall, William Place",null,"E3 5ED","TQ 36678 83316",536678,183316,51.532215000000001,-3.0912192000000002E-2]
["Active","F84030","Ruston Street Clinic (Dr Amin)","TH","Tower Hamlets","TH-NW4","Bow Health ","Network 5","U87199","EMISweb","Ruston Street",null,"E3 2LR","TQ 36931 83782",536931,183782,51.536341,-2.7085962000000002E-2]
["Active","F84055","Grove Road Surgery (Dr Shah)","TH","Tower Hamlets","TH-NW4","Bow Health ","Network 5","U87199","EMISweb","3 Ivanhoe House, 130 Grove Road",null,"E3 5TW","TQ 36133 83031",536133,183031,51.529784999999997,-3.8874542999999998E-2]
["Active","F84696","The Tredegar Practice","TH","Tower Hamlets","TH-NW4","Bow Health ","Network 5","U87199","EMISweb","35 St. Stephens Road",null,"E3 5JD","TQ 36617 83214",536617,183214,51.531312999999997,-3.1830602999999999E-2]
["Active","Y03023","St Andrews Health Centre","TH","Tower Hamlets","TH-NW5","Mile End East and Bromley by Bow Network","Network 6","U08803","EMISweb","2 Hannaford Way",null,"E3 3FF","TQ 37837 82418",537837,182418,51.523864000000003,-1.4564782E-2]
["Active","F84118","Wellington Way Health Centre","TH","Tower Hamlets","TH-NW5","Mile End East and Bromley by Bow Network","Network 6","U08803","EMISweb","5 Merchant Street",null,"E3 4LJ","TQ 36940 82648",536940,182648,51.526148999999997,-2.7396845E-2]
["Active","F84122","XX Place /Bromley-by-Bow","TH","Tower Hamlets","TH-NW5","Mile End East and Bromley by Bow Network","Network 6","U08803","EMISweb","St Leonard’s Street",null,"E3 3BT","TQ 37975 82706",537975,182706,51.526418,-1.2464196E-2]
["Active","F84054","Limehouse Practice (Gill Street)","TH","Tower Hamlets","TH-NW6","Poplar and Limehouse Network","Network 7","U60865","EMISweb","Gill St Health Centre, 11 Gill Street",null,"E14 8HQ","TQ 36891 80989",536891,180989,51.511253000000004,-2.8746565000000002E-2]
["Active","F84062","Chrisp Street Health Centre","TH","Tower Hamlets","TH-NW6","Poplar and Limehouse Network","Network 7","U60865","EMISweb","100 Chrisp Street",null,"E14 6PG","TQ 37882 81345",537882,181345,51.514211000000003,-1.4335996E-2]
["Active","F84698","Aberfeldy Practice","TH","Tower Hamlets","TH-NW6","Poplar and Limehouse Network","Network 7","U60865","EMISweb","2a Ettrick Street",null,"E14 0PU","TQ 38534 81393",538534,181393,51.514482999999998,-4.9271033000000001E-3]
["Active","F84025","Gough Walk (Dr Selvan)","TH","Tower Hamlets","TH-NW6","Poplar and Limehouse Network","Network 7","U60865","EMISweb","21 Newby Place ",null,"E14 0EY","TQ 38012 80933",538012,180933,51.510477000000002,-1.2624882E-2]
["Active","F84710","Island Health","TH","Tower Hamlets","TH-NW7","Healthy Island Network","Network 8","U09193","EMISweb","145 East Ferry Road",null,"E14 3BQ","TQ 37996 79250",537996,179250,51.495356999999998,-1.3513117E-2]
["Active","F84656","Docklands Medical Centre","TH","Tower Hamlets","TH-NW7","Healthy Island Network","Network 8","U09193","EMISweb","100 Spindrift Avenue",null,"E14 9WU","TQ 37480 78772",537480,178772,51.491188000000001,-2.1127525000000001E-2]
["Active","F84647","Island Medical Centre","TH","Tower Hamlets","TH-NW7","Healthy Island Network","Network 8","U09193","EMISweb","Roserton Street",null,"E14 3PG","TQ 38227 79604",538227,179604,51.498482000000003,-1.0049091E-2]
["Active","F84747","Barkantine Practice","TH","Tower Hamlets","TH-NW7","Healthy Island Network","Network 8","U09193","EMISweb","121 Westferry Road",null,"E14 8JH","TQ 37136 79834",537136,179834,51.500813999999998,-2.5666996000000001E-2]
["Active","F86026","Forest Surgery","WF","Waltham Forest","WF-1","Chingford/ Walthamstow","Chingford/Walthamstow","U92720","SystmOne","2 Macdonald Road","Walthamstow","E17 4BA","TQ 38283 90316",538283,190316,51.594726000000001,-5.0366318E-3]
["Active","F86700","Kings Head Medical Practice","WF","Waltham Forest","WF-1","Chingford/ Walthamstow","Chingford/Walthamstow","U92720","EMISweb","178 Kings Head Hill","Chingford","E4 7NX","TQ 37715 94859",537715,194859,51.635688000000002,-1.1447793E-2]
["Active","F86664","Larkshall Medical Centre","WF","Waltham Forest","WF-1","Chingford/ Walthamstow","Chingford/Walthamstow","U92720","EMISweb","1 Larkshall Road","Chingford","E4 7HS","TQ 38739 93914",538739,193914,51.626944999999999,2.9649466000000002E-3]
["Active","F86005","The Penryhn Surgery","WF","Waltham Forest","WF-1","Chingford/ Walthamstow","Chingford/Walthamstow","U92720","EMISweb","2a Penryn Avenue","Walthamstow","E17 5DB","TQ 36985 90544",536985,190544,51.597090999999999,-2.3674555E-2]
["Active","F86626","Dr Shantir Practice","WF","Waltham Forest","WF-1","Chingford/ Walthamstow","Chingford/Walthamstow","U92720","EMISweb","354-358 Forest Rd","Walthamstow","E17 5JG","TQ 36694 89687",536694,189687,51.589461,-2.8206729E-2]
["Active","Y01839","Lime Tree & Sinnott Healthcare Ltd","WF","Waltham Forest","WF-1","Chingford/ Walthamstow","Chingford/Walthamstow","U92720","EMISweb","12b Sinnott Road","Walthamstow","E17 5QB","TQ 35891 90652",535891,190652,51.598326999999998,-3.9417391000000003E-2]
["Active","F86689","The Bailey Practice","WF","Waltham Forest","WF-1","Chingford/ Walthamstow","Chingford/Walthamstow","U92720","EMISweb","107 Shernhall Street","Walthamstow","E17 9HS","TQ 38167 89081",538167,189081,51.583657000000002,-7.1959318999999999E-3]
["Active","F86638","The Microfaculty","WF","Waltham Forest","WF-1","Chingford/ Walthamstow","Chingford/Walthamstow","U92720","SystmOne","107 Chingford Mount Road","Chingford","E4 8LT","TQ 37307 92314",537307,192314,51.612918000000001,-1.8336228999999999E-2]
["Active","F86004","Handsworth Medical Centre","WF","Waltham Forest","WF-2","Chingford E4","Chingford E4","U47946","SystmOne","Highams Park, Handsworth Avenue","Chingford","E4 9PD"]
["Active","Y01291","Chingford Medical Practice","WF","Waltham Forest","WF-2","Chingford E4","Chingford E4","U47946","EMISweb","109 York Road","Chingford","E4 8LF","TQ 37006 92657",537006,192657,51.616073999999998,-2.2546676000000002E-2]
["Active","F86627","Churchill Medical Centre","WF","Waltham Forest","WF-2","Chingford E4","Chingford E4","U47946","EMISweb","1 Churchill Terrace","Chingford","E4 8DG","TQ 37293 92913",537293,192913,51.618304000000002,-1.8303841000000001E-2]
["Active","F86078","The Ridgeway Surgery","WF","Waltham Forest","WF-2","Chingford E4","Chingford E4","U47946","EMISweb","1 Mount Echo Avenue","Chingford","E4 7JX","TQ 37765 94083",537765,194083,51.628701999999997,-1.1030843E-2]
["Active","F86616","Old Church Surgery","WF","Waltham Forest","WF-2","Chingford E4","Chingford E4","U47946","EMISweb","99 Chingford Avenue","Chingford","E4 6RG","TQ 37534 93450",537534,193450,51.623071000000003,-1.4614411000000001E-2]
["Active","F86074","Leyton Healthcare (Oliver Road)","WF","Waltham Forest","WF-3","Leyton Collaborative","Leyton Collaborative","U87776","SystmOne","Leyton Orient Football Club (West Stand), 75 Oliver Road","Leyton","E10 5LG","TQ 37815 86429",537815,186429,51.559911999999997,-1.3312475000000001E-2]
["Active","F86011","The Manor Practice","WF","Waltham Forest","WF-3","Leyton Collaborative","Leyton Collaborative","U87776","EMISweb","454 Lea Bridge Road","Leyton","E10 7DY","TQ 37179 87682",537179,187682,51.571325999999999,-2.1992728E-2]
["Active","F86038","Sma Medical Centre","WF","Waltham Forest","WF-3","Leyton Collaborative","Leyton Collaborative","U87776","EMISweb","693-695 High Road","Leyton","E10 6RA","TQ 38108 87688",538108,187688,51.571154,-8.5942013999999994E-3]
["Active","F86018","The Ecclesbourne Practice","WF","Waltham Forest","WF-4","Forest Integrated Health","Forest Intergrated Health","U65471","SystmOne","Ecclesbourne Warwick Terrace, Leabridge Rd","Leyton","E17 9DP","TQ 38574 88755",538574,188755,51.580627,-1.4539803E-3]
["Active","F86036","The Allum Medical Centre","WF","Waltham Forest","WF-4","Forest Integrated Health","Forest Intergrated Health","U65471","EMISweb","Fairlop Road","Leytonstone","E11 1BN","TQ 38947 87574",538947,187574,51.569923000000003,3.4589922000000002E-3]
["Active","F86044","Crawley Road Medical Centre","WF","Waltham Forest","WF-4","Forest Integrated Health","Forest Intergrated Health","U65471","EMISweb","479 High Road","Leyton","E10 5EL","TQ 37940 86918",537940,186918,51.564276,-1.1318719E-2]
["Active","F86696","Francis Road Medical Centre","WF","Waltham Forest","WF-4","Forest Integrated Health","Forest Intergrated Health","U65471","EMISweb","94 Francis Road","Leyton","E10 6PP","TQ 38466 86672",538466,186672,51.561936000000003,-3.8318204999999998E-3]
["Active","F86712","Hampton Medical Centre","WF","Waltham Forest","WF-4","Forest Integrated Health","Forest Intergrated Health","U65471","EMISweb","1 Pretoria Road","Leytonstone","E11 4BB","TQ 38721 87186",538721,187186,51.566491999999997,4.7171125999999997E-5]
["Active","F86650","Lime Tree Surgery","WF","Waltham Forest","WF-4","Forest Integrated Health","Forest Intergrated Health","U65471","EMISweb","38 Cann Hall Road","Leytonstone","E11 3HZ","TQ 39258 85734",539258,185734,51.553313000000003,7.2151919999999996E-3]
["Active","F86088","The Lyndhurst Surgery","WF","Waltham Forest","WF-4","Forest Integrated Health","Forest Intergrated Health","U65471","EMISweb","53 Lyndhurst Drive","Leyton","E10 6JB","TQ 38433 87787",538433,187787,51.571964000000001,-3.8687688000000001E-3]
["Active","F86621","Green Man Medical Centre","WF","Waltham Forest","WF-5","South Leytonstone","South Leytonstone","U47812","EMISweb","1 Hanbury Drive","Leytonstone","E11 1HR","TQ 39685 87696",539685,187696,51.570836999999997,1.4148923000000001E-2]
["Active","F86045","High Road Surgery","WF","Waltham Forest","WF-5","South Leytonstone","South Leytonstone","U47812","EMISweb","287 High Road","Leytonstone","E11 4HH","TQ 39101 85749",539101,185749,51.553485999999999,4.9580980000000002E-3]
["Active","F86701","Kiyani Medical Practice","WF","Waltham Forest","WF-5","South Leytonstone","South Leytonstone","U47812","EMISweb","13 Langthorne Rd","Leytonstone","E11 4HX","TQ 38897 85957",538897,185957,51.555405999999998,2.0996700000000001E-3]
["Active","F86625","LL Medical Care (Agarwal & Agrwal Practice)","WF","Waltham Forest","WF-5","South Leytonstone","South Leytonstone","U47812","EMISweb","13 Langthorne Rd","Leytonstone","E11 4HX","TQ 38897 85957",538897,185957,51.555405999999998,2.0996700000000001E-3]
["Active","F86666","The Harrow Road Surgery","WF","Waltham Forest","WF-5","South Leytonstone","South Leytonstone","U47812","EMISweb","2-8 Harrow Road","Leytonstone","E11 3QF","TQ 39369 86366",539369,186366,51.558964000000003,9.0654107999999997E-3]
["Active","F86705","The Langthorne Sharma Family Practice","WF","Waltham Forest","WF-5","South Leytonstone","South Leytonstone","U47812","EMISweb","13 Langthorne Rd","Leytonstone","E11 4HX","TQ 38897 85957",538897,185957,51.555405999999998,2.0996700000000001E-3]
["Active","F86607","Addison Road Medical Practice","WF","Waltham Forest","WF-6","Central Walthamstow","Central Walthamstow","U93045","EMISweb","Comely Bank Clinic","Walthamstow","E17 9LY","TQ 38040 89024",538040,189024,51.583176000000002,-9.0501534999999998E-3]
["Active","F86708","Claremont Medical Centre","WF","Waltham Forest","WF-6","Central Walthamstow","Central Walthamstow","U93045","EMISweb","29-31 Claremont Medical Centre","Walthamstow","E17 5RJ","TQ 36291 90221",536291,190221,51.594357000000002,-3.3813172000000002E-2]
["Active","F86001","The Firs","WF","Waltham Forest","WF-6","Central Walthamstow","Central Walthamstow","U93045","EMISweb","26 Stephenson Road","Walthamstow","E17 7JT","TQ 36241 88655",536241,188655,51.580297000000002,-3.5141800000000001E-2]
["Active","F86086","Dr Dhital Practice","WF","Waltham Forest","WF-6","Central Walthamstow","Central Walthamstow","U93045","EMISweb","6 Linford Rd","Walthamstow","E17 3LA","TQ 38444 89544",538444,189544,51.587749000000002,-3.0181050000000001E-3]
["Active","F86644","Waltham Forest Community & Family Health Services Ltd","WF","Waltham Forest","WF-6","Central Walthamstow","Central Walthamstow","U93045","EMISweb","6 Linford Rd","Walthamstow","E17 3LA","TQ 38444 89544",538444,189544,51.587749000000002,-3.0181050000000001E-3]
["Active","F86006","Seymour Medical Centre","WF","Waltham Forest","WF-7","Walthamstow West","Walthamstow West ","U17084","EMISweb","266 Lea Bridge Road","Walthamstow","E10 7LD","TQ 36763 87420",536763,187420,51.569073000000003,-2.8093386000000001E-2]
["Active","F86030","Queens Road Medical Centre","WF","Waltham Forest","WF-7","Walthamstow West","Walthamstow West ","U17084","EMISweb","48 Queens Road","Walthamstow","E17 8PX","TQ 37259 88627",537259,188627,51.579799000000001,-2.0470187000000001E-2]
["Active","F86062","The Grove Road Medical Centre","WF","Waltham Forest","WF-7","Walthamstow West","Walthamstow West ","U17084","EMISweb","103-105 Grove Road","Walthamstow","E17 9BU","TQ 37919 88578",537919,188578,51.579197000000001,-1.0970442E-2]
["Active","F86679","Higham Hill Medical Centre","WF","Waltham Forest","WF-7","Walthamstow West","Walthamstow West ","U17084","EMISweb","258-260 Higham Hill Road","Walthamstow","E17 5RQ","TQ 36234 90272",536234,190272,51.594828999999997,-3.4615754999999998E-2]
["Active","F86058","St James Medical Practice Ltd","WF","Waltham Forest","WF-7","Walthamstow West","Walthamstow West ","U17085","EMISweb","47 St James St","Walthamstow","E17 7NH","TQ 36455 88670",536455,188670,51.580379999999998,-3.2049451E-2]
["N/A","Y06760","City & Hackney GP Confederation","CH","City & Hackney",null,null,null,null,"EMISweb"]

{"sheet":"DATA","index":15,"n_rows":1171,"n_cols":12,"rows_kept":1171,"cut":false,"hidden":true,"merged":[]}
["Rel_D","OrgID","00-00","08-CKD","NIS08-CKD01","NIS08-CKD02","NIS08-CKD03","NIS08-CKD04","Practice","Locality ID","SubLocality ID","SubLocality"]
["2021-10-01","F86078",6905,347,109,123,207,58,"The Ridgeway Surgery","WF","WF-2","Chingford E4"]
["2021-10-01","F86086",6180,84,63,38,48,19,"Dr Dhital Practice","WF","WF-6","Central Walthamstow"]
["2021-10-01","F86058",16559,256,208,158,180,117,"St James Medical Practice Ltd","WF","WF-7","Walthamstow West"]
["2021-10-01","F86062",7321,161,110,63,122,53,"The Grove Road Medical Centre","WF","WF-7","Walthamstow West"]
["2021-10-01","F86616",7799,286,249,190,172,111,"Old Church Surgery","WF","WF-2","Chingford E4"]
["2021-10-01","F86621",6421,158,145,79,129,50,"Green Man Medical Centre","WF","WF-5","South Leytonstone"]
["2021-10-01","F86088",4904,111,96,33,81,49,"The Lyndhurst Surgery","WF","WF-4","Forest Integrated Health"]
["2021-10-01","F86607",15127,267,240,142,207,156,"Addison Road Medical Practice","WF","WF-6","Central Walthamstow"]
["2021-10-01","F86011",9593,225,169,139,157,117,"The Manor Practice","WF","WF-3","Leyton Collaborative"]
["2021-10-01","F86030",8137,168,139,98,132,86,"Queens Road Medical Centre","WF","WF-7","Walthamstow West"]
["2021-10-01","F86005",9384,203,185,92,137,59,"The Penryhn Surgery","WF","WF-1","Chingford/ Walthamstow"]
["2021-10-01","F86006",6692,149,111,68,89,39,"Seymour Medical Centre","WF","WF-7","Walthamstow West"]
["2021-10-01","F86044",10125,106,94,43,71,17,"Crawley Road Medical Centre","WF","WF-4","Forest Integrated Health"]
["2021-10-01","F86045",2019,53,45,20,41,35,"High Road Surgery","WF","WF-5","South Leytonstone"]
["2021-10-01","F86036",15175,321,235,131,212,87,"The Allum Medical Centre","WF","WF-4","Forest Integrated Health"]
["2021-10-01","F86038",11379,210,167,129,155,113,"Sma Medical Centre","WF","WF-3","Leyton Collaborative"]
["2021-10-01","F86701",3769,80,80,50,66,35,"Kiyani Medical Practice","WF","WF-5","South Leytonstone"]
["2021-10-01","F86705",3551,63,61,40,44,26,"The Langthorne Sharma Family Practice","WF","WF-5","South Leytonstone"]
["2021-10-01","F86696",6932,131,125,68,103,52,"Francis Road Medical Centre","WF","WF-4","Forest Integrated Health"]
["2021-10-01","F86700",3876,179,179,112,124,65,"Kings Head Medical Practice","WF","WF-1","Chingford/ Walthamstow"]
["2021-10-01","Y01291",9040,390,356,213,265,174,"Chingford Medical Practice","WF","WF-2","Chingford E4"]
["2021-10-01","Y01839",6340,160,142,82,127,39,"Lime Tree & Sinnott Healthcare Ltd","WF","WF-1","Chingford/ Walthamstow"]
["2021-10-01","F86708",2856,62,61,30,50,27,"Claremont Medical Centre","WF","WF-6","Central Walthamstow"]
["2021-10-01","F86712",3329,75,72,32,62,18,"Hampton Medical Centre","WF","WF-4","Forest Integrated Health"]
["2021-10-01","F86644",9590,224,181,92,146,58,"Waltham Forest Community & Family Health Services Ltd","WF","WF-6","Central Walthamstow"]
["2021-10-01","F86650",8069,146,125,62,92,54,"Lime Tree Surgery","WF","WF-4","Forest Integrated Health"]
["2021-10-01","F86625",5887,162,140,69,109,58,"LL Medical Care (Agarwal & Agrwal Practice)","WF","WF-5","South Leytonstone"]
["2021-10-01","F86626",6852,108,95,49,68,30,"Dr Shantir Practice","WF","WF-1","Chingford/ Walthamstow"]
["2021-10-01","F86679",6115,85,79,50,70,39,"Higham Hill Medical Centre","WF","WF-7","Walthamstow West"]
["2021-10-01","F86689",4368,85,71,58,58,50,"The Bailey Practice","WF","WF-1","Chingford/ Walthamstow"]
["2021-10-01","F86664",8430,202,153,135,138,113,"Larkshall Medical Centre","WF","WF-1","Chingford/ Walthamstow"]
["2021-10-01","F86666",14764,269,255,154,194,141,"The Harrow Road Surgery","WF","WF-5","South Leytonstone"]
["2021-10-01","F86001",7744,212,184,100,129,30,"The Firs","WF","WF-6","Central Walthamstow"]
["2021-10-01","F86627",13357,538,477,223,354,113,"Churchill Medical Centre","WF","WF-2","Chingford E4"]
["2021-11-01","F86679",6163,86,80,58,71,40,"Higham Hill Medical Centre","WF","WF-7","Walthamstow West"]
["2021-11-01","F86666",14772,273,262,159,196,137,"The Harrow Road Surgery","WF","WF-5","South Leytonstone"]
["2021-11-01","F86696",6915,130,121,67,96,49,"Francis Road Medical Centre","WF","WF-4","Forest Integrated Health"]
["2021-11-01","F86689",4383,87,76,50,60,45,"The Bailey Practice","WF","WF-1","Chingford/ Walthamstow"]
["2021-11-01","F86006",6725,151,110,70,89,43,"Seymour Medical Centre","WF","WF-7","Walthamstow West"]
["2021-11-01","F86644",9517,225,218,85,145,58,"Waltham Forest Community & Family Health Services Ltd","WF","WF-6","Central Walthamstow"]
["2021-11-01","F86664",8409,204,156,116,142,87,"Larkshall Medical Centre","WF","WF-1","Chingford/ Walthamstow"]
["2021-11-01","F86650",8059,149,128,62,95,86,"Lime Tree Surgery","WF","WF-4","Forest Integrated Health"]
["2021-11-01","Y01291",9061,393,362,220,266,182,"Chingford Medical Practice","WF","WF-2","Chingford E4"]
["2021-11-01","F86712",3352,77,73,35,66,16,"Hampton Medical Centre","WF","WF-4","Forest Integrated Health"]
["2021-11-01","F86011",9630,228,170,140,159,106,"The Manor Practice","WF","WF-3","Leyton Collaborative"]
["2021-11-01","Y01839",6320,159,139,64,123,32,"Lime Tree & Sinnott Healthcare Ltd","WF","WF-1","Chingford/ Walthamstow"]
["2021-11-01","F86701",3774,80,79,47,67,35,"Kiyani Medical Practice","WF","WF-5","South Leytonstone"]
["2021-11-01","F86700",3881,183,180,116,124,62,"Kings Head Medical Practice","WF","WF-1","Chingford/ Walthamstow"]
["2021-11-01","F86708",2860,61,59,32,48,24,"Claremont Medical Centre","WF","WF-6","Central Walthamstow"]
["2021-11-01","F86705",3535,65,61,39,45,25,"The Langthorne Sharma Family Practice","WF","WF-5","South Leytonstone"]
["2021-11-01","F86058",16780,258,210,163,182,108,"St James Medical Practice Ltd","WF","WF-7","Walthamstow West"]
["2021-11-01","F86045",2031,52,45,17,40,30,"High Road Surgery","WF","WF-5","South Leytonstone"]
["2021-11-01","F86078",6965,348,109,125,209,56,"The Ridgeway Surgery","WF","WF-2","Chingford E4"]
["2021-11-01","F86062",7292,161,112,72,122,56,"The Grove Road Medical Centre","WF","WF-7","Walthamstow West"]
["2021-11-01","F86036",15128,325,238,144,216,91,"The Allum Medical Centre","WF","WF-4","Forest Integrated Health"]
["2021-11-01","F86030",8118,168,139,102,132,89,"Queens Road Medical Centre","WF","WF-7","Walthamstow West"]
["2021-11-01","F86044",10256,110,96,44,76,20,"Crawley Road Medical Centre","WF","WF-4","Forest Integrated Health"]
["2021-11-01","F86038",11386,208,165,132,154,98,"Sma Medical Centre","WF","WF-3","Leyton Collaborative"]
["2021-11-01","F86625",5884,159,139,66,111,56,"LL Medical Care (Agarwal & Agrwal Practice)","WF","WF-5","South Leytonstone"]
["2021-11-01","F86621",6442,159,145,83,129,51,"Green Man Medical Centre","WF","WF-5","South Leytonstone"]
["2021-11-01","F86627",13367,540,477,235,354,115,"Churchill Medical Centre","WF","WF-2","Chingford E4"]
["2021-11-01","F86626",6898,107,92,43,64,23,"Dr Shantir Practice","WF","WF-1","Chingford/ Walthamstow"]
["2021-11-01","F86088",4922,109,95,35,82,49,"The Lyndhurst Surgery","WF","WF-4","Forest Integrated Health"]
["2021-11-01","F86086",6186,87,65,41,51,21,"Dr Dhital Practice","WF","WF-6","Central Walthamstow"]
["2021-11-01","F86616",7841,295,253,184,177,107,"Old Church Surgery","WF","WF-2","Chingford E4"]
["2021-11-01","F86607",15178,263,240,144,204,139,"Addison Road Medical Practice","WF","WF-6","Central Walthamstow"]
["2021-11-01","F86001",7738,206,175,109,120,31,"The Firs","WF","WF-6","Central Walthamstow"]
["2021-11-01","F86005",9412,199,184,96,133,54,"The Penryhn Surgery","WF","WF-1","Chingford/ Walthamstow"]
["2021-12-01","F86689",4382,87,76,54,59,35,"The Bailey Practice","WF","WF-1","Chingford/ Walthamstow"]
["2021-12-01","F86679",6211,82,76,57,68,42,"Higham Hill Medical Centre","WF","WF-7","Walthamstow West"]
["2021-12-01","F86700",3892,182,181,122,122,61,"Kings Head Medical Practice","WF","WF-1","Chingford/ Walthamstow"]
["2021-12-01","F86696",6767,128,118,69,96,48,"Francis Road Medical Centre","WF","WF-4","Forest Integrated Health"]
["2021-12-01","F86650",8073,143,128,62,91,91,"Lime Tree Surgery","WF","WF-4","Forest Integrated Health"]
["2021-12-01","F86644",9492,223,216,91,143,57,"Waltham Forest Community & Family Health Services Ltd","WF","WF-6","Central Walthamstow"]
["2021-12-01","F86666",14845,270,258,151,193,137,"The Harrow Road Surgery","WF","WF-5","South Leytonstone"]
["2021-12-01","F86664",8427,209,163,109,150,64,"Larkshall Medical Centre","WF","WF-1","Chingford/ Walthamstow"]
["2021-12-01","F86701",3777,84,81,57,70,56,"Kiyani Medical Practice","WF","WF-5","South Leytonstone"]
["2021-12-01","F86001",7751,212,179,112,127,31,"The Firs","WF","WF-6","Central Walthamstow"]
["2021-12-01","Y01839",6291,158,140,62,122,32,"Lime Tree & Sinnott Healthcare Ltd","WF","WF-1","Chingford/ Walthamstow"]
["2021-12-01","F86006",6750,149,110,72,88,42,"Seymour Medical Centre","WF","WF-7","Walthamstow West"]
["2021-12-01","F86005",9513,193,179,88,126,55,"The Penryhn Surgery","WF","WF-1","Chingford/ Walthamstow"]
["2021-12-01","F86708",2882,58,56,30,45,24,"Claremont Medical Centre","WF","WF-6","Central Walthamstow"]
["2021-12-01","F86705",3531,67,61,42,48,21,"The Langthorne Sharma Family Practice","WF","WF-5","South Leytonstone"]
["2021-12-01","Y01291",9086,388,358,220,260,183,"Chingford Medical Practice","WF","WF-2","Chingford E4"]
["2021-12-01","F86712",3373,80,73,39,69,17,"Hampton Medical Centre","WF","WF-4","Forest Integrated Health"]
["2021-12-01","F86045",2022,51,46,26,40,34,"High Road Surgery","WF","WF-5","South Leytonstone"]
["2021-12-01","F86044",10257,109,97,45,74,23,"Crawley Road Medical Centre","WF","WF-4","Forest Integrated Health"]
["2021-12-01","F86062",7280,158,112,71,123,61,"The Grove Road Medical Centre","WF","WF-7","Walthamstow West"]
["2021-12-01","F86058",16622,253,212,164,180,106,"St James Medical Practice Ltd","WF","WF-7","Walthamstow West"]
["2021-12-01","F86030",8099,169,141,103,132,90,"Queens Road Medical Centre","WF","WF-7","Walthamstow West"]
["2021-12-01","F86011",9624,226,167,139,157,94,"The Manor Practice","WF","WF-3","Leyton Collaborative"]
["2021-12-01","F86038",11364,205,162,128,150,89,"Sma Medical Centre","WF","WF-3","Leyton Collaborative"]
["2021-12-01","F86036",14979,320,234,153,215,88,"The Allum Medical Centre","WF","WF-4","Forest Integrated Health"]
["2021-12-01","F86078",6916,345,109,121,208,54,"The Ridgeway Surgery","WF","WF-2","Chingford E4"]
["2021-12-01","F86625",5903,157,137,66,112,46,"LL Medical Care (Agarwal & Agrwal Practice)","WF","WF-5","South Leytonstone"]
["2021-12-01","F86621",6435,162,145,91,134,50,"Green Man Medical Centre","WF","WF-5","South Leytonstone"]
["2021-12-01","F86627",13317,540,472,239,354,120,"Churchill Medical Centre","WF","WF-2","Chingford E4"]
["2021-12-01","F86626",6913,107,93,47,63,18,"Dr Shantir Practice","WF","WF-1","Chingford/ Walthamstow"]
["2021-12-01","F86088",4948,111,96,38,86,51,"The Lyndhurst Surgery","WF","WF-4","Forest Integrated Health"]
["2021-12-01","F86086",6193,87,65,41,51,20,"Dr Dhital Practice","WF","WF-6","Central Walthamstow"]
["2021-12-01","F86607",15284,262,241,147,202,137,"Addison Road Medical Practice","WF","WF-6","Central Walthamstow"]
["2021-12-01","F86616",7861,301,264,211,183,105,"Old Church Surgery","WF","WF-2","Chingford E4"]
["2022-01-01","F86001",7743,212,179,109,129,33,"The Firs","WF","WF-6","Central Walthamstow"]
["2022-01-01","F86086",6191,87,64,44,53,22,"Dr Dhital Practice","WF","WF-6","Central Walthamstow"]
["2022-01-01","F86088",4967,115,97,48,89,56,"The Lyndhurst Surgery","WF","WF-4","Forest Integrated Health"]
["2022-01-01","F86062",7233,154,108,71,123,58,"The Grove Road Medical Centre","WF","WF-7","Walthamstow West"]
["2022-01-01","F86078",6927,337,108,111,205,49,"The Ridgeway Surgery","WF","WF-2","Chingford E4"]
["2022-01-01","F86621",6394,162,144,88,133,51,"Green Man Medical Centre","WF","WF-5","South Leytonstone"]
["2022-01-01","F86625",5900,157,135,72,113,47,"LL Medical Care (Agarwal & Agrwal Practice)","WF","WF-5","South Leytonstone"]
["2022-01-01","F86607",15376,259,238,145,202,133,"Addison Road Medical Practice","WF","WF-6","Central Walthamstow"]
["2022-01-01","F86616",7911,291,255,205,174,95,"Old Church Surgery","WF","WF-2","Chingford E4"]
["2022-01-01","F86030",8128,169,141,102,133,89,"Queens Road Medical Centre","WF","WF-7","Walthamstow West"]
["2022-01-01","F86036",14935,312,231,160,209,86,"The Allum Medical Centre","WF","WF-4","Forest Integrated Health"]
["2022-01-01","F86006",6771,147,106,71,88,45,"Seymour Medical Centre","WF","WF-7","Walthamstow West"]
["2022-01-01","F86011",9658,220,165,133,151,89,"The Manor Practice","WF","WF-3","Leyton Collaborative"]
["2022-01-01","F86045",2020,48,44,33,39,34,"High Road Surgery","WF","WF-5","South Leytonstone"]
["2022-01-01","F86058",16682,249,208,165,181,109,"St James Medical Practice Ltd","WF","WF-7","Walthamstow West"]
["2022-01-01","F86038",11371,202,159,134,146,87,"Sma Medical Centre","WF","WF-3","Leyton Collaborative"]
["2022-01-01","F86044",10358,113,100,49,76,24,"Crawley Road Medical Centre","WF","WF-4","Forest Integrated Health"]
["2022-01-01","F86701",3787,81,79,55,76,56,"Kiyani Medical Practice","WF","WF-5","South Leytonstone"]
["2022-01-01","F86705",3547,65,60,40,46,21,"The Langthorne Sharma Family Practice","WF","WF-5","South Leytonstone"]
["2022-01-01","F86696",6837,126,118,68,95,50,"Francis Road Medical Centre","WF","WF-4","Forest Integrated Health"]
["2022-01-01","F86700",3887,177,177,121,117,51,"Kings Head Medical Practice","WF","WF-1","Chingford/ Walthamstow"]
["2022-01-01","Y01291",9075,381,349,219,260,193,"Chingford Medical Practice","WF","WF-2","Chingford E4"]
["2022-01-01","F86005",9491,188,175,81,124,52,"The Penryhn Surgery","WF","WF-1","Chingford/ Walthamstow"]
["2022-01-01","F86708",2894,56,54,29,44,24,"Claremont Medical Centre","WF","WF-6","Central Walthamstow"]
["2022-01-01","F86712",3370,79,71,41,67,17,"Hampton Medical Centre","WF","WF-4","Forest Integrated Health"]
["2022-01-01","F86644",9406,219,211,89,144,55,"Waltham Forest Community & Family Health Services Ltd","WF","WF-6","Central Walthamstow"]
["2022-01-01","F86650",8075,142,134,62,91,98,"Lime Tree Surgery","WF","WF-4","Forest Integrated Health"]
["2022-01-01","F86626",6933,108,94,48,64,17,"Dr Shantir Practice","WF","WF-1","Chingford/ Walthamstow"]
["2022-01-01","F86627",13287,536,461,239,353,119,"Churchill Medical Centre","WF","WF-2","Chingford E4"]
["2022-01-01","F86679",6272,76,71,54,62,34,"Higham Hill Medical Centre","WF","WF-7","Walthamstow West"]
["2022-01-01","F86689",4374,85,75,52,58,24,"The Bailey Practice","WF","WF-1","Chingford/ Walthamstow"]
["2022-01-01","F86664",8437,210,164,106,151,44,"Larkshall Medical Centre","WF","WF-1","Chingford/ Walthamstow"]
["2022-01-01","F86666",14888,269,255,158,193,135,"The Harrow Road Surgery","WF","WF-5","South Leytonstone"]
["2022-01-01","Y01839",6271,156,137,63,118,31,"Lime Tree & Sinnott Healthcare Ltd","WF","WF-1","Chingford/ Walthamstow"]
["2022-02-01","F86664",8450,211,167,110,152,40,"Larkshall Medical Centre","WF","WF-1","Chingford/ Walthamstow"]
["2022-02-01","F86650",8096,144,135,62,93,98,"Lime Tree Surgery","WF","WF-4","Forest Integrated Health"]
["2022-02-01","F86679",6309,74,69,52,60,34,"Higham Hill Medical Centre","WF","WF-7","Walthamstow West"]
["2022-02-01","F86666",14919,262,250,161,186,136,"The Harrow Road Surgery","WF","WF-5","South Leytonstone"]
["2022-02-01","F86626",6974,104,90,50,63,18,"Dr Shantir Practice","WF","WF-1","Chingford/ Walthamstow"]
["2022-02-01","F86625",5908,152,131,66,112,48,"LL Medical Care (Agarwal & Agrwal Practice)","WF","WF-5","South Leytonstone"]
["2022-02-01","F86644",9371,216,208,87,140,58,"Waltham Forest Community & Family Health Services Ltd","WF","WF-6","Central Walthamstow"]
["2022-02-01","F86627",13275,535,458,252,351,121,"Churchill Medical Centre","WF","WF-2","Chingford E4"]
["2022-02-01","F86689",4371,85,74,53,58,23,"The Bailey Practice","WF","WF-1","Chingford/ Walthamstow"]
["2022-02-01","F86712",3371,75,68,38,65,16,"Hampton Medical Centre","WF","WF-4","Forest Integrated Health"]
["2022-02-01","F86708",2789,56,53,30,44,25,"Claremont Medical Centre","WF","WF-6","Central Walthamstow"]
["2022-02-01","Y01839",6266,149,132,63,113,32,"Lime Tree & Sinnott Healthcare Ltd","WF","WF-1","Chingford/ Walthamstow"]
["2022-02-01","Y01291",9176,377,347,224,255,194,"Chingford Medical Practice","WF","WF-2","Chingford E4"]
["2022-02-01","F86700",3856,174,174,116,117,45,"Kings Head Medical Practice","WF","WF-1","Chingford/ Walthamstow"]
["2022-02-01","F86696",6864,128,116,71,96,48,"Francis Road Medical Centre","WF","WF-4","Forest Integrated Health"]
["2022-02-01","F86705",3542,63,58,40,45,21,"The Langthorne Sharma Family Practice","WF","WF-5","South Leytonstone"]
["2022-02-01","F86701",3822,83,80,53,77,56,"Kiyani Medical Practice","WF","WF-5","South Leytonstone"]
["2022-02-01","F86621",6384,163,144,86,134,45,"Green Man Medical Centre","WF","WF-5","South Leytonstone"]
["2022-02-01","F86036",14841,306,226,159,204,87,"The Allum Medical Centre","WF","WF-4","Forest Integrated Health"]
["2022-02-01","F86030",8095,167,139,106,131,87,"Queens Road Medical Centre","WF","WF-7","Walthamstow West"]
["2022-02-01","F86044",10506,114,102,51,77,24,"Crawley Road Medical Centre","WF","WF-4","Forest Integrated Health"]
["2022-02-01","F86038",11266,194,153,138,141,100,"Sma Medical Centre","WF","WF-3","Leyton Collaborative"]
["2022-02-01","F86005",9507,189,176,81,127,50,"The Penryhn Surgery","WF","WF-1","Chingford/ Walthamstow"]
["2022-02-01","F86001",7727,207,182,108,126,31,"The Firs","WF","WF-6","Central Walthamstow"]
["2022-02-01","F86011",9691,218,165,127,147,80,"The Manor Practice","WF","WF-3","Leyton Collaborative"]
["2022-02-01","F86006",6788,145,104,74,89,45,"Seymour Medical Centre","WF","WF-7","Walthamstow West"]
["2022-02-01","F86088",4998,112,96,45,86,57,"The Lyndhurst Surgery","WF","WF-4","Forest Integrated Health"]
["2022-02-01","F86086",6237,86,63,40,53,21,"Dr Dhital Practice","WF","WF-6","Central Walthamstow"]
["2022-02-01","F86616",7956,284,249,203,169,91,"Old Church Surgery","WF","WF-2","Chingford E4"]
["2022-02-01","F86607",15420,261,235,140,198,134,"Addison Road Medical Practice","WF","WF-6","Central Walthamstow"]
["2022-02-01","F86058",16789,248,210,165,185,113,"St James Medical Practice Ltd","WF","WF-7","Walthamstow West"]
["2022-02-01","F86045",2025,48,44,33,39,34,"High Road Surgery","WF","WF-5","South Leytonstone"]
["2022-02-01","F86078",6914,329,115,113,196,50,"The Ridgeway Surgery","WF","WF-2","Chingford E4"]
["2022-02-01","F86062",7198,152,110,68,123,59,"The Grove Road Medical Centre","WF","WF-7","Walthamstow West"]
["2022-03-01","F86664",8452,207,165,107,150,41,"Larkshall Medical Centre","WF","WF-1","Chingford/ Walthamstow"]
["2022-03-01","F86650",8087,146,135,65,93,100,"Lime Tree Surgery","WF","WF-4","Forest Integrated Health"]
["2022-03-01","F86679",6359,73,68,50,59,30,"Higham Hill Medical Centre","WF","WF-7","Walthamstow West"]
["2022-03-01","F86666",14948,261,249,166,188,140,"The Harrow Road Surgery","WF","WF-5","South Leytonstone"]
["2022-03-01","F86626",7000,105,89,53,64,19,"Dr Shantir Practice","WF","WF-1","Chingford/ Walthamstow"]
["2022-03-01","F86625",5881,148,130,65,111,47,"LL Medical Care (Agarwal & Agrwal Practice)","WF","WF-5","South Leytonstone"]
["2022-03-01","F86644",9330,217,207,88,142,65,"Waltham Forest Community & Family Health Services Ltd","WF","WF-6","Central Walthamstow"]
["2022-03-01","F86627",13278,538,458,256,352,120,"Churchill Medical Centre","WF","WF-2","Chingford E4"]
["2022-03-01","F86689",4374,83,71,47,58,20,"The Bailey Practice","WF","WF-1","Chingford/ Walthamstow"]
["2022-03-01","F86712",3368,75,75,38,65,18,"Hampton Medical Centre","WF","WF-4","Forest Integrated Health"]
["2022-03-01","F86708",2788,55,51,29,41,22,"Claremont Medical Centre","WF","WF-6","Central Walthamstow"]
["2022-03-01","Y01839",6246,150,128,68,112,37,"Lime Tree & Sinnott Healthcare Ltd","WF","WF-1","Chingford/ Walthamstow"]
["2022-03-01","Y01291",9168,367,360,216,247,196,"Chingford Medical Practice","WF","WF-2","Chingford E4"]
["2022-03-01","F86700",3846,171,171,120,118,48,"Kings Head Medical Practice","WF","WF-1","Chingford/ Walthamstow"]
["2022-03-01","F86696",6844,122,111,66,91,48,"Francis Road Medical Centre","WF","WF-4","Forest Integrated Health"]
["2022-03-01","F86705",3535,61,57,39,45,21,"The Langthorne Sharma Family Practice","WF","WF-5","South Leytonstone"]
["2022-03-01","F86701",3829,85,81,55,78,58,"Kiyani Medical Practice","WF","WF-5","South Leytonstone"]
["2022-03-01","F86621",6419,159,140,85,129,42,"Green Man Medical Centre","WF","WF-5","South Leytonstone"]
["2022-03-01","F86036",14787,305,227,165,206,95,"The Allum Medical Centre","WF","WF-4","Forest Integrated Health"]
["2022-03-01","F86030",8107,161,135,99,126,84,"Queens Road Medical Centre","WF","WF-7","Walthamstow West"]
["2022-03-01","F86044",10689,115,102,52,79,24,"Crawley Road Medical Centre","WF","WF-4","Forest Integrated Health"]
["2022-03-01","F86038",11108,192,153,150,144,97,"Sma Medical Centre","WF","WF-3","Leyton Collaborative"]
["2022-03-01","F86005",9521,188,174,91,125,53,"The Penryhn Surgery","WF","WF-1","Chingford/ Walthamstow"]
["2022-03-01","F86001",7737,203,182,103,125,34,"The Firs","WF","WF-6","Central Walthamstow"]
["2022-03-01","F86011",9693,218,167,116,147,59,"The Manor Practice","WF","WF-3","Leyton Collaborative"]
["2022-03-01","F86006",6820,142,101,66,88,47,"Seymour Medical Centre","WF","WF-7","Walthamstow West"]
["2022-03-01","F86088",5003,111,94,45,85,57,"The Lyndhurst Surgery","WF","WF-4","Forest Integrated Health"]
["2022-03-01","F86086",6251,88,66,39,55,21,"Dr Dhital Practice","WF","WF-6","Central Walthamstow"]
["2022-03-01","F86616",7971,276,240,198,167,86,"Old Church Surgery","WF","WF-2","Chingford E4"]
["2022-03-01","F86607",15508,261,235,136,199,133,"Addison Road Medical Practice","WF","WF-6","Central Walthamstow"]
["2022-03-01","F86058",16718,243,205,161,181,110,"St James Medical Practice Ltd","WF","WF-7","Walthamstow West"]
["2022-03-01","F86045",2027,49,46,33,40,36,"High Road Surgery","WF","WF-5","South Leytonstone"]
["2022-03-01","F86078",6875,320,112,124,191,47,"The Ridgeway Surgery","WF","WF-2","Chingford E4"]
["2022-03-01","F86062",7172,149,108,67,120,63,"The Grove Road Medical Centre","WF","WF-7","Walthamstow West"]
["2022-04-01","F86001",7727,199,179,98,126,42,"The Firs","WF","WF-6","Central Walthamstow"]
["2022-04-01","F86664",8471,209,165,105,148,38,"Larkshall Medical Centre","WF","WF-1","Chingford/ Walthamstow"]
["2022-04-01","F86650",8077,144,131,67,96,100,"Lime Tree Surgery","WF","WF-4","Forest Integrated Health"]
["2022-04-01","F86689",4395,82,70,41,56,14,"The Bailey Practice","WF","WF-1","Chingford/ Walthamstow"]
["2022-04-01","F86666",14976,263,251,172,194,144,"The Harrow Road Surgery","WF","WF-5","South Leytonstone"]
["2022-04-01","F86626",7013,103,86,47,64,20,"Dr Shantir Practice","WF","WF-1","Chingford/ Walthamstow"]
["2022-04-01","F86625",5880,148,129,76,112,47,"LL Medical Care (Agarwal & Agrwal Practice)","WF","WF-5","South Leytonstone"]
["2022-04-01","F86644",9214,217,205,101,137,68,"Waltham Forest Community & Family Health Services Ltd","WF","WF-6","Central Walthamstow"]
["2022-04-01","F86627",13283,531,447,265,350,120,"Churchill Medical Centre","WF","WF-2","Chingford E4"]
["2022-04-01","F86712",3392,74,73,40,64,16,"Hampton Medical Centre","WF","WF-4","Forest Integrated Health"]
["2022-04-01","F86708",2782,56,52,30,42,22,"Claremont Medical Centre","WF","WF-6","Central Walthamstow"]
["2022-04-01","Y01839",6230,151,129,70,111,41,"Lime Tree & Sinnott Healthcare Ltd","WF","WF-1","Chingford/ Walthamstow"]
["2022-04-01","Y01291",9172,368,357,225,247,206,"Chingford Medical Practice","WF","WF-2","Chingford E4"]
["2022-04-01","F86700",3901,172,172,124,115,49,"Kings Head Medical Practice","WF","WF-1","Chingford/ Walthamstow"]
["2022-04-01","F86696",6873,117,109,62,92,50,"Francis Road Medical Centre","WF","WF-4","Forest Integrated Health"]
["2022-04-01","F86705",3507,59,54,35,42,19,"The Langthorne Sharma Family Practice","WF","WF-5","South Leytonstone"]
["2022-04-01","F86701",3853,84,80,53,77,55,"Kiyani Medical Practice","WF","WF-5","South Leytonstone"]
["2022-04-01","F86621",6444,158,138,88,131,50,"Green Man Medical Centre","WF","WF-5","South Leytonstone"]
["2022-04-01","F86036",14732,305,224,167,206,98,"The Allum Medical Centre","WF","WF-4","Forest Integrated Health"]
["2022-04-01","F86030",8160,165,140,106,129,87,"Queens Road Medical Centre","WF","WF-7","Walthamstow West"]
["2022-04-01","F86044",10801,117,105,56,83,28,"Crawley Road Medical Centre","WF","WF-4","Forest Integrated Health"]
["2022-04-01","F86038",11103,190,152,150,145,100,"Sma Medical Centre","WF","WF-3","Leyton Collaborative"]
["2022-04-01","F86005",9502,185,171,90,124,52,"The Penryhn Surgery","WF","WF-1","Chingford/ Walthamstow"]
["2022-04-01","F86679",6371,74,67,51,58,27,"Higham Hill Medical Centre","WF","WF-7","Walthamstow West"]
["2022-04-01","F86011",9696,217,169,110,144,56,"The Manor Practice","WF","WF-3","Leyton Collaborative"]
["2022-04-01","F86006",6812,144,105,66,91,47,"Seymour Medical Centre","WF","WF-7","Walthamstow West"]
["2022-04-01","F86045",2025,50,45,35,39,37,"High Road Surgery","WF","WF-5","South Leytonstone"]
["2022-04-01","F86086",6237,84,63,39,52,18,"Dr Dhital Practice","WF","WF-6","Central Walthamstow"]
["2022-04-01","F86088",5027,109,93,46,86,56,"The Lyndhurst Surgery","WF","WF-4","Forest Integrated Health"]
["2022-04-01","F86607",15518,263,238,138,202,130,"Addison Road Medical Practice","WF","WF-6","Central Walthamstow"]
["2022-04-01","F86078",6869,316,113,128,190,49,"The Ridgeway Surgery","WF","WF-2","Chingford E4"]
["2022-04-01","F86616",7996,268,232,187,164,90,"Old Church Surgery","WF","WF-2","Chingford E4"]
["2022-04-01","F86058",16560,236,200,162,178,113,"St James Medical Practice Ltd","WF","WF-7","Walthamstow West"]
["2022-04-01","F86062",7155,142,102,63,114,64,"The Grove Road Medical Centre","WF","WF-7","Walthamstow West"]
["2022-05-01","F86650",8071,145,130,65,98,97,"Lime Tree Surgery","WF","WF-4","Forest Integrated Health"]
["2022-05-01","F86644",9162,220,206,108,143,73,"Waltham Forest Community & Family Health Services Ltd","WF","WF-6","Central Walthamstow"]
["2022-05-01","F86666",14969,259,247,172,192,151,"The Harrow Road Surgery","WF","WF-5","South Leytonstone"]
["2022-05-01","F86664",8491,206,162,104,146,34,"Larkshall Medical Centre","WF","WF-1","Chingford/ Walthamstow"]
["2022-05-01","F86625",5864,146,131,73,109,43,"LL Medical Care (Agarwal & Agrwal Practice)","WF","WF-5","South Leytonstone"]
["2022-05-01","F86621",6471,156,135,89,127,49,"Green Man Medical Centre","WF","WF-5","South Leytonstone"]
["2022-05-01","F86627",13278,531,447,266,352,126,"Churchill Medical Centre","WF","WF-2","Chingford E4"]
["2022-05-01","F86626",7073,104,87,49,64,21,"Dr Shantir Practice","WF","WF-1","Chingford/ Walthamstow"]
["2022-05-01","F86679",6356,74,67,51,58,27,"Higham Hill Medical Centre","WF","WF-7","Walthamstow West"]
["2022-05-01","F86708",2793,56,52,32,42,22,"Claremont Medical Centre","WF","WF-6","Central Walthamstow"]
["2022-05-01","F86705",3513,58,53,34,41,20,"The Langthorne Sharma Family Practice","WF","WF-5","South Leytonstone"]
["2022-05-01","Y01291",9243,376,362,221,257,198,"Chingford Medical Practice","WF","WF-2","Chingford E4"]
["2022-05-01","F86712",3391,71,70,36,62,15,"Hampton Medical Centre","WF","WF-4","Forest Integrated Health"]
["2022-05-01","F86696",6864,118,111,59,92,45,"Francis Road Medical Centre","WF","WF-4","Forest Integrated Health"]
["2022-05-01","F86689",4408,80,67,38,54,9,"The Bailey Practice","WF","WF-1","Chingford/ Walthamstow"]
["2022-05-01","F86701",3858,84,79,55,76,53,"Kiyani Medical Practice","WF","WF-5","South Leytonstone"]
["2022-05-01","F86700",3880,170,170,113,115,44,"Kings Head Medical Practice","WF","WF-1","Chingford/ Walthamstow"]
["2022-05-01","F86030",8154,162,138,100,127,69,"Queens Road Medical Centre","WF","WF-7","Walthamstow West"]
["2022-05-01","F86011",9676,209,161,109,138,54,"The Manor Practice","WF","WF-3","Leyton Collaborative"]
["2022-05-01","F86038",11052,195,156,148,151,103,"Sma Medical Centre","WF","WF-3","Leyton Collaborative"]
["2022-05-01","F86036",14699,309,223,167,214,101,"The Allum Medical Centre","WF","WF-4","Forest Integrated Health"]
["2022-05-01","F86001",7718,198,186,109,128,44,"The Firs","WF","WF-6","Central Walthamstow"]
["2022-05-01","Y01839",6239,152,131,70,112,44,"Lime Tree & Sinnott Healthcare Ltd","WF","WF-1","Chingford/ Walthamstow"]
["2022-05-01","F86006",6860,144,103,63,92,45,"Seymour Medical Centre","WF","WF-7","Walthamstow West"]
["2022-05-01","F86005",9498,183,171,91,124,54,"The Penryhn Surgery","WF","WF-1","Chingford/ Walthamstow"]
["2022-05-01","F86044",10955,125,114,57,89,30,"Crawley Road Medical Centre","WF","WF-4","Forest Integrated Health"]
["2022-05-01","F86088",5025,108,93,49,87,53,"The Lyndhurst Surgery","WF","WF-4","Forest Integrated Health"]
["2022-05-01","F86086",6264,84,62,39,53,18,"Dr Dhital Practice","WF","WF-6","Central Walthamstow"]
["2022-05-01","F86616",8012,262,230,179,161,79,"Old Church Surgery","WF","WF-2","Chingford E4"]
["2022-05-01","F86607",15569,263,236,135,197,126,"Addison Road Medical Practice","WF","WF-6","Central Walthamstow"]
["2022-05-01","F86058",16533,242,204,154,180,111,"St James Medical Practice Ltd","WF","WF-7","Walthamstow West"]
["2022-05-01","F86045",2028,50,45,34,38,33,"High Road Surgery","WF","WF-5","South Leytonstone"]
["2022-05-01","F86078",6869,320,114,120,189,51,"The Ridgeway Surgery","WF","WF-2","Chingford E4"]
["2022-05-01","F86062",7139,139,100,64,114,68,"The Grove Road Medical Centre","WF","WF-7","Walthamstow West"]
["2022-06-01","F86679",6377,74,66,52,59,28,"Higham Hill Medical Centre","WF","WF-7","Walthamstow West"]
[44713,"F86666",14992,258,245,173,193,147,"The Harrow Road Surgery","WF","WF-5","South Leytonstone"]
[44713,"F86696",6899,122,112,59,95,41,"Francis Road Medical Centre","WF","WF-4","Forest Integrated Health"]
[44713,"F86689",4402,77,65,37,54,9,"The Bailey Practice","WF","WF-1","Chingford/ Walthamstow"]
[44713,"F86644",9157,224,209,107,147,68,"Waltham Forest Community & Family Health Services Ltd","WF","WF-6","Central Walthamstow"]
[44713,"F86627",13274,526,444,268,348,126,"Churchill Medical Centre","WF","WF-2","Chingford E4"]
[44713,"F86664",8510,206,165,103,144,34,"Larkshall Medical Centre","WF","WF-1","Chingford/ Walthamstow"]
[44713,"F86650",8084,147,127,70,100,93,"Lime Tree Surgery","WF","WF-4","Forest Integrated Health"]
[44713,"Y01291",9368,375,357,219,256,190,"Chingford Medical Practice","WF","WF-2","Chingford E4"]
[44713,"F86712",3400,70,68,29,61,15,"Hampton Medical Centre","WF","WF-4","Forest Integrated Health"]
[44713,"F86001",7701,199,191,112,130,45,"The Firs","WF","WF-6","Central Walthamstow"]
[44713,"Y01839",6228,152,131,69,112,44,"Lime Tree & Sinnott Healthcare Ltd","WF","WF-1","Chingford/ Walthamstow"]
[44713,"F86701",3863,82,77,50,75,49,"Kiyani Medical Practice","WF","WF-5","South Leytonstone"]
[44713,"F86700",3893,168,168,112,113,41,"Kings Head Medical Practice","WF","WF-1","Chingford/ Walthamstow"]
[44713,"F86708",2823,60,55,31,46,26,"Claremont Medical Centre","WF","WF-6","Central Walthamstow"]
[44713,"F86705",3516,63,55,38,44,20,"The Langthorne Sharma Family Practice","WF","WF-5","South Leytonstone"]
[44713,"F86626",7108,102,85,50,61,17,"Dr Shantir Practice","WF","WF-1","Chingford/ Walthamstow"]
[44713,"F86038",11010,197,157,145,151,100,"Sma Medical Centre","WF","WF-3","Leyton Collaborative"]
[44713,"F86036",14707,309,221,165,214,102,"The Allum Medical Centre","WF","WF-4","Forest Integrated Health"]
[44713,"F86045",2035,52,45,36,41,35,"High Road Surgery","WF","WF-5","South Leytonstone"]
[44713,"F86044",11062,120,110,59,86,37,"Crawley Road Medical Centre","WF","WF-4","Forest Integrated Health"]
[44713,"F86005",9532,176,170,92,120,61,"The Penryhn Surgery","WF","WF-1","Chingford/ Walthamstow"]
[44713,"F86006",6897,147,104,60,92,48,"Seymour Medical Centre","WF","WF-7","Walthamstow West"]
[44713,"F86030",8161,160,135,93,126,64,"Queens Road Medical Centre","WF","WF-7","Walthamstow West"]
[44713,"F86011",9721,206,161,110,138,59,"The Manor Practice","WF","WF-3","Leyton Collaborative"]
[44713,"F86058",16573,242,201,154,182,120,"St James Medical Practice Ltd","WF","WF-7","Walthamstow West"]
[44713,"F86616",8068,262,226,168,162,72,"Old Church Surgery","WF","WF-2","Chingford E4"]
[44713,"F86607",15709,262,237,135,196,122,"Addison Road Medical Practice","WF","WF-6","Central Walthamstow"]
[44713,"F86625",5854,149,132,74,111,44,"LL Medical Care (Agarwal & Agrwal Practice)","WF","WF-5","South Leytonstone"]
[44713,"F86621",6500,158,135,91,129,48,"Green Man Medical Centre","WF","WF-5","South Leytonstone"]
[44713,"F86078",6855,322,116,122,189,59,"The Ridgeway Surgery","WF","WF-2","Chingford E4"]
[44713,"F86062",7123,138,101,67,114,68,"The Grove Road Medical Centre","WF","WF-7","Walthamstow West"]
[44713,"F86088",5027,105,91,50,83,50,"The Lyndhurst Surgery","WF","WF-4","Forest Integrated Health"]
[44713,"F86086",6305,80,59,34,48,15,"Dr Dhital Practice","WF","WF-6","Central Walthamstow"]
[44743,"F86679",6375,77,69,52,61,32,"Higham Hill Medical Centre","WF","WF-7","Walthamstow West"]
[44743,"F86666",15008,258,246,174,195,149,"The Harrow Road Surgery","WF","WF-5","South Leytonstone"]
[44743,"F86696",6908,122,111,63,95,40,"Francis Road Medical Centre","WF","WF-4","Forest Integrated Health"]
[44743,"F86689",4410,79,65,37,54,8,"The Bailey Practice","WF","WF-1","Chingford/ Walthamstow"]
[44743,"F86644",9106,222,206,103,147,64,"Waltham Forest Community & Family Health Services Ltd","WF","WF-6","Central Walthamstow"]
[44743,"F86627",13265,528,444,271,350,125,"Churchill Medical Centre","WF","WF-2","Chingford E4"]
[44743,"F86664",8520,209,168,106,144,34,"Larkshall Medical Centre","WF","WF-1","Chingford/ Walthamstow"]
[44743,"F86650",8120,149,125,73,100,92,"Lime Tree Surgery","WF","WF-4","Forest Integrated Health"]
[44743,"Y01291",9422,381,362,220,265,185,"Chingford Medical Practice","WF","WF-2","Chingford E4"]
[44743,"F86712",3417,69,67,31,59,18,"Hampton Medical Centre","WF","WF-4","Forest Integrated Health"]
[44743,"F86006",6896,147,105,61,93,46,"Seymour Medical Centre","WF","WF-7","Walthamstow West"]
[44743,"Y01839",6295,151,132,65,111,41,"Lime Tree & Sinnott Healthcare Ltd","WF","WF-1","Chingford/ Walthamstow"]
[44743,"F86701",3873,82,78,50,74,51,"Kiyani Medical Practice","WF","WF-5","South Leytonstone"]
[44743,"F86700",3893,162,161,107,113,39,"Kings Head Medical Practice","WF","WF-1","Chingford/ Walthamstow"]
[44743,"F86708",2797,63,58,34,48,20,"Claremont Medical Centre","WF","WF-6","Central Walthamstow"]
[44743,"F86705",3532,63,55,38,44,21,"The Langthorne Sharma Family Practice","WF","WF-5","South Leytonstone"]
[44743,"F86626",7149,104,85,49,63,17,"Dr Shantir Practice","WF","WF-1","Chingford/ Walthamstow"]
[44743,"F86038",10972,193,154,140,148,100,"Sma Medical Centre","WF","WF-3","Leyton Collaborative"]
[44743,"F86036",14657,308,221,158,211,91,"The Allum Medical Centre","WF","WF-4","Forest Integrated Health"]
[44743,"F86045",2038,51,45,35,40,32,"High Road Surgery","WF","WF-5","South Leytonstone"]
[44743,"F86044",11125,123,112,61,90,40,"Crawley Road Medical Centre","WF","WF-4","Forest Integrated Health"]
[44743,"F86001",7700,199,190,117,135,47,"The Firs","WF","WF-6","Central Walthamstow"]
[44743,"F86005",9552,178,174,94,124,60,"The Penryhn Surgery","WF","WF-1","Chingford/ Walthamstow"]
[44743,"F86030",8208,162,137,90,128,62,"Queens Road Medical Centre","WF","WF-7","Walthamstow West"]
[44743,"F86011",9706,204,159,110,134,63,"The Manor Practice","WF","WF-3","Leyton Collaborative"]
[44743,"F86058",16669,242,199,149,183,108,"St James Medical Practice Ltd","WF","WF-7","Walthamstow West"]
[44743,"F86616",8094,266,230,169,161,61,"Old Church Surgery","WF","WF-2","Chingford E4"]
[44743,"F86607",15766,269,242,139,200,116,"Addison Road Medical Practice","WF","WF-6","Central Walthamstow"]
[44743,"F86625",5821,149,129,69,111,43,"LL Medical Care (Agarwal & Agrwal Practice)","WF","WF-5","South Leytonstone"]
[44743,"F86621",6512,155,133,89,127,46,"Green Man Medical Centre","WF","WF-5","South Leytonstone"]
[44743,"F86078",6838,330,119,125,191,67,"The Ridgeway Surgery","WF","WF-2","Chingford E4"]
[44743,"F86062",7120,145,103,68,121,66,"The Grove Road Medical Centre","WF","WF-7","Walthamstow West"]
[44743,"F86088",5016,102,89,50,81,55,"The Lyndhurst Surgery","WF","WF-4","Forest Integrated Health"]
[44743,"F86086",6267,83,61,37,51,16,"Dr Dhital Practice","WF","WF-6","Central Walthamstow"]
[44774,"F86679",6350,76,67,56,59,32,"Higham Hill Medical Centre","WF","WF-7","Walthamstow West"]
[44774,"F86650",8089,157,127,74,107,93,"Lime Tree Surgery","WF","WF-4","Forest Integrated Health"]
[44774,"F86689",4402,79,63,34,54,8,"The Bailey Practice","WF","WF-1","Chingford/ Walthamstow"]
[44774,"F86666",15003,256,245,168,193,153,"The Harrow Road Surgery","WF","WF-5","South Leytonstone"]
[44774,"F86627",13253,526,435,277,348,122,"Churchill Medical Centre","WF","WF-2","Chingford E4"]
[44774,"F86644",9043,218,207,106,145,66,"Waltham Forest Community & Family Health Services Ltd","WF","WF-6","Central Walthamstow"]
[44774,"F86664",8553,204,164,102,141,28,"Larkshall Medical Centre","WF","WF-1","Chingford/ Walthamstow"]
[44774,"F86696",6935,118,110,60,91,35,"Francis Road Medical Centre","WF","WF-4","Forest Integrated Health"]
[44774,"Y01291",9433,383,360,215,262,178,"Chingford Medical Practice","WF","WF-2","Chingford E4"]
[44774,"F86712",3428,65,65,32,57,18,"Hampton Medical Centre","WF","WF-4","Forest Integrated Health"]
[44774,"F86062",7122,143,103,71,120,67,"The Grove Road Medical Centre","WF","WF-7","Walthamstow West"]
[44774,"Y01839",6332,150,131,70,110,43,"Lime Tree & Sinnott Healthcare Ltd","WF","WF-1","Chingford/ Walthamstow"]
[44774,"F86701",3898,87,79,54,76,55,"Kiyani Medical Practice","WF","WF-5","South Leytonstone"]
[44774,"F86700",3903,164,164,112,114,37,"Kings Head Medical Practice","WF","WF-1","Chingford/ Walthamstow"]
[44774,"F86708",2798,64,59,32,51,19,"Claremont Medical Centre","WF","WF-6","Central Walthamstow"]
[44774,"F86705",3535,67,55,42,43,19,"The Langthorne Sharma Family Practice","WF","WF-5","South Leytonstone"]
[44774,"F86626",7180,102,83,49,63,16,"Dr Shantir Practice","WF","WF-1","Chingford/ Walthamstow"]
[44774,"F86036",14564,303,214,164,210,92,"The Allum Medical Centre","WF","WF-4","Forest Integrated Health"]
[44774,"F86030",8231,164,138,89,131,64,"Queens Road Medical Centre","WF","WF-7","Walthamstow West"]
[44774,"F86044",10642,114,110,51,87,40,"Crawley Road Medical Centre","WF","WF-4","Forest Integrated Health"]
[44774,"F86038",10973,192,152,136,147,99,"Sma Medical Centre","WF","WF-3","Leyton Collaborative"]
[44774,"F86001",7686,197,187,112,136,43,"The Firs","WF","WF-6","Central Walthamstow"]
[44774,"F86005",9537,178,174,97,124,61,"The Penryhn Surgery","WF","WF-1","Chingford/ Walthamstow"]
[44774,"F86011",9712,203,160,108,138,63,"The Manor Practice","WF","WF-3","Leyton Collaborative"]
[44774,"F86006",6904,146,103,61,90,43,"Seymour Medical Centre","WF","WF-7","Walthamstow West"]
[44774,"F86045",2042,52,46,34,40,26,"High Road Surgery","WF","WF-5","South Leytonstone"]
[44774,"F86616",8103,264,229,170,160,65,"Old Church Surgery","WF","WF-2","Chingford E4"]
[44774,"F86607",15814,270,244,135,197,118,"Addison Road Medical Practice","WF","WF-6","Central Walthamstow"]
[44774,"F86621",6526,155,130,87,126,46,"Green Man Medical Centre","WF","WF-5","South Leytonstone"]
[44774,"F86625",5815,144,124,68,111,45,"LL Medical Care (Agarwal & Agrwal Practice)","WF","WF-5","South Leytonstone"]
[44774,"F86078",6811,333,121,129,195,68,"The Ridgeway Surgery","WF","WF-2","Chingford E4"]
[44774,"F86058",16602,239,198,147,178,98,"St James Medical Practice Ltd","WF","WF-7","Walthamstow West"]
[44774,"F86088",5010,104,91,52,82,53,"The Lyndhurst Surgery","WF","WF-4","Forest Integrated Health"]
[44774,"F86086",6278,81,60,32,50,17,"Dr Dhital Practice","WF","WF-6","Central Walthamstow"]
[44805,"F86666",14783,262,252,172,198,171,"The Harrow Road Surgery","WF","WF-5","South Leytonstone"]
[44805,"F86644",9004,217,202,109,144,61,"Waltham Forest Community & Family Health Services Ltd","WF","WF-6","Central Walthamstow"]
[44805,"F86679",6370,79,69,59,61,34,"Higham Hill Medical Centre","WF","WF-7","Walthamstow West"]
[44805,"F86664",8563,205,167,105,141,32,"Larkshall Medical Centre","WF","WF-1","Chingford/ Walthamstow"]
[44805,"F86626",7206,102,83,53,63,16,"Dr Shantir Practice","WF","WF-1","Chingford/ Walthamstow"]
[44805,"F86627",13226,524,430,278,346,125,"Churchill Medical Centre","WF","WF-2","Chingford E4"]
[44805,"F86650",8110,159,129,82,108,96,"Lime Tree Surgery","WF","WF-4","Forest Integrated Health"]
[44805,"F86689",4402,83,65,40,58,8,"The Bailey Practice","WF","WF-1","Chingford/ Walthamstow"]
[44805,"F86712",3395,69,66,39,58,15,"Hampton Medical Centre","WF","WF-4","Forest Integrated Health"]
[44805,"F86708",2819,65,58,36,53,20,"Claremont Medical Centre","WF","WF-6","Central Walthamstow"]
[44805,"F86058",16617,238,195,153,178,104,"St James Medical Practice Ltd","WF","WF-7","Walthamstow West"]
[44805,"Y01291",9451,388,367,220,265,185,"Chingford Medical Practice","WF","WF-2","Chingford E4"]
[44805,"F86700",3916,157,157,102,110,33,"Kings Head Medical Practice","WF","WF-1","Chingford/ Walthamstow"]
[44805,"F86696",6972,114,106,65,86,41,"Francis Road Medical Centre","WF","WF-4","Forest Integrated Health"]
[44805,"F86705",3518,68,54,42,45,18,"The Langthorne Sharma Family Practice","WF","WF-5","South Leytonstone"]
[44805,"F86701",3901,86,83,56,76,54,"Kiyani Medical Practice","WF","WF-5","South Leytonstone"]
[44805,"F86625",5779,141,121,74,111,54,"LL Medical Care (Agarwal & Agrwal Practice)","WF","WF-5","South Leytonstone"]
[44805,"F86030",8248,163,138,94,134,68,"Queens Road Medical Centre","WF","WF-7","Walthamstow West"]
[44805,"F86011",9824,207,163,107,141,65,"The Manor Practice","WF","WF-3","Leyton Collaborative"]
[44805,"F86038",11110,194,155,139,150,95,"Sma Medical Centre","WF","WF-3","Leyton Collaborative"]
[44805,"F86036",14540,308,216,177,211,92,"The Allum Medical Centre","WF","WF-4","Forest Integrated Health"]
[44805,"F86005",9555,177,173,97,120,65,"The Penryhn Surgery","WF","WF-1","Chingford/ Walthamstow"]
[44805,"F86001",7694,201,190,115,137,52,"The Firs","WF","WF-6","Central Walthamstow"]
[44805,"F86006",6930,141,100,62,87,41,"Seymour Medical Centre","WF","WF-7","Walthamstow West"]
[44805,"Y01839",6322,160,137,78,118,46,"Lime Tree & Sinnott Healthcare Ltd","WF","WF-1","Chingford/ Walthamstow"]
[44805,"F86044",10718,116,111,55,88,39,"Crawley Road Medical Centre","WF","WF-4","Forest Integrated Health"]
[44805,"F86607",15796,273,243,145,205,131,"Addison Road Medical Practice","WF","WF-6","Central Walthamstow"]
[44805,"F86088",5027,105,92,58,82,56,"The Lyndhurst Surgery","WF","WF-4","Forest Integrated Health"]
[44805,"F86621",6546,153,131,83,125,42,"Green Man Medical Centre","WF","WF-5","South Leytonstone"]
[44805,"F86616",8131,269,233,186,161,98,"Old Church Surgery","WF","WF-2","Chingford E4"]
[44805,"F86062",7184,148,106,79,125,77,"The Grove Road Medical Centre","WF","WF-7","Walthamstow West"]
[44805,"F86045",2044,51,44,36,39,30,"High Road Surgery","WF","WF-5","South Leytonstone"]
[44805,"F86086",6265,81,60,36,50,15,"Dr Dhital Practice","WF","WF-6","Central Walthamstow"]
[44805,"F86078",6773,323,117,134,191,69,"The Ridgeway Surgery","WF","WF-2","Chingford E4"]
[44835,"F86664",8616,203,165,99,138,28,"Larkshall Medical Centre","WF","WF-1","Chingford/ Walthamstow"]
[44835,"F86650",8067,160,128,88,111,104,"Lime Tree Surgery","WF","WF-4","Forest Integrated Health"]
[44835,"F86679",6396,78,77,58,58,41,"Higham Hill Medical Centre","WF","WF-7","Walthamstow West"]
[44835,"F86666",14813,270,259,179,206,190,"The Harrow Road Surgery","WF","WF-5","South Leytonstone"]
[44835,"F86626",7243,102,83,53,63,17,"Dr Shantir Practice","WF","WF-1","Chingford/ Walthamstow"]
[44835,"F86625",5757,141,120,72,109,56,"LL Medical Care (Agarwal & Agrwal Practice)","WF","WF-5","South Leytonstone"]
[44835,"F86644",8966,218,205,111,144,66,"Waltham Forest Community & Family Health Services Ltd","WF","WF-6","Central Walthamstow"]
[44835,"F86627",13181,518,427,273,345,133,"Churchill Medical Centre","WF","WF-2","Chingford E4"]
[44835,"F86689",4399,87,68,44,58,10,"The Bailey Practice","WF","WF-1","Chingford/ Walthamstow"]
[44835,"F86712",3403,64,61,34,53,16,"Hampton Medical Centre","WF","WF-4","Forest Integrated Health"]
[44835,"F86708",2789,65,59,37,54,21,"Claremont Medical Centre","WF","WF-6","Central Walthamstow"]
[44835,"Y01839",6320,155,136,72,115,41,"Lime Tree & Sinnott Healthcare Ltd","WF","WF-1","Chingford/ Walthamstow"]
[44835,"Y01291",9502,382,362,204,264,182,"Chingford Medical Practice","WF","WF-2","Chingford E4"]
[44835,"F86700",3912,158,158,105,108,38,"Kings Head Medical Practice","WF","WF-1","Chingford/ Walthamstow"]
[44835,"F86696",6989,112,104,67,85,42,"Francis Road Medical Centre","WF","WF-4","Forest Integrated Health"]
[44835,"F86705",3495,67,54,39,45,19,"The Langthorne Sharma Family Practice","WF","WF-5","South Leytonstone"]
[44835,"F86701",3929,86,83,54,74,56,"Kiyani Medical Practice","WF","WF-5","South Leytonstone"]
[44835,"F86621",6561,148,127,73,120,45,"Green Man Medical Centre","WF","WF-5","South Leytonstone"]
[44835,"F86036",14460,304,213,171,210,93,"The Allum Medical Centre","WF","WF-4","Forest Integrated Health"]
[44835,"F86030",8277,164,138,93,132,65,"Queens Road Medical Centre","WF","WF-7","Walthamstow West"]
[44835,"F86044",10632,121,114,60,88,40,"Crawley Road Medical Centre","WF","WF-4","Forest Integrated Health"]
[44835,"F86038",11171,197,158,143,155,96,"Sma Medical Centre","WF","WF-3","Leyton Collaborative"]
[44835,"F86005",9539,179,175,103,118,66,"The Penryhn Surgery","WF","WF-1","Chingford/ Walthamstow"]
[44835,"F86001",7726,192,182,105,124,62,"The Firs","WF","WF-6","Central Walthamstow"]
[44835,"F86011",9838,200,156,97,136,65,"The Manor Practice","WF","WF-3","Leyton Collaborative"]
[44835,"F86006",6953,138,100,61,85,42,"Seymour Medical Centre","WF","WF-7","Walthamstow West"]
[44835,"F86088",5051,105,94,61,83,57,"The Lyndhurst Surgery","WF","WF-4","Forest Integrated Health"]
[44835,"F86086",6306,82,59,36,49,15,"Dr Dhital Practice","WF","WF-6","Central Walthamstow"]
[44835,"F86616",8197,267,233,179,164,110,"Old Church Surgery","WF","WF-2","Chingford E4"]
[44835,"F86607",15802,267,239,146,200,132,"Addison Road Medical Practice","WF","WF-6","Central Walthamstow"]
[44835,"F86058",16595,235,194,147,181,108,"St James Medical Practice Ltd","WF","WF-7","Walthamstow West"]
[44835,"F86045",2039,53,45,37,41,31,"High Road Surgery","WF","WF-5","South Leytonstone"]
[44835,"F86078",6774,315,118,124,185,70,"The Ridgeway Surgery","WF","WF-2","Chingford E4"]
[44835,"F86062",7164,148,106,76,124,82,"The Grove Road Medical Centre","WF","WF-7","Walthamstow West"]
[44866,"F86664",8537,196,159,88,134,26,"Larkshall Medical Centre","WF","WF-1","Chingford/ Walthamstow"]
[44866,"F86650",8086,161,128,84,116,88,"Lime Tree Surgery","WF","WF-4","Forest Integrated Health"]
[44866,"F86679",6405,78,77,55,60,44,"Higham Hill Medical Centre","WF","WF-7","Walthamstow West"]
[44866,"F86666",14767,280,266,191,214,206,"The Harrow Road Surgery","WF","WF-5","South Leytonstone"]
[44866,"F86626",7295,104,84,59,63,21,"Dr Shantir Practice","WF","WF-1","Chingford/ Walthamstow"]
[44866,"F86625",5748,143,121,75,110,54,"LL Medical Care (Agarwal & Agrwal Practice)","WF","WF-5","South Leytonstone"]
[44866,"F86644",8978,214,201,110,138,66,"Waltham Forest Community & Family Health Services Ltd","WF","WF-6","Central Walthamstow"]
[44866,"F86627",13176,513,423,272,343,134,"Churchill Medical Centre","WF","WF-2","Chingford E4"]
[44866,"F86689",4402,83,67,42,59,13,"The Bailey Practice","WF","WF-1","Chingford/ Walthamstow"]
[44866,"F86712",3441,65,61,37,55,18,"Hampton Medical Centre","WF","WF-4","Forest Integrated Health"]
[44866,"F86708",2809,65,59,38,54,21,"Claremont Medical Centre","WF","WF-6","Central Walthamstow"]
[44866,"Y01839",6382,159,141,102,120,83,"Lime Tree & Sinnott Healthcare Ltd","WF","WF-1","Chingford/ Walthamstow"]
[44866,"Y01291",9547,382,374,205,269,182,"Chingford Medical Practice","WF","WF-2","Chingford E4"]
[44866,"F86700",3868,159,159,106,111,37,"Kings Head Medical Practice","WF","WF-1","Chingford/ Walthamstow"]
[44866,"F86696",7009,112,105,64,87,46,"Francis Road Medical Centre","WF","WF-4","Forest Integrated Health"]
[44866,"F86705",3484,68,55,36,46,20,"The Langthorne Sharma Family Practice","WF","WF-5","South Leytonstone"]
[44866,"F86701",3937,92,87,59,79,59,"Kiyani Medical Practice","WF","WF-5","South Leytonstone"]
[44866,"F86621",6601,146,126,68,120,44,"Green Man Medical Centre","WF","WF-5","South Leytonstone"]
[44866,"F86036",14487,301,212,176,208,92,"The Allum Medical Centre","WF","WF-4","Forest Integrated Health"]
[44866,"F86030",8299,165,139,102,131,71,"Queens Road Medical Centre","WF","WF-7","Walthamstow West"]
[44866,"F86044",10652,117,109,61,84,39,"Crawley Road Medical Centre","WF","WF-4","Forest Integrated Health"]
[44866,"F86038",11209,202,163,139,160,100,"Sma Medical Centre","WF","WF-3","Leyton Collaborative"]
[44866,"F86005",9526,179,173,101,117,67,"The Penryhn Surgery","WF","WF-1","Chingford/ Walthamstow"]
[44866,"F86001",7772,183,173,94,118,67,"The Firs","WF","WF-6","Central Walthamstow"]
[44866,"F86011",9804,203,161,97,139,69,"The Manor Practice","WF","WF-3","Leyton Collaborative"]
[44866,"F86006",6971,140,101,57,86,41,"Seymour Medical Centre","WF","WF-7","Walthamstow West"]
[44866,"F86088",5061,108,97,59,91,63,"The Lyndhurst Surgery","WF","WF-4","Forest Integrated Health"]
[44866,"F86086",6302,83,59,39,50,12,"Dr Dhital Practice","WF","WF-6","Central Walthamstow"]
[44866,"F86616",8231,264,237,178,164,129,"Old Church Surgery","WF","WF-2","Chingford E4"]
[44866,"F86607",15844,264,236,138,196,118,"Addison Road Medical Practice","WF","WF-6","Central Walthamstow"]
[44866,"F86058",16653,242,196,153,185,110,"St James Medical Practice Ltd","WF","WF-7","Walthamstow West"]
[44866,"F86045",2060,53,45,36,40,32,"High Road Surgery","WF","WF-5","South Leytonstone"]
[44866,"F86078",6777,315,117,132,185,70,"The Ridgeway Surgery","WF","WF-2","Chingford E4"]
[44866,"F86062",7183,149,105,77,123,87,"The Grove Road Medical Centre","WF","WF-7","Walthamstow West"]
[44896,"Y01839",6483,154,137,109,119,107,"Lime Tree & Sinnott Healthcare Ltd","WF","WF-1","Chingford/ Walthamstow"]
[44896,"F86664",8544,196,160,95,138,26,"Larkshall Medical Centre","WF","WF-1","Chingford/ Walthamstow"]
[44896,"F86650",8065,160,125,92,115,82,"Lime Tree Surgery","WF","WF-4","Forest Integrated Health"]
[44896,"F86679",6409,78,77,58,59,42,"Higham Hill Medical Centre","WF","WF-7","Walthamstow West"]
[44896,"F86666",14828,269,256,192,207,202,"The Harrow Road Surgery","WF","WF-5","South Leytonstone"]
[44896,"F86626",7350,102,83,58,62,20,"Dr Shantir Practice","WF","WF-1","Chingford/ Walthamstow"]
[44896,"F86625",5733,144,120,78,108,57,"LL Medical Care (Agarwal & Agrwal Practice)","WF","WF-5","South Leytonstone"]
[44896,"F86644",8989,212,197,117,137,76,"Waltham Forest Community & Family Health Services Ltd","WF","WF-6","Central Walthamstow"]
[44896,"F86627",13175,512,421,269,342,142,"Churchill Medical Centre","WF","WF-2","Chingford E4"]
[44896,"F86708",2834,65,59,40,54,22,"Claremont Medical Centre","WF","WF-6","Central Walthamstow"]
[44896,"F86705",3477,67,55,28,45,21,"The Langthorne Sharma Family Practice","WF","WF-5","South Leytonstone"]
[44896,"Y01291",9554,386,374,219,272,178,"Chingford Medical Practice","WF","WF-2","Chingford E4"]
[44896,"F86712",3452,64,63,37,53,19,"Hampton Medical Centre","WF","WF-4","Forest Integrated Health"]
[44896,"F86696",7106,115,105,66,86,46,"Francis Road Medical Centre","WF","WF-4","Forest Integrated Health"]
[44896,"F86689",4410,84,67,46,61,14,"The Bailey Practice","WF","WF-1","Chingford/ Walthamstow"]
[44896,"F86701",3946,88,88,56,77,50,"Kiyani Medical Practice","WF","WF-5","South Leytonstone"]
[44896,"F86700",3848,158,156,106,111,38,"Kings Head Medical Practice","WF","WF-1","Chingford/ Walthamstow"]
[44896,"F86621",6651,149,130,76,122,45,"Green Man Medical Centre","WF","WF-5","South Leytonstone"]
[44896,"F86036",14453,309,216,183,215,87,"The Allum Medical Centre","WF","WF-4","Forest Integrated Health"]
[44896,"F86030",8324,164,138,104,128,68,"Queens Road Medical Centre","WF","WF-7","Walthamstow West"]
[44896,"F86044",10556,119,111,64,86,39,"Crawley Road Medical Centre","WF","WF-4","Forest Integrated Health"]
[44896,"F86038",11189,202,163,140,159,100,"Sma Medical Centre","WF","WF-3","Leyton Collaborative"]
[44896,"F86005",9499,177,172,102,115,68,"The Penryhn Surgery","WF","WF-1","Chingford/ Walthamstow"]
[44896,"F86001",7868,189,180,102,123,69,"The Firs","WF","WF-6","Central Walthamstow"]
[44896,"F86011",9799,206,165,100,142,72,"The Manor Practice","WF","WF-3","Leyton Collaborative"]
[44896,"F86006",6999,138,100,60,85,47,"Seymour Medical Centre","WF","WF-7","Walthamstow West"]
[44896,"F86088",5057,107,96,58,91,62,"The Lyndhurst Surgery","WF","WF-4","Forest Integrated Health"]
[44896,"F86086",6321,82,58,39,51,17,"Dr Dhital Practice","WF","WF-6","Central Walthamstow"]
[44896,"F86616",8242,263,240,171,165,140,"Old Church Surgery","WF","WF-2","Chingford E4"]
[44896,"F86607",15863,263,235,144,196,123,"Addison Road Medical Practice","WF","WF-6","Central Walthamstow"]
[44896,"F86058",16283,246,201,158,189,112,"St James Medical Practice Ltd","WF","WF-7","Walthamstow West"]
[44896,"F86045",2050,52,44,33,41,29,"High Road Surgery","WF","WF-5","South Leytonstone"]
[44896,"F86078",6779,315,115,129,181,71,"The Ridgeway Surgery","WF","WF-2","Chingford E4"]
[44896,"F86062",7180,145,103,77,120,82,"The Grove Road Medical Centre","WF","WF-7","Walthamstow West"]
[44927,"F86086",6360,83,61,50,54,20,"Dr Dhital Practice","WF","WF-6","Central Walthamstow"]
[44927,"F86088",5072,108,97,60,92,61,"The Lyndhurst Surgery","WF","WF-4","Forest Integrated Health"]
[44927,"F86062",7176,145,104,74,120,82,"The Grove Road Medical Centre","WF","WF-7","Walthamstow West"]
[44927,"F86078",6800,316,112,141,179,70,"The Ridgeway Surgery","WF","WF-2","Chingford E4"]
[44927,"F86621",6688,150,130,76,126,47,"Green Man Medical Centre","WF","WF-5","South Leytonstone"]
[44927,"F86625",5710,145,120,76,107,55,"LL Medical Care (Agarwal & Agrwal Practice)","WF","WF-5","South Leytonstone"]
[44927,"F86607",15894,265,235,150,199,120,"Addison Road Medical Practice","WF","WF-6","Central Walthamstow"]
[44927,"F86616",8266,263,237,172,168,144,"Old Church Surgery","WF","WF-2","Chingford E4"]
[44927,"F86058",16267,247,197,160,189,113,"St James Medical Practice Ltd","WF","WF-7","Walthamstow West"]
[44927,"F86011",9823,201,160,94,140,71,"The Manor Practice","WF","WF-3","Leyton Collaborative"]
[44927,"F86030",8330,165,138,110,130,71,"Queens Road Medical Centre","WF","WF-7","Walthamstow West"]
[44927,"F86005",9520,176,172,108,111,64,"The Penryhn Surgery","WF","WF-1","Chingford/ Walthamstow"]
[44927,"F86006",7010,140,100,65,85,48,"Seymour Medical Centre","WF","WF-7","Walthamstow West"]
[44927,"F86044",10502,121,113,68,88,41,"Crawley Road Medical Centre","WF","WF-4","Forest Integrated Health"]
[44927,"F86045",2046,53,45,36,42,30,"High Road Surgery","WF","WF-5","South Leytonstone"]
[44927,"F86036",14418,306,215,181,213,89,"The Allum Medical Centre","WF","WF-4","Forest Integrated Health"]
[44927,"F86038",11194,197,161,140,156,96,"Sma Medical Centre","WF","WF-3","Leyton Collaborative"]
[44927,"F86705",3469,64,53,29,42,21,"The Langthorne Sharma Family Practice","WF","WF-5","South Leytonstone"]
[44927,"F86708",2825,64,61,44,54,23,"Claremont Medical Centre","WF","WF-6","Central Walthamstow"]
[44927,"F86700",3855,158,156,102,109,41,"Kings Head Medical Practice","WF","WF-1","Chingford/ Walthamstow"]
[44927,"F86701",3940,87,87,61,78,61,"Kiyani Medical Practice","WF","WF-5","South Leytonstone"]
[44927,"Y01839",6508,153,141,112,119,107,"Lime Tree & Sinnott Healthcare Ltd","WF","WF-1","Chingford/ Walthamstow"]
[44927,"F86001",7985,189,177,100,127,72,"The Firs","WF","WF-6","Central Walthamstow"]
[44927,"F86712",3468,64,63,40,54,18,"Hampton Medical Centre","WF","WF-4","Forest Integrated Health"]
[44927,"Y01291",9594,384,373,226,269,173,"Chingford Medical Practice","WF","WF-2","Chingford E4"]
[44927,"F86696",7099,118,106,68,88,48,"Francis Road Medical Centre","WF","WF-4","Forest Integrated Health"]
[44927,"F86644",9053,206,190,111,133,77,"Waltham Forest Community & Family Health Services Ltd","WF","WF-6","Central Walthamstow"]
[44927,"F86650",8047,158,123,94,113,77,"Lime Tree Surgery","WF","WF-4","Forest Integrated Health"]
[44927,"F86626",7391,104,85,58,63,22,"Dr Shantir Practice","WF","WF-1","Chingford/ Walthamstow"]
[44927,"F86627",13163,517,422,275,343,146,"Churchill Medical Centre","WF","WF-2","Chingford E4"]
[44927,"F86679",6413,80,79,56,60,41,"Higham Hill Medical Centre","WF","WF-7","Walthamstow West"]
[44927,"F86689",4412,84,68,44,62,14,"The Bailey Practice","WF","WF-1","Chingford/ Walthamstow"]
[44927,"F86664",8562,192,158,98,139,25,"Larkshall Medical Centre","WF","WF-1","Chingford/ Walthamstow"]
[44927,"F86666",14864,269,255,184,206,204,"The Harrow Road Surgery","WF","WF-5","South Leytonstone"]
[44958,"F86030",8328,162,134,109,132,84,"Queens Road Medical Centre","WF","WF-7","Walthamstow West"]
[44958,"F86627",13170,523,424,285,339,164,"Churchill Medical Centre","WF","WF-2","Chingford E4"]
[44958,"F86666",14806,262,252,188,198,202,"The Harrow Road Surgery","WF","WF-5","South Leytonstone"]
[44958,"F86086",6348,83,65,54,56,24,"Dr Dhital Practice","WF","WF-6","Central Walthamstow"]
[44958,"F86664",8625,188,158,100,135,29,"Larkshall Medical Centre","WF","WF-1","Chingford/ Walthamstow"]
[44958,"F86626",7426,102,83,55,62,22,"Dr Shantir Practice","WF","WF-1","Chingford/ Walthamstow"]
[44958,"Y01839",6571,155,141,116,117,107,"Lime Tree & Sinnott Healthcare Ltd","WF","WF-1","Chingford/ Walthamstow"]
[44958,"F86044",10511,129,120,79,94,49,"Crawley Road Medical Centre","WF","WF-4","Forest Integrated Health"]
[44958,"F86011",9798,201,162,94,138,71,"The Manor Practice","WF","WF-3","Leyton Collaborative"]
[44958,"F86062",7185,146,102,73,119,80,"The Grove Road Medical Centre","WF","WF-7","Walthamstow West"]
[44958,"F86045",2038,53,47,37,43,31,"High Road Surgery","WF","WF-5","South Leytonstone"]
[44958,"F86700",3877,162,160,104,112,43,"Kings Head Medical Practice","WF","WF-1","Chingford/ Walthamstow"]
[44958,"F86705",3466,66,55,29,43,24,"The Langthorne Sharma Family Practice","WF","WF-5","South Leytonstone"]
[44958,"F86701",3927,87,86,61,78,65,"Kiyani Medical Practice","WF","WF-5","South Leytonstone"]
[44958,"F86696",7135,116,103,68,87,52,"Francis Road Medical Centre","WF","WF-4","Forest Integrated Health"]
[44958,"F86679",6368,80,78,57,60,39,"Higham Hill Medical Centre","WF","WF-7","Walthamstow West"]
[44958,"F86644",9031,207,188,117,133,80,"Waltham Forest Community & Family Health Services Ltd","WF","WF-6","Central Walthamstow"]
[44958,"F86058",16131,247,197,158,191,120,"St James Medical Practice Ltd","WF","WF-7","Walthamstow West"]
[44958,"F86689",4413,87,70,53,65,17,"The Bailey Practice","WF","WF-1","Chingford/ Walthamstow"]
[44958,"Y01291",9601,379,365,236,269,179,"Chingford Medical Practice","WF","WF-2","Chingford E4"]
[44958,"F86621",6709,147,129,74,123,48,"Green Man Medical Centre","WF","WF-5","South Leytonstone"]
[44958,"F86038",11172,197,161,143,157,99,"Sma Medical Centre","WF","WF-3","Leyton Collaborative"]
[44958,"F86005",9539,173,168,107,109,67,"The Penryhn Surgery","WF","WF-1","Chingford/ Walthamstow"]
[44958,"F86712",3478,65,65,42,54,20,"Hampton Medical Centre","WF","WF-4","Forest Integrated Health"]
[44958,"F86616",8285,270,243,173,174,149,"Old Church Surgery","WF","WF-2","Chingford E4"]
[44958,"F86036",14424,304,215,182,213,95,"The Allum Medical Centre","WF","WF-4","Forest Integrated Health"]
[44958,"F86001",8152,190,174,103,127,78,"The Firs","WF","WF-6","Central Walthamstow"]
[44958,"F86607",15926,265,234,152,199,149,"Addison Road Medical Practice","WF","WF-6","Central Walthamstow"]
[44958,"F86708",2813,61,57,47,50,22,"Claremont Medical Centre","WF","WF-6","Central Walthamstow"]
[44958,"F86625",5721,146,119,75,107,55,"LL Medical Care (Agarwal & Agrwal Practice)","WF","WF-5","South Leytonstone"]
[44958,"F86650",8040,156,122,89,113,74,"Lime Tree Surgery","WF","WF-4","Forest Integrated Health"]
[44958,"F86088",5100,104,94,62,88,61,"The Lyndhurst Surgery","WF","WF-4","Forest Integrated Health"]
[44958,"F86006",7021,137,97,62,84,48,"Seymour Medical Centre","WF","WF-7","Walthamstow West"]
[44958,"F86078",6793,312,109,152,176,66,"The Ridgeway Surgery","WF","WF-2","Chingford E4"]
[44986,"Y01291",9670,375,359,237,264,196,"Chingford Medical Practice","WF","WF-2","Chingford E4"]
[44986,"F86045",2039,54,48,39,44,33,"High Road Surgery","WF","WF-5","South Leytonstone"]
[44986,"F86696",7105,113,100,62,87,53,"Francis Road Medical Centre","WF","WF-4","Forest Integrated Health"]
[44986,"F86036",14354,301,209,183,213,90,"The Allum Medical Centre","WF","WF-4","Forest Integrated Health"]
[44986,"F86701",3966,91,88,62,83,74,"Kiyani Medical Practice","WF","WF-5","South Leytonstone"]
[44986,"Y01839",6587,153,139,113,117,104,"Lime Tree & Sinnott Healthcare Ltd","WF","WF-1","Chingford/ Walthamstow"]
[44986,"F86650",7987,156,123,96,111,75,"Lime Tree Surgery","WF","WF-4","Forest Integrated Health"]
[44986,"F86700",3863,165,163,110,115,40,"Kings Head Medical Practice","WF","WF-1","Chingford/ Walthamstow"]
[44986,"F86078",6804,304,107,147,174,59,"The Ridgeway Surgery","WF","WF-2","Chingford E4"]
[44986,"F86666",14896,267,256,198,204,205,"The Harrow Road Surgery","WF","WF-5","South Leytonstone"]
[44986,"F86664",8598,179,152,101,129,37,"Larkshall Medical Centre","WF","WF-1","Chingford/ Walthamstow"]
[44986,"F86062",7218,149,104,77,120,77,"The Grove Road Medical Centre","WF","WF-7","Walthamstow West"]
[44986,"F86038",11112,194,163,137,154,114,"Sma Medical Centre","WF","WF-3","Leyton Collaborative"]
[44986,"F86644",9082,207,187,113,136,107,"Waltham Forest Community & Family Health Services Ltd","WF","WF-6","Central Walthamstow"]
[44986,"F86689",4392,89,72,50,66,18,"The Bailey Practice","WF","WF-1","Chingford/ Walthamstow"]
[44986,"F86058",16038,245,196,164,190,154,"St James Medical Practice Ltd","WF","WF-7","Walthamstow West"]
[44986,"F86044",10515,138,124,84,103,54,"Crawley Road Medical Centre","WF","WF-4","Forest Integrated Health"]
[44986,"F86679",6371,79,77,57,60,42,"Higham Hill Medical Centre","WF","WF-7","Walthamstow West"]
[44986,"F86705",3471,68,54,39,44,26,"The Langthorne Sharma Family Practice","WF","WF-5","South Leytonstone"]
[44986,"F86708",2815,62,58,47,48,24,"Claremont Medical Centre","WF","WF-6","Central Walthamstow"]
[44986,"F86626",7453,104,84,59,63,28,"Dr Shantir Practice","WF","WF-1","Chingford/ Walthamstow"]
[44986,"F86011",9816,202,160,94,140,78,"The Manor Practice","WF","WF-3","Leyton Collaborative"]
[44986,"F86712",3480,64,63,42,54,37,"Hampton Medical Centre","WF","WF-4","Forest Integrated Health"]
[44986,"F86607",16053,260,242,154,198,166,"Addison Road Medical Practice","WF","WF-6","Central Walthamstow"]
[44986,"F86030",8289,161,132,107,131,103,"Queens Road Medical Centre","WF","WF-7","Walthamstow West"]
[44986,"F86627",13199,521,421,296,339,164,"Churchill Medical Centre","WF","WF-2","Chingford E4"]
[44986,"F86001",8311,191,177,111,127,124,"The Firs","WF","WF-6","Central Walthamstow"]
[44986,"F86621",6746,149,129,85,124,51,"Green Man Medical Centre","WF","WF-5","South Leytonstone"]
[44986,"F86086",6389,83,64,53,57,26,"Dr Dhital Practice","WF","WF-6","Central Walthamstow"]
[44986,"F86616",8314,271,245,175,178,150,"Old Church Surgery","WF","WF-2","Chingford E4"]
[44986,"F86088",5102,106,97,68,90,65,"The Lyndhurst Surgery","WF","WF-4","Forest Integrated Health"]
[44986,"F86625",5705,149,121,75,109,60,"LL Medical Care (Agarwal & Agrwal Practice)","WF","WF-5","South Leytonstone"]
[44986,"F86006",7064,137,95,70,85,47,"Seymour Medical Centre","WF","WF-7","Walthamstow West"]
[44986,"F86005",9520,170,164,103,108,63,"The Penryhn Surgery","WF","WF-1","Chingford/ Walthamstow"]
[45017,"F86705",3447,73,66,41,47,36,"The Langthorne Sharma Family Practice","WF","WF-5","South Leytonstone"]
[45017,"F86701",4010,96,92,73,84,79,"Kiyani Medical Practice","WF","WF-5","South Leytonstone"]
[45017,"F86696",7132,112,105,63,87,56,"Francis Road Medical Centre","WF","WF-4","Forest Integrated Health"]
[45017,"F86700",3845,159,157,109,112,94,"Kings Head Medical Practice","WF","WF-1","Chingford/ Walthamstow"]
[45017,"F86708",2843,63,59,49,49,28,"Claremont Medical Centre","WF","WF-6","Central Walthamstow"]
[45017,"Y01839",6601,153,138,110,118,99,"Lime Tree & Sinnott Healthcare Ltd","WF","WF-1","Chingford/ Walthamstow"]
[45017,"F86625",5726,149,121,77,109,80,"LL Medical Care (Agarwal & Agrwal Practice)","WF","WF-5","South Leytonstone"]
[45017,"F86712",3433,63,62,43,54,46,"Hampton Medical Centre","WF","WF-4","Forest Integrated Health"]
[45017,"Y01291",9699,379,360,238,267,214,"Chingford Medical Practice","WF","WF-2","Chingford E4"]
[45017,"F86689",4367,86,80,50,63,19,"The Bailey Practice","WF","WF-1","Chingford/ Walthamstow"]
[45017,"F86044",10497,142,129,88,105,53,"Crawley Road Medical Centre","WF","WF-4","Forest Integrated Health"]
[45017,"F86045",2032,53,49,40,44,32,"High Road Surgery","WF","WF-5","South Leytonstone"]
[45017,"F86058",15867,245,198,173,192,161,"St James Medical Practice Ltd","WF","WF-7","Walthamstow West"]
[45017,"F86030",8280,159,130,98,129,104,"Queens Road Medical Centre","WF","WF-7","Walthamstow West"]
[45017,"F86036",14350,298,208,193,212,89,"The Allum Medical Centre","WF","WF-4","Forest Integrated Health"]
[45017,"F86038",11059,197,166,138,156,134,"Sma Medical Centre","WF","WF-3","Leyton Collaborative"]
[45017,"F86088",5098,108,99,78,91,66,"The Lyndhurst Surgery","WF","WF-4","Forest Integrated Health"]
[45017,"F86607",16152,263,244,163,198,176,"Addison Road Medical Practice","WF","WF-6","Central Walthamstow"]
[45017,"F86616",8351,279,250,181,189,148,"Old Church Surgery","WF","WF-2","Chingford E4"]
[45017,"F86062",7220,149,100,78,122,79,"The Grove Road Medical Centre","WF","WF-7","Walthamstow West"]
[45017,"F86078",6811,307,279,196,182,142,"The Ridgeway Surgery","WF","WF-2","Chingford E4"]
[45017,"F86086",6398,89,83,55,59,28,"Dr Dhital Practice","WF","WF-6","Central Walthamstow"]
[45017,"F86650",7953,157,140,100,107,75,"Lime Tree Surgery","WF","WF-4","Forest Integrated Health"]
[45017,"F86644",9083,207,184,116,135,113,"Waltham Forest Community & Family Health Services Ltd","WF","WF-6","Central Walthamstow"]
[45017,"F86627",13171,507,412,314,337,158,"Churchill Medical Centre","WF","WF-2","Chingford E4"]
[45017,"F86679",6412,79,76,54,59,43,"Higham Hill Medical Centre","WF","WF-7","Walthamstow West"]
[45017,"F86666",14945,276,265,206,206,212,"The Harrow Road Surgery","WF","WF-5","South Leytonstone"]
[45017,"F86664",8579,176,154,101,127,36,"Larkshall Medical Centre","WF","WF-1","Chingford/ Walthamstow"]
[45017,"F86005",9530,168,160,115,107,68,"The Penryhn Surgery","WF","WF-1","Chingford/ Walthamstow"]
[45017,"F86006",7082,138,95,69,88,50,"Seymour Medical Centre","WF","WF-7","Walthamstow West"]
[45017,"F86011",9774,201,158,108,137,112,"The Manor Practice","WF","WF-3","Leyton Collaborative"]
[45017,"F86626",7441,103,84,64,63,32,"Dr Shantir Practice","WF","WF-1","Chingford/ Walthamstow"]
[45017,"F86621",6805,150,129,92,126,54,"Green Man Medical Centre","WF","WF-5","South Leytonstone"]
[45017,"F86001",8444,196,176,116,130,114,"The Firs","WF","WF-6","Central Walthamstow"]
[45078,"F86607",16244,272,256,47,187,23,"Addison Road Medical Practice","WF","WF-6","Central Walthamstow"]
[45078,"F86616",8411,289,251,57,166,23,"Old Church Surgery","WF","WF-2","Chingford E4"]
[45078,"F86088",5104,114,100,21,84,13,"The Lyndhurst Surgery","WF","WF-4","Forest Integrated Health"]
[45078,"F86078",6772,310,294,35,154,27,"The Ridgeway Surgery","WF","WF-2","Chingford E4"]
[45078,"F86086",6390,93,84,18,59,11,"Dr Dhital Practice","WF","WF-6","Central Walthamstow"]
[45078,"F86627",13207,507,409,78,292,34,"Churchill Medical Centre","WF","WF-2","Chingford E4"]
[45078,"F86644",9072,207,181,32,122,12,"Waltham Forest Community & Family Health Services Ltd","WF","WF-6","Central Walthamstow"]
[45078,"F86626",7498,110,88,10,63,2,"Dr Shantir Practice","WF","WF-1","Chingford/ Walthamstow"]
[45078,"F86621",6852,154,128,32,119,11,"Green Man Medical Centre","WF","WF-5","South Leytonstone"]
[45078,"F86625",5715,151,123,32,104,16,"LL Medical Care (Agarwal & Agrwal Practice)","WF","WF-5","South Leytonstone"]
[45078,"F86062",7211,150,103,28,103,21,"The Grove Road Medical Centre","WF","WF-7","Walthamstow West"]
[45078,"F86011",9812,215,205,44,131,25,"The Manor Practice","WF","WF-3","Leyton Collaborative"]
[45078,"F86030",8263,172,133,52,120,58,"Queens Road Medical Centre","WF","WF-7","Walthamstow West"]
[45078,"F86006",7066,138,92,21,66,7,"Seymour Medical Centre","WF","WF-7","Walthamstow West"]
[45078,"F86001",8773,190,173,23,123,11,"The Firs","WF","WF-6","Central Walthamstow"]
[45078,"F86005",9453,171,159,20,109,20,"The Penryhn Surgery","WF","WF-1","Chingford/ Walthamstow"]
[45078,"F86045",2049,49,44,4,35,6,"High Road Surgery","WF","WF-5","South Leytonstone"]
[45078,"F86058",16082,250,204,63,182,26,"St James Medical Practice Ltd","WF","WF-7","Walthamstow West"]
[45078,"F86044",10437,135,124,35,89,13,"Crawley Road Medical Centre","WF","WF-4","Forest Integrated Health"]
[45078,"F86036",14365,285,201,70,178,20,"The Allum Medical Centre","WF","WF-4","Forest Integrated Health"]
[45078,"F86038",11138,203,193,61,150,14,"Sma Medical Centre","WF","WF-3","Leyton Collaborative"]
[45078,"F86712",3456,67,64,19,54,5,"Hampton Medical Centre","WF","WF-4","Forest Integrated Health"]
[45078,"F86650",7922,156,139,16,96,7,"Lime Tree Surgery","WF","WF-4","Forest Integrated Health"]
[45078,"F86708",2842,66,65,5,42,6,"Claremont Medical Centre","WF","WF-6","Central Walthamstow"]
[45078,"Y01839",6722,153,137,16,102,6,"Lime Tree & Sinnott Healthcare Ltd","WF","WF-1","Chingford/ Walthamstow"]
[45078,"Y01291",9787,376,356,69,228,47,"Chingford Medical Practice","WF","WF-2","Chingford E4"]
[45078,"F86700",3794,154,151,27,83,10,"Kings Head Medical Practice","WF","WF-1","Chingford/ Walthamstow"]
[45078,"F86701",4009,99,96,8,78,5,"Kiyani Medical Practice","WF","WF-5","South Leytonstone"]
[45078,"F86689",4406,86,76,10,53,6,"The Bailey Practice","WF","WF-1","Chingford/ Walthamstow"]
[45078,"F86696",7191,117,108,19,81,19,"Francis Road Medical Centre","WF","WF-4","Forest Integrated Health"]
[45078,"F86664",8571,179,156,32,81,13,"Larkshall Medical Centre","WF","WF-1","Chingford/ Walthamstow"]
[45078,"F86666",15046,289,286,47,182,48,"The Harrow Road Surgery","WF","WF-5","South Leytonstone"]
[45078,"F86679",6433,79,74,18,53,7,"Higham Hill Medical Centre","WF","WF-7","Walthamstow West"]
[45078,"F86705",3440,73,66,9,35,15,"The Langthorne Sharma Family Practice","WF","WF-5","South Leytonstone"]
[45108,"F86078",6799,306,285,64,169,40,"The Ridgeway Surgery","WF","WF-2","Chingford E4"]
[45108,"F86045",2070,50,45,8,36,12,"High Road Surgery","WF","WF-5","South Leytonstone"]
[45108,"F86086",6359,91,83,16,63,13,"Dr Dhital Practice","WF","WF-6","Central Walthamstow"]
[45108,"F86044",10459,135,123,48,96,19,"Crawley Road Medical Centre","WF","WF-4","Forest Integrated Health"]
[45108,"F86058",16208,256,205,89,192,36,"St James Medical Practice Ltd","WF","WF-7","Walthamstow West"]
[45108,"F86030",8281,172,132,77,133,83,"Queens Road Medical Centre","WF","WF-7","Walthamstow West"]
[45108,"F86705",3440,71,65,18,37,16,"The Langthorne Sharma Family Practice","WF","WF-5","South Leytonstone"]
[45108,"F86062",7210,153,106,50,111,35,"The Grove Road Medical Centre","WF","WF-7","Walthamstow West"]
[45108,"F86001",8917,191,172,40,131,17,"The Firs","WF","WF-6","Central Walthamstow"]
[45108,"F86036",14406,282,199,92,186,30,"The Allum Medical Centre","WF","WF-4","Forest Integrated Health"]
[45108,"F86038",11128,200,194,88,154,27,"Sma Medical Centre","WF","WF-3","Leyton Collaborative"]
[45108,"F86621",6908,153,129,46,124,19,"Green Man Medical Centre","WF","WF-5","South Leytonstone"]
[45108,"F86616",8394,287,246,91,174,31,"Old Church Surgery","WF","WF-2","Chingford E4"]
[45108,"F86607",16295,275,265,62,197,31,"Addison Road Medical Practice","WF","WF-6","Central Walthamstow"]
[45108,"F86005",9448,171,160,29,110,27,"The Penryhn Surgery","WF","WF-1","Chingford/ Walthamstow"]
[45108,"F86088",5109,112,99,30,84,20,"The Lyndhurst Surgery","WF","WF-4","Forest Integrated Health"]
[45108,"F86011",9795,215,201,65,136,30,"The Manor Practice","WF","WF-3","Leyton Collaborative"]
[45108,"F86006",7069,141,91,26,72,12,"Seymour Medical Centre","WF","WF-7","Walthamstow West"]
[45108,"F86712",3455,65,64,36,55,12,"Hampton Medical Centre","WF","WF-4","Forest Integrated Health"]
[45108,"F86650",7912,156,138,34,101,14,"Lime Tree Surgery","WF","WF-4","Forest Integrated Health"]
[45108,"Y01291",9833,374,352,102,242,68,"Chingford Medical Practice","WF","WF-2","Chingford E4"]
[45108,"F86664",8587,184,161,47,112,18,"Larkshall Medical Centre","WF","WF-1","Chingford/ Walthamstow"]
[45108,"Y01839",6774,152,133,32,111,18,"Lime Tree & Sinnott Healthcare Ltd","WF","WF-1","Chingford/ Walthamstow"]
[45108,"F86626",7541,110,88,17,65,5,"Dr Shantir Practice","WF","WF-1","Chingford/ Walthamstow"]
[45108,"F86625",5733,149,121,43,108,22,"LL Medical Care (Agarwal & Agrwal Practice)","WF","WF-5","South Leytonstone"]
[45108,"F86627",13229,499,399,112,303,48,"Churchill Medical Centre","WF","WF-2","Chingford E4"]
[45108,"F86708",2838,67,67,11,46,12,"Claremont Medical Centre","WF","WF-6","Central Walthamstow"]
[45108,"F86644",9182,205,181,52,129,25,"Waltham Forest Community & Family Health Services Ltd","WF","WF-6","Central Walthamstow"]
[45108,"F86701",4007,97,93,26,77,43,"Kiyani Medical Practice","WF","WF-5","South Leytonstone"]
[45108,"F86696",7243,116,110,34,86,25,"Francis Road Medical Centre","WF","WF-4","Forest Integrated Health"]
[45108,"F86700",3806,154,151,45,94,13,"Kings Head Medical Practice","WF","WF-1","Chingford/ Walthamstow"]
[45108,"F86679",6458,82,77,37,58,13,"Higham Hill Medical Centre","WF","WF-7","Walthamstow West"]
[45108,"F86666",15067,280,275,71,185,69,"The Harrow Road Surgery","WF","WF-5","South Leytonstone"]
[45108,"F86689",4417,88,76,18,58,9,"The Bailey Practice","WF","WF-1","Chingford/ Walthamstow"]
[45139,"F86058",15907,250,200,108,189,51,"St James Medical Practice Ltd","WF","WF-7","Walthamstow West"]
[45139,"F86626",7589,111,88,21,69,10,"Dr Shantir Practice","WF","WF-1","Chingford/ Walthamstow"]
[45139,"F86625",5740,151,122,54,111,28,"LL Medical Care (Agarwal & Agrwal Practice)","WF","WF-5","South Leytonstone"]
[45139,"F86607",16406,285,269,85,207,43,"Addison Road Medical Practice","WF","WF-6","Central Walthamstow"]
[45139,"F86712",3460,69,67,42,56,33,"Hampton Medical Centre","WF","WF-4","Forest Integrated Health"]
[45139,"F86621",6933,154,129,53,126,25,"Green Man Medical Centre","WF","WF-5","South Leytonstone"]
[45139,"F86689",4445,86,75,22,60,11,"The Bailey Practice","WF","WF-1","Chingford/ Walthamstow"]
[45139,"F86701",4025,100,95,42,81,53,"Kiyani Medical Practice","WF","WF-5","South Leytonstone"]
[45139,"F86666",15087,280,273,87,190,105,"The Harrow Road Surgery","WF","WF-5","South Leytonstone"]
[45139,"F86086",6359,90,81,23,63,14,"Dr Dhital Practice","WF","WF-6","Central Walthamstow"]
[45139,"F86696",7160,117,111,38,89,31,"Francis Road Medical Centre","WF","WF-4","Forest Integrated Health"]
[45139,"F86700",3793,151,148,51,97,19,"Kings Head Medical Practice","WF","WF-1","Chingford/ Walthamstow"]
[45139,"F86062",7206,156,105,69,116,41,"The Grove Road Medical Centre","WF","WF-7","Walthamstow West"]
[45139,"F86664",8580,187,164,58,120,22,"Larkshall Medical Centre","WF","WF-1","Chingford/ Walthamstow"]
[45139,"F86644",9158,209,183,80,133,36,"Waltham Forest Community & Family Health Services Ltd","WF","WF-6","Central Walthamstow"]
[45139,"F86078",6791,307,281,77,180,45,"The Ridgeway Surgery","WF","WF-2","Chingford E4"]
[45139,"F86627",13238,496,400,135,306,76,"Churchill Medical Centre","WF","WF-2","Chingford E4"]
[45139,"F86088",5098,112,100,36,85,24,"The Lyndhurst Surgery","WF","WF-4","Forest Integrated Health"]
[45139,"F86705",3446,67,61,22,37,19,"The Langthorne Sharma Family Practice","WF","WF-5","South Leytonstone"]
[45139,"F86650",7916,157,138,49,103,19,"Lime Tree Surgery","WF","WF-4","Forest Integrated Health"]
[45139,"F86708",2845,68,67,24,47,13,"Claremont Medical Centre","WF","WF-6","Central Walthamstow"]
[45139,"F86679",6482,83,78,41,58,21,"Higham Hill Medical Centre","WF","WF-7","Walthamstow West"]
[45139,"F86038",11132,204,198,112,158,43,"Sma Medical Centre","WF","WF-3","Leyton Collaborative"]
[45139,"F86036",14386,282,200,100,190,45,"The Allum Medical Centre","WF","WF-4","Forest Integrated Health"]
[45139,"F86030",8259,170,132,89,135,91,"Queens Road Medical Centre","WF","WF-7","Walthamstow West"]
[45139,"F86616",8439,284,244,112,180,42,"Old Church Surgery","WF","WF-2","Chingford E4"]
[45139,"F86045",2046,52,48,14,38,15,"High Road Surgery","WF","WF-5","South Leytonstone"]
[45139,"F86044",10475,127,117,61,90,20,"Crawley Road Medical Centre","WF","WF-4","Forest Integrated Health"]
[45139,"Y01291",9842,369,347,121,242,85,"Chingford Medical Practice","WF","WF-2","Chingford E4"]
[45139,"F86005",9439,170,159,45,112,31,"The Penryhn Surgery","WF","WF-1","Chingford/ Walthamstow"]
[45139,"F86001",9058,191,171,60,134,32,"The Firs","WF","WF-6","Central Walthamstow"]
[45139,"Y01839",6842,152,133,39,117,22,"Lime Tree & Sinnott Healthcare Ltd","WF","WF-1","Chingford/ Walthamstow"]
[45139,"F86011",9792,215,201,85,137,42,"The Manor Practice","WF","WF-3","Leyton Collaborative"]
[45139,"F86006",7081,143,94,40,74,17,"Seymour Medical Centre","WF","WF-7","Walthamstow West"]
[45170,"F86650",7867,155,137,62,102,26,"Lime Tree Surgery","WF","WF-4","Forest Integrated Health"]
[45170,"F86664",8611,188,167,64,121,29,"Larkshall Medical Centre","WF","WF-1","Chingford/ Walthamstow"]
[45170,"F86625",5762,148,123,62,109,35,"LL Medical Care (Agarwal & Agrwal Practice)","WF","WF-5","South Leytonstone"]
[45170,"F86666",15106,273,267,101,185,133,"The Harrow Road Surgery","WF","WF-5","South Leytonstone"]
[45170,"F86644",9196,206,184,89,139,51,"Waltham Forest Community & Family Health Services Ltd","WF","WF-6","Central Walthamstow"]
[45170,"F86621",6960,149,126,59,121,30,"Green Man Medical Centre","WF","WF-5","South Leytonstone"]
[45170,"F86616",8447,282,244,134,185,58,"Old Church Surgery","WF","WF-2","Chingford E4"]
[45170,"F86627",13245,494,393,174,311,101,"Churchill Medical Centre","WF","WF-2","Chingford E4"]
[45170,"F86626",7625,107,88,25,64,12,"Dr Shantir Practice","WF","WF-1","Chingford/ Walthamstow"]
[45170,"F86708",2840,64,63,24,46,17,"Claremont Medical Centre","WF","WF-6","Central Walthamstow"]
[45170,"F86705",3458,68,63,27,39,22,"The Langthorne Sharma Family Practice","WF","WF-5","South Leytonstone"]
[45170,"F86712",3480,69,67,46,56,41,"Hampton Medical Centre","WF","WF-4","Forest Integrated Health"]
[45170,"F86058",15983,252,205,140,200,63,"St James Medical Practice Ltd","WF","WF-7","Walthamstow West"]
[45170,"Y01291",9906,377,365,152,258,103,"Chingford Medical Practice","WF","WF-2","Chingford E4"]
[45170,"F86689",4441,82,71,25,57,14,"The Bailey Practice","WF","WF-1","Chingford/ Walthamstow"]
[45170,"F86679",6501,81,77,44,61,25,"Higham Hill Medical Centre","WF","WF-7","Walthamstow West"]
[45170,"F86696",7210,122,113,44,92,32,"Francis Road Medical Centre","WF","WF-4","Forest Integrated Health"]
[45170,"F86701",4024,102,96,48,82,59,"Kiyani Medical Practice","WF","WF-5","South Leytonstone"]
[45170,"F86700",3805,153,152,61,101,28,"Kings Head Medical Practice","WF","WF-1","Chingford/ Walthamstow"]
[45170,"F86001",9211,195,172,74,140,48,"The Firs","WF","WF-6","Central Walthamstow"]
[45170,"F86038",11162,208,201,127,163,52,"Sma Medical Centre","WF","WF-3","Leyton Collaborative"]
[45170,"F86045",2067,50,46,18,38,21,"High Road Surgery","WF","WF-5","South Leytonstone"]
[45170,"F86078",6797,301,276,91,180,49,"The Ridgeway Surgery","WF","WF-2","Chingford E4"]
[45170,"F86062",7202,156,105,76,118,47,"The Grove Road Medical Centre","WF","WF-7","Walthamstow West"]
[45170,"F86006",7093,142,94,44,78,23,"Seymour Medical Centre","WF","WF-7","Walthamstow West"]
[45170,"F86005",9450,167,159,73,110,39,"The Penryhn Surgery","WF","WF-1","Chingford/ Walthamstow"]
[45170,"F86011",9807,221,204,109,141,50,"The Manor Practice","WF","WF-3","Leyton Collaborative"]
[45170,"F86036",14393,276,194,120,188,54,"The Allum Medical Centre","WF","WF-4","Forest Integrated Health"]
[45170,"F86030",8239,170,151,96,139,98,"Queens Road Medical Centre","WF","WF-7","Walthamstow West"]
[45170,"F86607",16445,286,267,114,210,65,"Addison Road Medical Practice","WF","WF-6","Central Walthamstow"]
[45170,"F86044",10472,128,117,69,93,26,"Crawley Road Medical Centre","WF","WF-4","Forest Integrated Health"]
[45170,"F86086",6379,94,82,28,67,16,"Dr Dhital Practice","WF","WF-6","Central Walthamstow"]
[45170,"Y01839",6936,151,133,52,118,29,"Lime Tree & Sinnott Healthcare Ltd","WF","WF-1","Chingford/ Walthamstow"]
[45170,"F86088",5084,110,101,46,83,27,"The Lyndhurst Surgery","WF","WF-4","Forest Integrated Health"]
[45200,"F86036",14413,278,192,142,193,63,"The Allum Medical Centre","WF","WF-4","Forest Integrated Health"]
[45200,"F86644",9228,207,184,95,140,66,"Waltham Forest Community & Family Health Services Ltd","WF","WF-6","Central Walthamstow"]
[45200,"F86086",6305,95,82,39,66,16,"Dr Dhital Practice","WF","WF-6","Central Walthamstow"]
[45200,"F86044",10469,127,115,77,92,29,"Crawley Road Medical Centre","WF","WF-4","Forest Integrated Health"]
[45200,"F86664",8616,193,170,78,126,35,"Larkshall Medical Centre","WF","WF-1","Chingford/ Walthamstow"]
[45200,"F86616",8434,280,243,149,190,71,"Old Church Surgery","WF","WF-2","Chingford E4"]
[45200,"F86708",2853,65,65,29,48,20,"Claremont Medical Centre","WF","WF-6","Central Walthamstow"]
[45200,"F86038",11185,205,198,133,159,52,"Sma Medical Centre","WF","WF-3","Leyton Collaborative"]
[45200,"F86650",7842,157,138,72,105,55,"Lime Tree Surgery","WF","WF-4","Forest Integrated Health"]
[45200,"F86627",13232,493,394,201,318,122,"Churchill Medical Centre","WF","WF-2","Chingford E4"]
[45200,"F86625",5819,144,122,62,105,41,"LL Medical Care (Agarwal & Agrwal Practice)","WF","WF-5","South Leytonstone"]
[45200,"F86006",7076,140,93,52,78,29,"Seymour Medical Centre","WF","WF-7","Walthamstow West"]
[45200,"F86011",9750,220,203,117,143,63,"The Manor Practice","WF","WF-3","Leyton Collaborative"]
[45200,"F86607",16531,284,266,136,207,95,"Addison Road Medical Practice","WF","WF-6","Central Walthamstow"]
[45200,"F86005",9421,168,157,88,113,44,"The Penryhn Surgery","WF","WF-1","Chingford/ Walthamstow"]
[45200,"Y01291",9886,374,361,165,261,119,"Chingford Medical Practice","WF","WF-2","Chingford E4"]
[45200,"F86626",7635,107,89,42,66,19,"Dr Shantir Practice","WF","WF-1","Chingford/ Walthamstow"]
[45200,"F86001",9385,195,177,88,142,59,"The Firs","WF","WF-6","Central Walthamstow"]
[45200,"Y01839",6994,145,125,67,111,48,"Lime Tree & Sinnott Healthcare Ltd","WF","WF-1","Chingford/ Walthamstow"]
[45200,"F86030",8280,168,151,97,137,111,"Queens Road Medical Centre","WF","WF-7","Walthamstow West"]
[45200,"F86621",6965,149,130,64,123,35,"Green Man Medical Centre","WF","WF-5","South Leytonstone"]
[45200,"F86712",3482,68,64,46,54,47,"Hampton Medical Centre","WF","WF-4","Forest Integrated Health"]
[45200,"F86088",5081,115,106,59,88,33,"The Lyndhurst Surgery","WF","WF-4","Forest Integrated Health"]
[45200,"F86689",4452,80,71,28,54,14,"The Bailey Practice","WF","WF-1","Chingford/ Walthamstow"]
[45200,"F86705",3448,68,63,35,44,21,"The Langthorne Sharma Family Practice","WF","WF-5","South Leytonstone"]
[45200,"F86045",2079,51,46,20,38,25,"High Road Surgery","WF","WF-5","South Leytonstone"]
[45200,"F86701",4036,97,92,49,80,58,"Kiyani Medical Practice","WF","WF-5","South Leytonstone"]
[45200,"F86666",15178,270,267,128,186,162,"The Harrow Road Surgery","WF","WF-5","South Leytonstone"]
[45200,"F86696",7145,114,106,45,89,31,"Francis Road Medical Centre","WF","WF-4","Forest Integrated Health"]
[45200,"F86679",6485,80,75,46,59,27,"Higham Hill Medical Centre","WF","WF-7","Walthamstow West"]
[45200,"F86078",6788,301,271,99,183,53,"The Ridgeway Surgery","WF","WF-2","Chingford E4"]
[45200,"F86700",3792,149,148,73,96,34,"Kings Head Medical Practice","WF","WF-1","Chingford/ Walthamstow"]
[45200,"F86062",7205,163,108,86,125,60,"The Grove Road Medical Centre","WF","WF-7","Walthamstow West"]
[45200,"F86058",15900,255,208,150,203,72,"St James Medical Practice Ltd","WF","WF-7","Walthamstow West"]
[45231,"F86088",5093,119,108,67,97,46,"The Lyndhurst Surgery","WF","WF-4","Forest Integrated Health"]
[45231,"Y01291",9927,378,364,195,267,144,"Chingford Medical Practice","WF","WF-2","Chingford E4"]
[45231,"F86689",4454,78,70,45,53,26,"The Bailey Practice","WF","WF-1","Chingford/ Walthamstow"]
[45231,"F86626",7685,105,88,56,68,28,"Dr Shantir Practice","WF","WF-1","Chingford/ Walthamstow"]
[45231,"F86011",9754,219,199,115,144,69,"The Manor Practice","WF","WF-3","Leyton Collaborative"]
[45231,"F86712",3478,69,66,53,57,48,"Hampton Medical Centre","WF","WF-4","Forest Integrated Health"]
[45231,"F86006",7070,138,91,53,78,33,"Seymour Medical Centre","WF","WF-7","Walthamstow West"]
[45231,"F86058",15927,258,210,160,204,82,"St James Medical Practice Ltd","WF","WF-7","Walthamstow West"]
[45231,"F86696",7197,117,108,51,94,34,"Francis Road Medical Centre","WF","WF-4","Forest Integrated Health"]
[45231,"F86001",9606,193,173,91,143,60,"The Firs","WF","WF-6","Central Walthamstow"]
[45231,"F86616",8443,278,241,157,190,75,"Old Church Surgery","WF","WF-2","Chingford E4"]
[45231,"F86700",3761,149,149,108,98,63,"Kings Head Medical Practice","WF","WF-1","Chingford/ Walthamstow"]
[45231,"F86625",5855,139,117,62,105,44,"LL Medical Care (Agarwal & Agrwal Practice)","WF","WF-5","South Leytonstone"]
[45231,"F86701",4037,94,89,49,77,57,"Kiyani Medical Practice","WF","WF-5","South Leytonstone"]
[45231,"F86005",9378,172,163,112,116,80,"The Penryhn Surgery","WF","WF-1","Chingford/ Walthamstow"]
[45231,"F86621",6965,148,126,73,125,37,"Green Man Medical Centre","WF","WF-5","South Leytonstone"]
[45231,"F86607",16663,287,268,140,209,117,"Addison Road Medical Practice","WF","WF-6","Central Walthamstow"]
[45231,"F86062",7191,157,108,87,124,62,"The Grove Road Medical Centre","WF","WF-7","Walthamstow West"]
[45231,"F86044",10422,125,116,84,96,37,"Crawley Road Medical Centre","WF","WF-4","Forest Integrated Health"]
[45231,"F86705",3445,65,60,38,44,22,"The Langthorne Sharma Family Practice","WF","WF-5","South Leytonstone"]
[45231,"F86644",9283,207,183,101,142,74,"Waltham Forest Community & Family Health Services Ltd","WF","WF-6","Central Walthamstow"]
[45231,"F86086",6288,94,81,43,66,17,"Dr Dhital Practice","WF","WF-6","Central Walthamstow"]
[45231,"Y01839",7099,146,126,77,113,63,"Lime Tree & Sinnott Healthcare Ltd","WF","WF-1","Chingford/ Walthamstow"]
[45231,"F86045",2097,51,46,19,38,25,"High Road Surgery","WF","WF-5","South Leytonstone"]
[45231,"F86650",7802,158,139,82,106,72,"Lime Tree Surgery","WF","WF-4","Forest Integrated Health"]
[45231,"F86666",15234,271,267,146,193,177,"The Harrow Road Surgery","WF","WF-5","South Leytonstone"]
[45231,"F86038",11222,201,193,138,162,59,"Sma Medical Centre","WF","WF-3","Leyton Collaborative"]
[45231,"F86627",13305,488,401,229,316,157,"Churchill Medical Centre","WF","WF-2","Chingford E4"]
[45231,"F86078",6770,298,266,129,184,59,"The Ridgeway Surgery","WF","WF-2","Chingford E4"]
[45231,"F86030",8209,175,157,108,144,117,"Queens Road Medical Centre","WF","WF-7","Walthamstow West"]
[45231,"F86708",2869,65,64,37,47,26,"Claremont Medical Centre","WF","WF-6","Central Walthamstow"]
[45231,"F86679",6490,77,73,48,56,30,"Higham Hill Medical Centre","WF","WF-7","Walthamstow West"]
[45231,"F86036",14426,279,195,146,195,72,"The Allum Medical Centre","WF","WF-4","Forest Integrated Health"]
[45231,"F86664",8653,196,171,87,132,61,"Larkshall Medical Centre","WF","WF-1","Chingford/ Walthamstow"]
[45261,"F86044",10412,132,121,91,101,59,"Crawley Road Medical Centre","WF","WF-4","Forest Integrated Health"]
[45261,"F86607",16629,291,275,140,216,138,"Addison Road Medical Practice","WF","WF-6","Central Walthamstow"]
[45261,"F86078",6770,299,264,154,187,65,"The Ridgeway Surgery","WF","WF-2","Chingford E4"]
[45261,"F86001",9774,190,167,95,139,70,"The Firs","WF","WF-6","Central Walthamstow"]
[45261,"F86011",9820,219,197,122,143,76,"The Manor Practice","WF","WF-3","Leyton Collaborative"]
[45261,"F86038",11258,207,199,150,169,85,"Sma Medical Centre","WF","WF-3","Leyton Collaborative"]
[45261,"F86088",5118,117,109,75,93,50,"The Lyndhurst Surgery","WF","WF-4","Forest Integrated Health"]
[45261,"F86086",6277,96,81,53,67,30,"Dr Dhital Practice","WF","WF-6","Central Walthamstow"]
[45261,"F86030",8202,179,163,110,148,124,"Queens Road Medical Centre","WF","WF-7","Walthamstow West"]
[45261,"F86062",7171,157,109,93,125,73,"The Grove Road Medical Centre","WF","WF-7","Walthamstow West"]
[45261,"F86006",7062,136,90,52,80,34,"Seymour Medical Centre","WF","WF-7","Walthamstow West"]
[45261,"F86005",9368,171,161,117,117,104,"The Penryhn Surgery","WF","WF-1","Chingford/ Walthamstow"]
[45261,"F86058",15929,256,209,172,204,103,"St James Medical Practice Ltd","WF","WF-7","Walthamstow West"]
[45261,"F86036",14472,282,198,164,198,81,"The Allum Medical Centre","WF","WF-4","Forest Integrated Health"]
[45261,"F86045",2093,51,45,23,39,29,"High Road Surgery","WF","WF-5","South Leytonstone"]
[45261,"Y01291",9987,374,360,190,267,163,"Chingford Medical Practice","WF","WF-2","Chingford E4"]
[45261,"F86700",3764,145,145,118,96,94,"Kings Head Medical Practice","WF","WF-1","Chingford/ Walthamstow"]
[45261,"F86664",8665,192,169,107,128,88,"Larkshall Medical Centre","WF","WF-1","Chingford/ Walthamstow"]
[45261,"F86650",7805,160,140,83,108,77,"Lime Tree Surgery","WF","WF-4","Forest Integrated Health"]
[45261,"F86626",7745,104,86,64,69,52,"Dr Shantir Practice","WF","WF-1","Chingford/ Walthamstow"]
[45261,"F86627",13354,483,393,251,313,184,"Churchill Medical Centre","WF","WF-2","Chingford E4"]
[45261,"F86701",4028,95,90,53,78,56,"Kiyani Medical Practice","WF","WF-5","South Leytonstone"]
[45261,"F86705",3454,64,58,43,43,22,"The Langthorne Sharma Family Practice","WF","WF-5","South Leytonstone"]
[45261,"F86644",9248,208,180,107,143,86,"Waltham Forest Community & Family Health Services Ltd","WF","WF-6","Central Walthamstow"]
[45261,"F86712",3453,67,65,53,55,48,"Hampton Medical Centre","WF","WF-4","Forest Integrated Health"]
[45261,"F86708",2864,61,60,36,47,27,"Claremont Medical Centre","WF","WF-6","Central Walthamstow"]
[45261,"F86616",8481,281,244,166,194,93,"Old Church Surgery","WF","WF-2","Chingford E4"]
[45261,"Y01839",7207,143,123,89,111,84,"Lime Tree & Sinnott Healthcare Ltd","WF","WF-1","Chingford/ Walthamstow"]
[45261,"F86679",6481,75,71,49,54,28,"Higham Hill Medical Centre","WF","WF-7","Walthamstow West"]
[45261,"F86689",4475,75,67,52,53,40,"The Bailey Practice","WF","WF-1","Chingford/ Walthamstow"]
[45261,"F86666",15300,277,269,153,198,191,"The Harrow Road Surgery","WF","WF-5","South Leytonstone"]
[45261,"F86621",6975,149,125,74,126,39,"Green Man Medical Centre","WF","WF-5","South Leytonstone"]
[45261,"F86625",5872,141,118,71,107,48,"LL Medical Care (Agarwal & Agrwal Practice)","WF","WF-5","South Leytonstone"]
[45261,"F86696",7229,106,99,45,86,36,"Francis Road Medical Centre","WF","WF-4","Forest Integrated Health"]
[45292,"F86062",7159,155,111,92,124,78,"The Grove Road Medical Centre","WF","WF-7","Walthamstow West"]
[45292,"F86689",4467,74,66,51,53,44,"The Bailey Practice","WF","WF-1","Chingford/ Walthamstow"]
[45292,"F86696",7328,111,102,54,90,38,"Francis Road Medical Centre","WF","WF-4","Forest Integrated Health"]
[45292,"F86058",15921,255,209,176,202,122,"St James Medical Practice Ltd","WF","WF-7","Walthamstow West"]
[45292,"F86701",4019,96,91,57,86,63,"Kiyani Medical Practice","WF","WF-5","South Leytonstone"]
[45292,"F86700",3740,150,150,124,100,99,"Kings Head Medical Practice","WF","WF-1","Chingford/ Walthamstow"]
[45292,"F86030",8187,174,160,113,144,121,"Queens Road Medical Centre","WF","WF-7","Walthamstow West"]
[45292,"F86011",9824,218,196,122,145,87,"The Manor Practice","WF","WF-3","Leyton Collaborative"]
[45292,"F86006",7075,138,92,59,84,47,"Seymour Medical Centre","WF","WF-7","Walthamstow West"]
[45292,"F86036",14468,283,203,170,203,98,"The Allum Medical Centre","WF","WF-4","Forest Integrated Health"]
[45292,"F86044",10376,134,122,94,101,66,"Crawley Road Medical Centre","WF","WF-4","Forest Integrated Health"]
[45292,"F86045",2076,51,44,25,40,30,"High Road Surgery","WF","WF-5","South Leytonstone"]
[45292,"F86038",11285,202,195,146,169,97,"Sma Medical Centre","WF","WF-3","Leyton Collaborative"]
[45292,"F86712",3465,69,67,52,57,49,"Hampton Medical Centre","WF","WF-4","Forest Integrated Health"]
[45292,"F86708",2877,60,60,42,49,29,"Claremont Medical Centre","WF","WF-6","Central Walthamstow"]
[45292,"F86705",3456,64,58,45,44,24,"The Langthorne Sharma Family Practice","WF","WF-5","South Leytonstone"]
[45292,"Y01291",10070,381,366,205,273,183,"Chingford Medical Practice","WF","WF-2","Chingford E4"]
[45292,"F86005",9388,173,165,118,125,113,"The Penryhn Surgery","WF","WF-1","Chingford/ Walthamstow"]
[45292,"F86001",9908,185,165,102,137,73,"The Firs","WF","WF-6","Central Walthamstow"]
[45292,"Y01839",7279,143,122,87,113,95,"Lime Tree & Sinnott Healthcare Ltd","WF","WF-1","Chingford/ Walthamstow"]
[45292,"F86607",16638,291,277,155,215,150,"Addison Road Medical Practice","WF","WF-6","Central Walthamstow"]
[45292,"F86650",7768,157,138,84,106,76,"Lime Tree Surgery","WF","WF-4","Forest Integrated Health"]
[45292,"F86626",7789,104,86,64,69,55,"Dr Shantir Practice","WF","WF-1","Chingford/ Walthamstow"]
[45292,"F86664",8629,190,168,111,127,105,"Larkshall Medical Centre","WF","WF-1","Chingford/ Walthamstow"]
[45292,"F86621",6987,148,124,79,124,41,"Green Man Medical Centre","WF","WF-5","South Leytonstone"]
[45292,"F86627",13374,487,404,265,324,205,"Churchill Medical Centre","WF","WF-2","Chingford E4"]
[45292,"F86088",5144,116,109,75,92,53,"The Lyndhurst Surgery","WF","WF-4","Forest Integrated Health"]
[45292,"F86644",9203,210,183,117,143,95,"Waltham Forest Community & Family Health Services Ltd","WF","WF-6","Central Walthamstow"]
[45292,"F86086",6285,97,81,54,69,45,"Dr Dhital Practice","WF","WF-6","Central Walthamstow"]
[45292,"F86625",5873,141,116,69,107,47,"LL Medical Care (Agarwal & Agrwal Practice)","WF","WF-5","South Leytonstone"]
[45292,"F86616",8513,283,247,174,199,107,"Old Church Surgery","WF","WF-2","Chingford E4"]
[45292,"F86666",15356,275,268,169,199,190,"The Harrow Road Surgery","WF","WF-5","South Leytonstone"]
[45292,"F86679",6509,76,69,52,55,35,"Higham Hill Medical Centre","WF","WF-7","Walthamstow West"]
[45292,"F86078",6787,298,258,158,185,73,"The Ridgeway Surgery","WF","WF-2","Chingford E4"]
[45323,"F86001",10107,185,171,108,140,75,"The Firs","WF","WF-6","Central Walthamstow"]
[45323,"F86005",9335,176,167,124,137,120,"The Penryhn Surgery","WF","WF-1","Chingford/ Walthamstow"]
[45323,"F86088",5165,114,107,76,90,52,"The Lyndhurst Surgery","WF","WF-4","Forest Integrated Health"]
[45323,"Y01839",7258,145,128,95,115,93,"Lime Tree & Sinnott Healthcare Ltd","WF","WF-1","Chingford/ Walthamstow"]
[45323,"F86011",9792,213,193,119,147,89,"The Manor Practice","WF","WF-3","Leyton Collaborative"]
[45323,"F86625",5902,141,123,88,109,81,"LL Medical Care (Agarwal & Agrwal Practice)","WF","WF-5","South Leytonstone"]
[45323,"F86679",6496,76,68,49,56,47,"Higham Hill Medical Centre","WF","WF-7","Walthamstow West"]
[45323,"F86621",6960,154,126,93,129,46,"Green Man Medical Centre","WF","WF-5","South Leytonstone"]
[45323,"F86616",8493,280,244,172,199,122,"Old Church Surgery","WF","WF-2","Chingford E4"]
[45323,"F86036",14414,284,206,177,208,92,"The Allum Medical Centre","WF","WF-4","Forest Integrated Health"]
[45323,"F86030",8154,172,159,118,144,119,"Queens Road Medical Centre","WF","WF-7","Walthamstow West"]
[45323,"F86006",7041,136,92,64,84,38,"Seymour Medical Centre","WF","WF-7","Walthamstow West"]
[45323,"F86044",10392,131,118,95,101,68,"Crawley Road Medical Centre","WF","WF-4","Forest Integrated Health"]
[45323,"F86607",16708,299,287,169,224,171,"Addison Road Medical Practice","WF","WF-6","Central Walthamstow"]
[45323,"F86038",11208,211,203,157,174,111,"Sma Medical Centre","WF","WF-3","Leyton Collaborative"]
[45323,"F86045",2074,51,47,31,41,32,"High Road Surgery","WF","WF-5","South Leytonstone"]
[45323,"F86666",15442,280,271,173,205,196,"The Harrow Road Surgery","WF","WF-5","South Leytonstone"]
[45323,"F86650",7742,157,137,86,108,75,"Lime Tree Surgery","WF","WF-4","Forest Integrated Health"]
[45323,"F86700",3736,149,148,124,102,98,"Kings Head Medical Practice","WF","WF-1","Chingford/ Walthamstow"]
[45323,"F86664",8571,191,170,116,126,104,"Larkshall Medical Centre","WF","WF-1","Chingford/ Walthamstow"]
[45323,"F86689",4456,77,67,53,56,40,"The Bailey Practice","WF","WF-1","Chingford/ Walthamstow"]
[45323,"F86058",15795,251,207,185,199,116,"St James Medical Practice Ltd","WF","WF-7","Walthamstow West"]
[45323,"F86696",7468,113,103,61,93,40,"Francis Road Medical Centre","WF","WF-4","Forest Integrated Health"]
[45323,"F86062",7125,155,113,98,129,67,"The Grove Road Medical Centre","WF","WF-7","Walthamstow West"]
[45323,"F86078",6755,296,248,170,196,70,"The Ridgeway Surgery","WF","WF-2","Chingford E4"]
[45323,"F86086",6250,95,77,53,68,44,"Dr Dhital Practice","WF","WF-6","Central Walthamstow"]
[45323,"F86712",3441,66,64,55,54,47,"Hampton Medical Centre","WF","WF-4","Forest Integrated Health"]
[45323,"Y01291",10136,392,374,212,285,196,"Chingford Medical Practice","WF","WF-2","Chingford E4"]
[45323,"F86626",7843,101,84,66,67,51,"Dr Shantir Practice","WF","WF-1","Chingford/ Walthamstow"]
[45323,"F86627",13408,487,412,274,336,227,"Churchill Medical Centre","WF","WF-2","Chingford E4"]
[45323,"F86701",4003,91,88,66,84,73,"Kiyani Medical Practice","WF","WF-5","South Leytonstone"]
[45323,"F86705",3469,65,59,47,46,25,"The Langthorne Sharma Family Practice","WF","WF-5","South Leytonstone"]
[45323,"F86644",9182,222,193,128,153,97,"Waltham Forest Community & Family Health Services Ltd","WF","WF-6","Central Walthamstow"]
[45323,"F86708",2861,62,62,44,51,29,"Claremont Medical Centre","WF","WF-6","Central Walthamstow"]
[45352,"Y01839",7321,149,129,102,118,99,"Lime Tree & Sinnott Healthcare Ltd","WF","WF-1","Chingford/ Walthamstow"]
[45352,"F86689",4495,76,66,54,55,42,"The Bailey Practice","WF","WF-1","Chingford/ Walthamstow"]
[45352,"F86696",7509,113,102,64,93,40,"Francis Road Medical Centre","WF","WF-4","Forest Integrated Health"]
[45352,"F86700",3702,153,152,131,107,106,"Kings Head Medical Practice","WF","WF-1","Chingford/ Walthamstow"]
[45352,"F86712",3419,65,62,55,54,49,"Hampton Medical Centre","WF","WF-4","Forest Integrated Health"]
[45352,"Y01291",10227,397,378,226,292,210,"Chingford Medical Practice","WF","WF-2","Chingford E4"]
[45352,"F86708",2878,63,62,47,52,30,"Claremont Medical Centre","WF","WF-6","Central Walthamstow"]
[45352,"F86701",4002,92,88,70,87,75,"Kiyani Medical Practice","WF","WF-5","South Leytonstone"]
[45352,"F86705",3449,66,59,45,58,32,"The Langthorne Sharma Family Practice","WF","WF-5","South Leytonstone"]
[45352,"F86679",6499,77,69,53,57,53,"Higham Hill Medical Centre","WF","WF-7","Walthamstow West"]
[45352,"F86062",7076,157,114,97,129,67,"The Grove Road Medical Centre","WF","WF-7","Walthamstow West"]
[45352,"F86036",14409,292,208,184,209,99,"The Allum Medical Centre","WF","WF-4","Forest Integrated Health"]
[45352,"F86058",15823,256,208,197,203,126,"St James Medical Practice Ltd","WF","WF-7","Walthamstow West"]
[45352,"F86078",6762,305,249,179,205,82,"The Ridgeway Surgery","WF","WF-2","Chingford E4"]
[45352,"F86001",10313,187,171,108,139,82,"The Firs","WF","WF-6","Central Walthamstow"]
[45352,"F86030",8124,174,161,118,146,119,"Queens Road Medical Centre","WF","WF-7","Walthamstow West"]
[45352,"F86045",2053,50,48,32,40,35,"High Road Surgery","WF","WF-5","South Leytonstone"]
[45352,"F86006",7045,137,92,72,90,39,"Seymour Medical Centre","WF","WF-7","Walthamstow West"]
[45352,"F86044",10392,134,119,97,103,71,"Crawley Road Medical Centre","WF","WF-4","Forest Integrated Health"]
[45352,"F86005",9278,177,167,125,137,126,"The Penryhn Surgery","WF","WF-1","Chingford/ Walthamstow"]
[45352,"F86038",11119,208,202,159,172,117,"Sma Medical Centre","WF","WF-3","Leyton Collaborative"]
[45352,"F86011",9717,213,193,125,144,103,"The Manor Practice","WF","WF-3","Leyton Collaborative"]
[45352,"F86627",13457,505,424,295,357,253,"Churchill Medical Centre","WF","WF-2","Chingford E4"]
[45352,"F86626",7827,107,87,68,73,56,"Dr Shantir Practice","WF","WF-1","Chingford/ Walthamstow"]
[45352,"F86625",5902,147,127,102,119,87,"LL Medical Care (Agarwal & Agrwal Practice)","WF","WF-5","South Leytonstone"]
[45352,"F86664",8578,190,168,116,125,108,"Larkshall Medical Centre","WF","WF-1","Chingford/ Walthamstow"]
[45352,"F86650",7771,160,136,88,110,79,"Lime Tree Surgery","WF","WF-4","Forest Integrated Health"]
[45352,"F86644",9206,223,189,134,152,99,"Waltham Forest Community & Family Health Services Ltd","WF","WF-6","Central Walthamstow"]
[45352,"F86666",15470,293,280,193,217,214,"The Harrow Road Surgery","WF","WF-5","South Leytonstone"]
[45352,"F86607",16856,304,290,178,225,181,"Addison Road Medical Practice","WF","WF-6","Central Walthamstow"]
[45352,"F86088",5189,116,109,83,92,53,"The Lyndhurst Surgery","WF","WF-4","Forest Integrated Health"]
[45352,"F86086",6254,96,78,56,72,52,"Dr Dhital Practice","WF","WF-6","Central Walthamstow"]
[45352,"F86621",6979,161,127,113,153,89,"Green Man Medical Centre","WF","WF-5","South Leytonstone"]
[45352,"F86616",8509,287,246,186,207,135,"Old Church Surgery","WF","WF-2","Chingford E4"]
[45383,"F86062",6984,156,114,103,129,73,"The Grove Road Medical Centre","WF","WF-7","Walthamstow West"]
[45383,"F86058",15742,256,203,176,211,135,"St James Medical Practice Ltd","WF","WF-7","Walthamstow West"]
[45383,"F86088",5224,117,111,78,95,57,"The Lyndhurst Surgery","WF","WF-4","Forest Integrated Health"]
[45383,"F86086",6244,97,81,54,80,55,"Dr Dhital Practice","WF","WF-6","Central Walthamstow"]
[45383,"F86078",6736,311,253,167,212,97,"The Ridgeway Surgery","WF","WF-2","Chingford E4"]
[45383,"F86006",7016,140,93,78,96,42,"Seymour Medical Centre","WF","WF-7","Walthamstow West"]
[45383,"F86011",9647,213,194,135,146,111,"The Manor Practice","WF","WF-3","Leyton Collaborative"]
[45383,"F86001",10431,190,173,112,142,86,"The Firs","WF","WF-6","Central Walthamstow"]
[45383,"F86005",9350,179,170,130,138,132,"The Penryhn Surgery","WF","WF-1","Chingford/ Walthamstow"]
[45383,"F86030",8086,174,162,115,147,118,"Queens Road Medical Centre","WF","WF-7","Walthamstow West"]
[45383,"F86044",10471,135,121,96,106,80,"Crawley Road Medical Centre","WF","WF-4","Forest Integrated Health"]
[45383,"F86045",2035,50,48,32,39,36,"High Road Surgery","WF","WF-5","South Leytonstone"]
[45383,"F86036",14408,289,209,185,210,104,"The Allum Medical Centre","WF","WF-4","Forest Integrated Health"]
[45383,"F86038",11133,209,203,161,174,134,"Sma Medical Centre","WF","WF-3","Leyton Collaborative"]
[45383,"F86607",16895,297,283,179,219,187,"Addison Road Medical Practice","WF","WF-6","Central Walthamstow"]
[45383,"F86700",3705,161,160,134,136,113,"Kings Head Medical Practice","WF","WF-1","Chingford/ Walthamstow"]
[45383,"F86701",4005,93,91,70,90,80,"Kiyani Medical Practice","WF","WF-5","South Leytonstone"]
[45383,"F86689",4510,80,68,55,58,44,"The Bailey Practice","WF","WF-1","Chingford/ Walthamstow"]
[45383,"F86696",7425,115,103,64,95,40,"Francis Road Medical Centre","WF","WF-4","Forest Integrated Health"]
[45383,"F86705",3434,64,63,46,59,49,"The Langthorne Sharma Family Practice","WF","WF-5","South Leytonstone"]
[45383,"Y01291",10152,393,372,233,291,219,"Chingford Medical Practice","WF","WF-2","Chingford E4"]
[45383,"Y01839",7345,146,126,99,115,97,"Lime Tree & Sinnott Healthcare Ltd","WF","WF-1","Chingford/ Walthamstow"]
[45383,"F86708",2887,62,61,47,51,30,"Claremont Medical Centre","WF","WF-6","Central Walthamstow"]
[45383,"F86712",3425,66,63,52,54,53,"Hampton Medical Centre","WF","WF-4","Forest Integrated Health"]
[45383,"F86679",6510,75,72,53,55,57,"Higham Hill Medical Centre","WF","WF-7","Walthamstow West"]
[45383,"F86625",5901,147,125,111,119,87,"LL Medical Care (Agarwal & Agrwal Practice)","WF","WF-5","South Leytonstone"]
[45383,"F86626",7785,114,90,76,77,61,"Dr Shantir Practice","WF","WF-1","Chingford/ Walthamstow"]
[45383,"F86616",8508,292,249,196,211,144,"Old Church Surgery","WF","WF-2","Chingford E4"]
[45383,"F86621",6972,160,128,109,153,95,"Green Man Medical Centre","WF","WF-5","South Leytonstone"]
[45383,"F86627",13453,505,429,307,373,264,"Churchill Medical Centre","WF","WF-2","Chingford E4"]
[45383,"F86664",8554,186,167,109,124,114,"Larkshall Medical Centre","WF","WF-1","Chingford/ Walthamstow"]
[45383,"F86666",15304,297,285,194,226,226,"The Harrow Road Surgery","WF","WF-5","South Leytonstone"]
[45383,"F86644",9183,227,191,140,159,109,"Waltham Forest Community & Family Health Services Ltd","WF","WF-6","Central Walthamstow"]
[45383,"F86650",7765,160,132,85,126,78,"Lime Tree Surgery","WF","WF-4","Forest Integrated Health"]
[44470,"F86004",32008,1670,1186,738,940,232,"Handsworth Medical Centre","WF","WF-2","Chingford E4"]
[44470,"F86018",19922,966,744,454,522,334,"The Ecclesbourne Practice","WF","WF-4","Forest Integrated Health"]
[44470,"F86026",14402,556,402,346,318,280,"Forest Surgery","WF","WF-1","Chingford/ Walthamstow"]
[44470,"F86074",30548,706,528,386,468,230,"Leyton Healthcare (Oliver Road)","WF","WF-3","Leyton Collaborative"]
[44470,"F86638",10594,554,354,274,374,258,"The Microfaculty","WF","WF-1","Chingford/ Walthamstow"]
[44501,"F86004",31998,1670,1188,768,942,242,"Handsworth Medical Centre","WF","WF-2","Chingford E4"]
[44501,"F86018",19940,978,746,476,526,322,"The Ecclesbourne Practice","WF","WF-4","Forest Integrated Health"]
[44501,"F86026",14414,558,404,350,324,276,"Forest Surgery","WF","WF-1","Chingford/ Walthamstow"]
[44501,"F86074",30564,712,528,360,468,214,"Leyton Healthcare (Oliver Road)","WF","WF-3","Leyton Collaborative"]
[44501,"F86638",10566,550,348,236,372,194,"The Microfaculty","WF","WF-1","Chingford/ Walthamstow"]
[44531,"F86004",31990,1662,1180,770,942,238,"Handsworth Medical Centre","WF","WF-2","Chingford E4"]
[44531,"F86018",19910,988,748,494,540,296,"The Ecclesbourne Practice","WF","WF-4","Forest Integrated Health"]
[44531,"F86026",14390,552,396,364,320,276,"Forest Surgery","WF","WF-1","Chingford/ Walthamstow"]
[44531,"F86074",30478,724,532,370,474,210,"Leyton Healthcare (Oliver Road)","WF","WF-3","Leyton Collaborative"]
[44531,"F86638",10512,550,352,228,372,174,"The Microfaculty","WF","WF-1","Chingford/ Walthamstow"]
[44562,"F86004",31882,1642,1160,780,924,238,"Handsworth Medical Centre","WF","WF-2","Chingford E4"]
[44562,"F86018",19868,992,750,500,536,306,"The Ecclesbourne Practice","WF","WF-4","Forest Integrated Health"]
[44562,"F86026",14454,554,392,358,318,260,"Forest Surgery","WF","WF-1","Chingford/ Walthamstow"]
[44562,"F86074",30422,738,532,372,478,208,"Leyton Healthcare (Oliver Road)","WF","WF-3","Leyton Collaborative"]
[44562,"F86638",10526,542,348,230,362,176,"The Microfaculty","WF","WF-1","Chingford/ Walthamstow"]
[44593,"F86004",31774,1630,1152,786,916,246,"Handsworth Medical Centre","WF","WF-2","Chingford E4"]
[44593,"F86018",19822,988,752,512,540,278,"The Ecclesbourne Practice","WF","WF-4","Forest Integrated Health"]
[44593,"F86026",14370,554,390,362,312,170,"Forest Surgery","WF","WF-1","Chingford/ Walthamstow"]
[44593,"F86074",30382,736,526,378,478,214,"Leyton Healthcare (Oliver Road)","WF","WF-3","Leyton Collaborative"]
[44593,"F86638",10496,546,352,232,366,178,"The Microfaculty","WF","WF-1","Chingford/ Walthamstow"]
[44621,"F86004",31834,1628,1150,800,912,244,"Handsworth Medical Centre","WF","WF-2","Chingford E4"]
[44621,"F86018",19826,990,750,516,538,282,"The Ecclesbourne Practice","WF","WF-4","Forest Integrated Health"]
[44621,"F86026",14378,550,388,348,310,144,"Forest Surgery","WF","WF-1","Chingford/ Walthamstow"]
[44621,"F86074",30200,732,520,378,476,202,"Leyton Healthcare (Oliver Road)","WF","WF-3","Leyton Collaborative"]
[44621,"F86638",10440,540,402,232,358,174,"The Microfaculty","WF","WF-1","Chingford/ Walthamstow"]
[44652,"F86004",31856,1618,1140,820,912,null,"Handsworth Medical Centre","WF","WF-2","Chingford E4"]
[44652,"F86018",19862,980,738,510,536,null,"The Ecclesbourne Practice","WF","WF-4","Forest Integrated Health"]
[44652,"F86026",14282,552,388,332,314,null,"Forest Surgery","WF","WF-1","Chingford/ Walthamstow"]
[44652,"F86074",30168,744,520,378,484,null,"Leyton Healthcare (Oliver Road)","WF","WF-3","Leyton Collaborative"]
[44652,"F86638",10382,550,408,288,360,null,"The Microfaculty","WF","WF-1","Chingford/ Walthamstow"]
[44682,"F86004",15928,798,563,403,448,123,"Handsworth Medical Centre","WF","WF-2","Chingford E4"]
[44682,"F86018",9936,489,367,253,264,128,"The Ecclesbourne Practice","WF","WF-4","Forest Integrated Health"]
[44682,"F86026",7102,271,192,162,154,67,"Forest Surgery","WF","WF-1","Chingford/ Walthamstow"]
[44682,"F86074",15074,369,255,195,241,92,"Leyton Healthcare (Oliver Road)","WF","WF-3","Leyton Collaborative"]
[44682,"F86638",5132,259,189,152,173,90,"The Microfaculty","WF","WF-1","Chingford/ Walthamstow"]
[44713,"F86004",15932,797,561,402,449,119,"Handsworth Medical Centre","WF","WF-2","Chingford E4"]
[44713,"F86018",9942,494,368,257,267,130,"The Ecclesbourne Practice","WF","WF-4","Forest Integrated Health"]
[44713,"F86026",7145,273,193,173,153,69,"Forest Surgery","WF","WF-1","Chingford/ Walthamstow"]
[44713,"F86074",15075,370,254,197,241,90,"Leyton Healthcare (Oliver Road)","WF","WF-3","Leyton Collaborative"]
[44713,"F86638",5122,262,191,153,176,88,"The Microfaculty","WF","WF-1","Chingford/ Walthamstow"]
[44743,"F86004",15929,791,554,390,444,117,"Handsworth Medical Centre","WF","WF-2","Chingford E4"]
[44743,"F86018",9941,488,365,270,262,131,"The Ecclesbourne Practice","WF","WF-4","Forest Integrated Health"]
[44743,"F86026",7132,275,194,172,155,57,"Forest Surgery","WF","WF-1","Chingford/ Walthamstow"]
[44743,"F86074",15062,376,254,203,246,89,"Leyton Healthcare (Oliver Road)","WF","WF-3","Leyton Collaborative"]
[44743,"F86638",5093,262,190,147,175,79,"The Microfaculty","WF","WF-1","Chingford/ Walthamstow"]
[44774,"F86004",15938,788,550,379,444,107,"Handsworth Medical Centre","WF","WF-2","Chingford E4"]
[44774,"F86018",9963,489,368,279,262,138,"The Ecclesbourne Practice","WF","WF-4","Forest Integrated Health"]
[44774,"F86026",7179,279,193,180,156,54,"Forest Surgery","WF","WF-1","Chingford/ Walthamstow"]
[44774,"F86074",15048,378,251,202,246,88,"Leyton Healthcare (Oliver Road)","WF","WF-3","Leyton Collaborative"]
[44774,"F86638",5097,263,187,144,176,86,"The Microfaculty","WF","WF-1","Chingford/ Walthamstow"]
[44805,"F86004",15949,787,546,387,445,108,"Handsworth Medical Centre","WF","WF-2","Chingford E4"]
[44805,"F86018",9969,486,367,278,261,131,"The Ecclesbourne Practice","WF","WF-4","Forest Integrated Health"]
[44805,"F86026",7152,279,190,186,155,50,"Forest Surgery","WF","WF-1","Chingford/ Walthamstow"]
[44805,"F86074",15033,380,249,203,244,87,"Leyton Healthcare (Oliver Road)","WF","WF-3","Leyton Collaborative"]
[44805,"F86638",5056,261,186,147,175,88,"The Microfaculty","WF","WF-1","Chingford/ Walthamstow"]
[44835,"F86004",15936,774,539,368,441,112,"Handsworth Medical Centre","WF","WF-2","Chingford E4"]
[44835,"F86018",9937,481,365,273,258,126,"The Ecclesbourne Practice","WF","WF-4","Forest Integrated Health"]
[44835,"F86026",7118,282,191,197,157,57,"Forest Surgery","WF","WF-1","Chingford/ Walthamstow"]
[44835,"F86074",15034,372,247,206,241,88,"Leyton Healthcare (Oliver Road)","WF","WF-3","Leyton Collaborative"]
[44835,"F86638",5046,266,188,158,179,92,"The Microfaculty","WF","WF-1","Chingford/ Walthamstow"]
[44866,"F86004",15938,768,533,369,438,114,"Handsworth Medical Centre","WF","WF-2","Chingford E4"]
[44866,"F86018",9927,480,363,273,258,114,"The Ecclesbourne Practice","WF","WF-4","Forest Integrated Health"]
[44866,"F86026",7128,284,190,198,158,68,"Forest Surgery","WF","WF-1","Chingford/ Walthamstow"]
[44866,"F86074",15047,372,244,211,242,86,"Leyton Healthcare (Oliver Road)","WF","WF-3","Leyton Collaborative"]
[44866,"F86638",5008,264,180,166,177,105,"The Microfaculty","WF","WF-1","Chingford/ Walthamstow"]
[44896,"F86004",15919,776,533,395,443,114,"Handsworth Medical Centre","WF","WF-2","Chingford E4"]
[44896,"F86018",9791,477,362,273,261,101,"The Ecclesbourne Practice","WF","WF-4","Forest Integrated Health"]
[44896,"F86026",7089,280,184,193,157,68,"Forest Surgery","WF","WF-1","Chingford/ Walthamstow"]
[44896,"F86074",15061,376,245,223,243,90,"Leyton Healthcare (Oliver Road)","WF","WF-3","Leyton Collaborative"]
[44896,"F86638",4990,261,176,163,175,105,"The Microfaculty","WF","WF-1","Chingford/ Walthamstow"]
[44927,"F86004",15934,782,530,416,446,124,"Handsworth Medical Centre","WF","WF-2","Chingford E4"]
[44927,"F86018",9755,473,361,264,261,100,"The Ecclesbourne Practice","WF","WF-4","Forest Integrated Health"]
[44927,"F86026",7034,281,181,197,162,66,"Forest Surgery","WF","WF-1","Chingford/ Walthamstow"]
[44927,"F86074",15045,376,244,228,244,92,"Leyton Healthcare (Oliver Road)","WF","WF-3","Leyton Collaborative"]
[44927,"F86638",4973,260,175,169,175,100,"The Microfaculty","WF","WF-1","Chingford/ Walthamstow"]
[44958,"F86004",15973,782,527,441,445,126,"Handsworth Medical Centre","WF","WF-2","Chingford E4"]
[44958,"F86018",9767,471,357,268,261,96,"The Ecclesbourne Practice","WF","WF-4","Forest Integrated Health"]
[44958,"F86026",7037,281,180,205,160,69,"Forest Surgery","WF","WF-1","Chingford/ Walthamstow"]
[44958,"F86074",15076,376,241,236,242,92,"Leyton Healthcare (Oliver Road)","WF","WF-3","Leyton Collaborative"]
[44958,"F86638",4972,259,173,163,174,104,"The Microfaculty","WF","WF-1","Chingford/ Walthamstow"]
[44986,"F86004",15983,781,524,466,450,130,"Handsworth Medical Centre","WF","WF-2","Chingford E4"]
[44986,"F86018",9767,475,359,279,261,100,"The Ecclesbourne Practice","WF","WF-4","Forest Integrated Health"]
[44986,"F86026",7044,279,181,209,159,67,"Forest Surgery","WF","WF-1","Chingford/ Walthamstow"]
[44986,"F86074",15081,373,239,237,240,98,"Leyton Healthcare (Oliver Road)","WF","WF-3","Leyton Collaborative"]
[44986,"F86638",4956,254,171,172,171,102,"The Microfaculty","WF","WF-1","Chingford/ Walthamstow"]
[45017,"F86004",15997,788,530,501,454,137,"Handsworth Medical Centre","WF","WF-2","Chingford E4"]
[45017,"F86018",9785,481,360,288,263,117,"The Ecclesbourne Practice","WF","WF-4","Forest Integrated Health"]
[45017,"F86026",7005,277,180,207,155,66,"Forest Surgery","WF","WF-1","Chingford/ Walthamstow"]
[45017,"F86074",15054,378,239,235,246,100,"Leyton Healthcare (Oliver Road)","WF","WF-3","Leyton Collaborative"]
[45017,"F86638",4928,253,170,178,173,101,"The Microfaculty","WF","WF-1","Chingford/ Walthamstow"]
[45078,"F86004",16018,799,531,90,361,28,"Handsworth Medical Centre","WF","WF-2","Chingford E4"]
[45078,"F86018",9792,487,419,73,210,27,"The Ecclesbourne Practice","WF","WF-4","Forest Integrated Health"]
[45078,"F86026",7018,286,177,73,139,18,"Forest Surgery","WF","WF-1","Chingford/ Walthamstow"]
[45078,"F86074",15041,377,312,53,193,18,"Leyton Healthcare (Oliver Road)","WF","WF-3","Leyton Collaborative"]
[45078,"F86638",4884,253,167,42,150,27,"The Microfaculty","WF","WF-1","Chingford/ Walthamstow"]
[45108,"F86004",16023,799,541,157,408,119,"Handsworth Medical Centre","WF","WF-2","Chingford E4"]
[45108,"F86018",9801,489,426,126,234,49,"The Ecclesbourne Practice","WF","WF-4","Forest Integrated Health"]
[45108,"F86026",7024,280,177,110,144,41,"Forest Surgery","WF","WF-1","Chingford/ Walthamstow"]
[45108,"F86074",15021,380,311,79,216,34,"Leyton Healthcare (Oliver Road)","WF","WF-3","Leyton Collaborative"]
[45108,"F86638",4893,253,167,63,165,39,"The Microfaculty","WF","WF-1","Chingford/ Walthamstow"]
[45139,"F86004",16029,800,550,219,428,177,"Handsworth Medical Centre","WF","WF-2","Chingford E4"]
[45139,"F86018",9816,490,427,172,251,66,"The Ecclesbourne Practice","WF","WF-4","Forest Integrated Health"]
[45139,"F86026",7016,278,173,132,149,49,"Forest Surgery","WF","WF-1","Chingford/ Walthamstow"]
[45139,"F86074",14977,380,311,107,231,52,"Leyton Healthcare (Oliver Road)","WF","WF-3","Leyton Collaborative"]
[45139,"F86638",4861,255,166,80,169,56,"The Microfaculty","WF","WF-1","Chingford/ Walthamstow"]
[45170,"F86004",16053,798,549,292,446,232,"Handsworth Medical Centre","WF","WF-2","Chingford E4"]
[45170,"F86018",9823,493,433,212,267,82,"The Ecclesbourne Practice","WF","WF-4","Forest Integrated Health"]
[45170,"F86026",6962,283,172,163,153,70,"Forest Surgery","WF","WF-1","Chingford/ Walthamstow"]
[45170,"F86074",14934,383,308,170,238,64,"Leyton Healthcare (Oliver Road)","WF","WF-3","Leyton Collaborative"]
[45170,"F86638",4879,254,162,92,168,71,"The Microfaculty","WF","WF-1","Chingford/ Walthamstow"]
[45200,"F86004",16016,793,555,336,460,268,"Handsworth Medical Centre","WF","WF-2","Chingford E4"]
[45200,"F86018",9791,490,433,230,275,93,"The Ecclesbourne Practice","WF","WF-4","Forest Integrated Health"]
[45200,"F86026",6978,287,231,195,158,87,"Forest Surgery","WF","WF-1","Chingford/ Walthamstow"]
[45200,"F86074",14862,388,308,191,246,78,"Leyton Healthcare (Oliver Road)","WF","WF-3","Leyton Collaborative"]
[45200,"F86638",4860,248,157,94,167,77,"The Microfaculty","WF","WF-1","Chingford/ Walthamstow"]
[45231,"F86004",15993,791,553,378,469,286,"Handsworth Medical Centre","WF","WF-2","Chingford E4"]
[45231,"F86018",9782,486,430,244,275,102,"The Ecclesbourne Practice","WF","WF-4","Forest Integrated Health"]
[45231,"F86026",6962,284,231,217,158,110,"Forest Surgery","WF","WF-1","Chingford/ Walthamstow"]
[45231,"F86074",14797,388,310,211,249,93,"Leyton Healthcare (Oliver Road)","WF","WF-3","Leyton Collaborative"]
[45231,"F86638",4839,248,158,131,169,93,"The Microfaculty","WF","WF-1","Chingford/ Walthamstow"]
[45261,"F86004",16023,788,555,424,475,309,"Handsworth Medical Centre","WF","WF-2","Chingford E4"]
[45261,"F86018",9793,483,428,263,272,120,"The Ecclesbourne Practice","WF","WF-4","Forest Integrated Health"]
[45261,"F86026",6975,285,229,220,162,151,"Forest Surgery","WF","WF-1","Chingford/ Walthamstow"]
[45261,"F86074",14792,390,312,248,259,135,"Leyton Healthcare (Oliver Road)","WF","WF-3","Leyton Collaborative"]
[45261,"F86638",4805,241,155,159,166,110,"The Microfaculty","WF","WF-1","Chingford/ Walthamstow"]
[45292,"F86004",16023,794,556,483,482,317,"Handsworth Medical Centre","WF","WF-2","Chingford E4"]
[45292,"F86018",9818,481,426,281,274,130,"The Ecclesbourne Practice","WF","WF-4","Forest Integrated Health"]
[45292,"F86026",6971,284,228,223,162,159,"Forest Surgery","WF","WF-1","Chingford/ Walthamstow"]
[45292,"F86074",14743,390,309,263,262,154,"Leyton Healthcare (Oliver Road)","WF","WF-3","Leyton Collaborative"]
[45292,"F86638",4776,234,185,162,164,113,"The Microfaculty","WF","WF-1","Chingford/ Walthamstow"]
[45323,"F86004",16030,782,553,518,484,280,"Handsworth Medical Centre","WF","WF-2","Chingford E4"]
[45323,"F86018",9864,486,437,306,280,150,"The Ecclesbourne Practice","WF","WF-4","Forest Integrated Health"]
[45323,"F86026",6948,282,225,227,168,140,"Forest Surgery","WF","WF-1","Chingford/ Walthamstow"]
[45323,"F86074",14709,392,308,275,266,149,"Leyton Healthcare (Oliver Road)","WF","WF-3","Leyton Collaborative"]
[45323,"F86638",4745,236,189,174,184,120,"The Microfaculty","WF","WF-1","Chingford/ Walthamstow"]
[45352,"F86004",16027,778,589,576,497,362,"Handsworth Medical Centre","WF","WF-2","Chingford E4"]
[45352,"F86018",9844,489,445,327,297,180,"The Ecclesbourne Practice","WF","WF-4","Forest Integrated Health"]
[45352,"F86026",6945,287,224,229,184,151,"Forest Surgery","WF","WF-1","Chingford/ Walthamstow"]
[45352,"F86074",14608,392,305,283,271,158,"Leyton Healthcare (Oliver Road)","WF","WF-3","Leyton Collaborative"]
[45352,"F86638",4673,236,188,184,194,130,"The Microfaculty","WF","WF-1","Chingford/ Walthamstow"]
[45383,"F86004",15999,793,604,604,517,402,"Handsworth Medical Centre","WF","WF-2","Chingford E4"]
[45383,"F86018",9803,488,449,353,311,274,"The Ecclesbourne Practice","WF","WF-4","Forest Integrated Health"]
[45383,"F86026",6843,284,218,227,185,192,"Forest Surgery","WF","WF-1","Chingford/ Walthamstow"]
[45383,"F86074",14528,389,303,283,270,166,"Leyton Healthcare (Oliver Road)","WF","WF-3","Leyton Collaborative"]
[45383,"F86638",4628,239,188,193,193,133,"The Microfaculty","WF","WF-1","Chingford/ Walthamstow"]

{"sheet":"Sheet6","index":16,"n_rows":36,"n_cols":2,"rows_kept":36,"cut":false,"hidden":true,"merged":[]}
["Systmone.Name","Emis.Name"]
["1.12_With_BP_below_140_90_(CEG_Dashboards___CKD_Review)","NIS08-CKD02: evidence of CKD with BP below 140/90"]
["1.13_On_Statins_(CEG_Dashboards___CKD_Review)","NIS08-CKD03: evidence of CKD on Statins"]
["1.14_Has_ACR_(CEG_Dashboards___CKD_Review)","NIS08-CKD04: evidence of CKD has ACR"]
["1.0_Listsize_(CEG_Dashboards___CKD_Review)","[00-00] Listsize"]
["1.1_Evidence_of_CKD_(CEG_Dashboards___CKD_Review)","[08-CKD] eGFR evidence of CKD"]
["1.11_QOF_coded_(CEG_Dashboards___CKD_Review)","NIS08-CKD01: evidence of CKD coded (QOF v46)"]
["1.12_With_BP_below_140_90_(WF_Dashboards_CEG___CKD_KPI)","NIS08-CKD02: evidence of CKD with BP below 140/90"]
["1.13_On_Statins_(WF_Dashboards_CEG___CKD_KPI)","NIS08-CKD03: evidence of CKD on Statins"]
["1.14_Has_ACR_(WF_Dashboards_CEG___CKD_KPI)","NIS08-CKD04: evidence of CKD has ACR"]
["1.0_Listsize_(WF_Dashboards_CEG___CKD_KPI)","[00-00] Listsize"]
["1.1_Evidence_of_CKD_(WF_Dashboards_CEG___CKD_KPI)","[08-CKD] eGFR evidence of CKD"]
["1.11_QOF_coded_(WF_Dashboards_CEG___CKD_KPI)","NIS08-CKD01: evidence of CKD coded (QOF v46)"]
["1.12_With_BP_below_140_90_(CEG_WF_Dashboards___CKD_KPI)","NIS08-CKD02: evidence of CKD with BP below 140/90"]
["1.13_On_Statins_(CEG_WF_Dashboards___CKD_KPI)","NIS08-CKD03: evidence of CKD on Statins"]
["1.14_Has_ACR_(CEG_WF_Dashboards___CKD_KPI)","NIS08-CKD04: evidence of CKD has ACR"]
["1.0_Listsize_(CEG_WF_Dashboards___CKD_KPI)","[00-00] Listsize"]
["1.1_Evidence_of_CKD_(CEG_WF_Dashboards___CKD_KPI)","[08-CKD] eGFR evidence of CKD"]
["1.11_QOF_coded_(CEG_WF_Dashboards___CKD_KPI)","NIS08-CKD01: evidence of CKD coded (QOF v46)"]
["1.12_With_BP_below_140_90_(WF_Dashboards_CEG___CKD_KPI)","NIS08-CKD02: evidence of CKD with BP below 140/90"]
["1.13_On_Statins_(WF_Dashboards_CEG___CKD_KPI)","NIS08-CKD03: evidence of CKD on Statins"]
["1.14_Has_ACR_(WF_Dashboards_CEG___CKD_KPI)","NIS08-CKD04: evidence of CKD has ACR"]
["1.0_Listsize_(WF_Dashboards_CEG___CKD_KPI)","[00-00] Listsize"]
["1.1_Evidence_of_CKD_(WF_Dashboards_CEG___CKD_KPI)","[08-CKD] eGFR evidence of CKD"]
["1.11_QOF_coded_(WF_Dashboards_CEG___CKD_KPI)","NIS08-CKD01: evidence of CKD coded (QOF v46)"]
[]
[]
[]
[]
[]
[]
[]
[]
[]
[]
[null,"(CEG_WF_Dashboards___CKD_KPI)"]

{"sheet":"Sheet7","index":17,"n_rows":151,"n_cols":12,"rows_kept":151,"cut":false,"hidden":true,"merged":[]}
["Rel_D","OrgID","00-00","08-CKD","NIS08-CKD01","NIS08-CKD02","NIS08-CKD03","NIS08-CKD04","Practice","Locality ID","SubLocality ID","SubLocality"]
["2021-10-01","F86004",32008,1670,1186,738,940,232,"Handsworth Medical Centre","WF","WF-2","Chingford E4"]
["2021-10-01","F86018",19922,966,744,454,522,334,"The Ecclesbourne Practice","WF","WF-4","Forest Integrated Health"]
["2021-10-01","F86026",14402,556,402,346,318,280,"Forest Surgery","WF","WF-1","Chingford/ Walthamstow"]
["2021-10-01","F86074",30548,706,528,386,468,230,"Leyton Healthcare (Oliver Road)","WF","WF-3","Leyton Collaborative"]
["2021-10-01","F86638",10594,554,354,274,374,258,"The Microfaculty","WF","WF-1","Chingford/ Walthamstow"]
["2021-11-01","F86004",31998,1670,1188,768,942,242,"Handsworth Medical Centre","WF","WF-2","Chingford E4"]
["2021-11-01","F86018",19940,978,746,476,526,322,"The Ecclesbourne Practice","WF","WF-4","Forest Integrated Health"]
["2021-11-01","F86026",14414,558,404,350,324,276,"Forest Surgery","WF","WF-1","Chingford/ Walthamstow"]
["2021-11-01","F86074",30564,712,528,360,468,214,"Leyton Healthcare (Oliver Road)","WF","WF-3","Leyton Collaborative"]
["2021-11-01","F86638",10566,550,348,236,372,194,"The Microfaculty","WF","WF-1","Chingford/ Walthamstow"]
["2021-12-01","F86004",31990,1662,1180,770,942,238,"Handsworth Medical Centre","WF","WF-2","Chingford E4"]
["2021-12-01","F86018",19910,988,748,494,540,296,"The Ecclesbourne Practice","WF","WF-4","Forest Integrated Health"]
["2021-12-01","F86026",14390,552,396,364,320,276,"Forest Surgery","WF","WF-1","Chingford/ Walthamstow"]
["2021-12-01","F86074",30478,724,532,370,474,210,"Leyton Healthcare (Oliver Road)","WF","WF-3","Leyton Collaborative"]
["2021-12-01","F86638",10512,550,352,228,372,174,"The Microfaculty","WF","WF-1","Chingford/ Walthamstow"]
["2022-01-01","F86004",31882,1642,1160,780,924,238,"Handsworth Medical Centre","WF","WF-2","Chingford E4"]
["2022-01-01","F86018",19868,992,750,500,536,306,"The Ecclesbourne Practice","WF","WF-4","Forest Integrated Health"]
["2022-01-01","F86026",14454,554,392,358,318,260,"Forest Surgery","WF","WF-1","Chingford/ Walthamstow"]
["2022-01-01","F86074",30422,738,532,372,478,208,"Leyton Healthcare (Oliver Road)","WF","WF-3","Leyton Collaborative"]
["2022-01-01","F86638",10526,542,348,230,362,176,"The Microfaculty","WF","WF-1","Chingford/ Walthamstow"]
["2022-02-01","F86004",31774,1630,1152,786,916,246,"Handsworth Medical Centre","WF","WF-2","Chingford E4"]
["2022-02-01","F86018",19822,988,752,512,540,278,"The Ecclesbourne Practice","WF","WF-4","Forest Integrated Health"]
["2022-02-01","F86026",14370,554,390,362,312,170,"Forest Surgery","WF","WF-1","Chingford/ Walthamstow"]
["2022-02-01","F86074",30382,736,526,378,478,214,"Leyton Healthcare (Oliver Road)","WF","WF-3","Leyton Collaborative"]
["2022-02-01","F86638",10496,546,352,232,366,178,"The Microfaculty","WF","WF-1","Chingford/ Walthamstow"]
[44621,"F86004",31834,1628,1150,800,912,244,"Handsworth Medical Centre","WF","WF-2","Chingford E4"]
[44621,"F86018",19826,990,750,516,538,282,"The Ecclesbourne Practice","WF","WF-4","Forest Integrated Health"]
[44621,"F86026",14378,550,388,348,310,144,"Forest Surgery","WF","WF-1","Chingford/ Walthamstow"]
[44621,"F86074",30200,732,520,378,476,202,"Leyton Healthcare (Oliver Road)","WF","WF-3","Leyton Collaborative"]
[44621,"F86638",10440,540,402,232,358,174,"The Microfaculty","WF","WF-1","Chingford/ Walthamstow"]
[44652,"F86004",31856,1618,1140,820,912,null,"Handsworth Medical Centre","WF","WF-2","Chingford E4"]
[44652,"F86018",19862,980,738,510,536,null,"The Ecclesbourne Practice","WF","WF-4","Forest Integrated Health"]
[44652,"F86026",14282,552,388,332,314,null,"Forest Surgery","WF","WF-1","Chingford/ Walthamstow"]
[44652,"F86074",30168,744,520,378,484,null,"Leyton Healthcare (Oliver Road)","WF","WF-3","Leyton Collaborative"]
[44652,"F86638",10382,550,408,288,360,null,"The Microfaculty","WF","WF-1","Chingford/ Walthamstow"]
[44682,"F86004",15928,798,563,403,448,123,"Handsworth Medical Centre","WF","WF-2","Chingford E4"]
[44682,"F86018",9936,489,367,253,264,128,"The Ecclesbourne Practice","WF","WF-4","Forest Integrated Health"]
[44682,"F86026",7102,271,192,162,154,67,"Forest Surgery","WF","WF-1","Chingford/ Walthamstow"]
[44682,"F86074",15074,369,255,195,241,92,"Leyton Healthcare (Oliver Road)","WF","WF-3","Leyton Collaborative"]
[44682,"F86638",5132,259,189,152,173,90,"The Microfaculty","WF","WF-1","Chingford/ Walthamstow"]
[44713,"F86004",15932,797,561,402,449,119,"Handsworth Medical Centre","WF","WF-2","Chingford E4"]
[44713,"F86018",9942,494,368,257,267,130,"The Ecclesbourne Practice","WF","WF-4","Forest Integrated Health"]
[44713,"F86026",7145,273,193,173,153,69,"Forest Surgery","WF","WF-1","Chingford/ Walthamstow"]
[44713,"F86074",15075,370,254,197,241,90,"Leyton Healthcare (Oliver Road)","WF","WF-3","Leyton Collaborative"]
[44713,"F86638",5122,262,191,153,176,88,"The Microfaculty","WF","WF-1","Chingford/ Walthamstow"]
[44743,"F86004",15929,791,554,390,444,117,"Handsworth Medical Centre","WF","WF-2","Chingford E4"]
[44743,"F86018",9941,488,365,270,262,131,"The Ecclesbourne Practice","WF","WF-4","Forest Integrated Health"]
[44743,"F86026",7132,275,194,172,155,57,"Forest Surgery","WF","WF-1","Chingford/ Walthamstow"]
[44743,"F86074",15062,376,254,203,246,89,"Leyton Healthcare (Oliver Road)","WF","WF-3","Leyton Collaborative"]
[44743,"F86638",5093,262,190,147,175,79,"The Microfaculty","WF","WF-1","Chingford/ Walthamstow"]
[44774,"F86004",15938,788,550,379,444,107,"Handsworth Medical Centre","WF","WF-2","Chingford E4"]
[44774,"F86018",9963,489,368,279,262,138,"The Ecclesbourne Practice","WF","WF-4","Forest Integrated Health"]
[44774,"F86026",7179,279,193,180,156,54,"Forest Surgery","WF","WF-1","Chingford/ Walthamstow"]
[44774,"F86074",15048,378,251,202,246,88,"Leyton Healthcare (Oliver Road)","WF","WF-3","Leyton Collaborative"]
[44774,"F86638",5097,263,187,144,176,86,"The Microfaculty","WF","WF-1","Chingford/ Walthamstow"]
[44805,"F86004",15949,787,546,387,445,108,"Handsworth Medical Centre","WF","WF-2","Chingford E4"]
[44805,"F86018",9969,486,367,278,261,131,"The Ecclesbourne Practice","WF","WF-4","Forest Integrated Health"]
[44805,"F86026",7152,279,190,186,155,50,"Forest Surgery","WF","WF-1","Chingford/ Walthamstow"]
[44805,"F86074",15033,380,249,203,244,87,"Leyton Healthcare (Oliver Road)","WF","WF-3","Leyton Collaborative"]
[44805,"F86638",5056,261,186,147,175,88,"The Microfaculty","WF","WF-1","Chingford/ Walthamstow"]
[44835,"F86004",15936,774,539,368,441,112,"Handsworth Medical Centre","WF","WF-2","Chingford E4"]
[44835,"F86018",9937,481,365,273,258,126,"The Ecclesbourne Practice","WF","WF-4","Forest Integrated Health"]
[44835,"F86026",7118,282,191,197,157,57,"Forest Surgery","WF","WF-1","Chingford/ Walthamstow"]
[44835,"F86074",15034,372,247,206,241,88,"Leyton Healthcare (Oliver Road)","WF","WF-3","Leyton Collaborative"]
[44835,"F86638",5046,266,188,158,179,92,"The Microfaculty","WF","WF-1","Chingford/ Walthamstow"]
[44866,"F86004",15938,768,533,369,438,114,"Handsworth Medical Centre","WF","WF-2","Chingford E4"]
[44866,"F86018",9927,480,363,273,258,114,"The Ecclesbourne Practice","WF","WF-4","Forest Integrated Health"]
[44866,"F86026",7128,284,190,198,158,68,"Forest Surgery","WF","WF-1","Chingford/ Walthamstow"]
[44866,"F86074",15047,372,244,211,242,86,"Leyton Healthcare (Oliver Road)","WF","WF-3","Leyton Collaborative"]
[44866,"F86638",5008,264,180,166,177,105,"The Microfaculty","WF","WF-1","Chingford/ Walthamstow"]
[44896,"F86004",15919,776,533,395,443,114,"Handsworth Medical Centre","WF","WF-2","Chingford E4"]
[44896,"F86018",9791,477,362,273,261,101,"The Ecclesbourne Practice","WF","WF-4","Forest Integrated Health"]
[44896,"F86026",7089,280,184,193,157,68,"Forest Surgery","WF","WF-1","Chingford/ Walthamstow"]
[44896,"F86074",15061,376,245,223,243,90,"Leyton Healthcare (Oliver Road)","WF","WF-3","Leyton Collaborative"]
[44896,"F86638",4990,261,176,163,175,105,"The Microfaculty","WF","WF-1","Chingford/ Walthamstow"]
[44927,"F86004",15934,782,530,416,446,124,"Handsworth Medical Centre","WF","WF-2","Chingford E4"]
[44927,"F86018",9755,473,361,264,261,100,"The Ecclesbourne Practice","WF","WF-4","Forest Integrated Health"]
[44927,"F86026",7034,281,181,197,162,66,"Forest Surgery","WF","WF-1","Chingford/ Walthamstow"]
[44927,"F86074",15045,376,244,228,244,92,"Leyton Healthcare (Oliver Road)","WF","WF-3","Leyton Collaborative"]
[44927,"F86638",4973,260,175,169,175,100,"The Microfaculty","WF","WF-1","Chingford/ Walthamstow"]
[44958,"F86004",15973,782,527,441,445,126,"Handsworth Medical Centre","WF","WF-2","Chingford E4"]
[44958,"F86018",9767,471,357,268,261,96,"The Ecclesbourne Practice","WF","WF-4","Forest Integrated Health"]
[44958,"F86026",7037,281,180,205,160,69,"Forest Surgery","WF","WF-1","Chingford/ Walthamstow"]
[44958,"F86074",15076,376,241,236,242,92,"Leyton Healthcare (Oliver Road)","WF","WF-3","Leyton Collaborative"]
[44958,"F86638",4972,259,173,163,174,104,"The Microfaculty","WF","WF-1","Chingford/ Walthamstow"]
[44986,"F86004",15983,781,524,466,450,130,"Handsworth Medical Centre","WF","WF-2","Chingford E4"]
[44986,"F86018",9767,475,359,279,261,100,"The Ecclesbourne Practice","WF","WF-4","Forest Integrated Health"]
[44986,"F86026",7044,279,181,209,159,67,"Forest Surgery","WF","WF-1","Chingford/ Walthamstow"]
[44986,"F86074",15081,373,239,237,240,98,"Leyton Healthcare (Oliver Road)","WF","WF-3","Leyton Collaborative"]
[44986,"F86638",4956,254,171,172,171,102,"The Microfaculty","WF","WF-1","Chingford/ Walthamstow"]
[45017,"F86004",15997,788,530,501,454,137,"Handsworth Medical Centre","WF","WF-2","Chingford E4"]
[45017,"F86018",9785,481,360,288,263,117,"The Ecclesbourne Practice","WF","WF-4","Forest Integrated Health"]
[45017,"F86026",7005,277,180,207,155,66,"Forest Surgery","WF","WF-1","Chingford/ Walthamstow"]
[45017,"F86074",15054,378,239,235,246,100,"Leyton Healthcare (Oliver Road)","WF","WF-3","Leyton Collaborative"]
[45017,"F86638",4928,253,170,178,173,101,"The Microfaculty","WF","WF-1","Chingford/ Walthamstow"]
[45078,"F86004",16018,799,531,90,361,28,"Handsworth Medical Centre","WF","WF-2","Chingford E4"]
[45078,"F86018",9792,487,419,73,210,27,"The Ecclesbourne Practice","WF","WF-4","Forest Integrated Health"]
[45078,"F86026",7018,286,177,73,139,18,"Forest Surgery","WF","WF-1","Chingford/ Walthamstow"]
[45078,"F86074",15041,377,312,53,193,18,"Leyton Healthcare (Oliver Road)","WF","WF-3","Leyton Collaborative"]
[45078,"F86638",4884,253,167,42,150,27,"The Microfaculty","WF","WF-1","Chingford/ Walthamstow"]
[45108,"F86004",16023,799,541,157,408,119,"Handsworth Medical Centre","WF","WF-2","Chingford E4"]
[45108,"F86018",9801,489,426,126,234,49,"The Ecclesbourne Practice","WF","WF-4","Forest Integrated Health"]
[45108,"F86026",7024,280,177,110,144,41,"Forest Surgery","WF","WF-1","Chingford/ Walthamstow"]
[45108,"F86074",15021,380,311,79,216,34,"Leyton Healthcare (Oliver Road)","WF","WF-3","Leyton Collaborative"]
[45108,"F86638",4893,253,167,63,165,39,"The Microfaculty","WF","WF-1","Chingford/ Walthamstow"]
[45139,"F86004",16029,800,550,219,428,177,"Handsworth Medical Centre","WF","WF-2","Chingford E4"]
[45139,"F86018",9816,490,427,172,251,66,"The Ecclesbourne Practice","WF","WF-4","Forest Integrated Health"]
[45139,"F86026",7016,278,173,132,149,49,"Forest Surgery","WF","WF-1","Chingford/ Walthamstow"]
[45139,"F86074",14977,380,311,107,231,52,"Leyton Healthcare (Oliver Road)","WF","WF-3","Leyton Collaborative"]
[45139,"F86638",4861,255,166,80,169,56,"The Microfaculty","WF","WF-1","Chingford/ Walthamstow"]
[45170,"F86004",16053,798,549,292,446,232,"Handsworth Medical Centre","WF","WF-2","Chingford E4"]
[45170,"F86018",9823,493,433,212,267,82,"The Ecclesbourne Practice","WF","WF-4","Forest Integrated Health"]
[45170,"F86026",6962,283,172,163,153,70,"Forest Surgery","WF","WF-1","Chingford/ Walthamstow"]
[45170,"F86074",14934,383,308,170,238,64,"Leyton Healthcare (Oliver Road)","WF","WF-3","Leyton Collaborative"]
[45170,"F86638",4879,254,162,92,168,71,"The Microfaculty","WF","WF-1","Chingford/ Walthamstow"]
[45200,"F86004",16016,793,555,336,460,268,"Handsworth Medical Centre","WF","WF-2","Chingford E4"]
[45200,"F86018",9791,490,433,230,275,93,"The Ecclesbourne Practice","WF","WF-4","Forest Integrated Health"]
[45200,"F86026",6978,287,231,195,158,87,"Forest Surgery","WF","WF-1","Chingford/ Walthamstow"]
[45200,"F86074",14862,388,308,191,246,78,"Leyton Healthcare (Oliver Road)","WF","WF-3","Leyton Collaborative"]
[45200,"F86638",4860,248,157,94,167,77,"The Microfaculty","WF","WF-1","Chingford/ Walthamstow"]
[45231,"F86004",15993,791,553,378,469,286,"Handsworth Medical Centre","WF","WF-2","Chingford E4"]
[45231,"F86018",9782,486,430,244,275,102,"The Ecclesbourne Practice","WF","WF-4","Forest Integrated Health"]
[45231,"F86026",6962,284,231,217,158,110,"Forest Surgery","WF","WF-1","Chingford/ Walthamstow"]
[45231,"F86074",14797,388,310,211,249,93,"Leyton Healthcare (Oliver Road)","WF","WF-3","Leyton Collaborative"]
[45231,"F86638",4839,248,158,131,169,93,"The Microfaculty","WF","WF-1","Chingford/ Walthamstow"]
[45261,"F86004",16023,788,555,424,475,309,"Handsworth Medical Centre","WF","WF-2","Chingford E4"]
[45261,"F86018",9793,483,428,263,272,120,"The Ecclesbourne Practice","WF","WF-4","Forest Integrated Health"]
[45261,"F86026",6975,285,229,220,162,151,"Forest Surgery","WF","WF-1","Chingford/ Walthamstow"]
[45261,"F86074",14792,390,312,248,259,135,"Leyton Healthcare (Oliver Road)","WF","WF-3","Leyton Collaborative"]
[45261,"F86638",4805,241,155,159,166,110,"The Microfaculty","WF","WF-1","Chingford/ Walthamstow"]
[45292,"F86004",16023,794,556,483,482,317,"Handsworth Medical Centre","WF","WF-2","Chingford E4"]
[45292,"F86018",9818,481,426,281,274,130,"The Ecclesbourne Practice","WF","WF-4","Forest Integrated Health"]
[45292,"F86026",6971,284,228,223,162,159,"Forest Surgery","WF","WF-1","Chingford/ Walthamstow"]
[45292,"F86074",14743,390,309,263,262,154,"Leyton Healthcare (Oliver Road)","WF","WF-3","Leyton Collaborative"]
[45292,"F86638",4776,234,185,162,164,113,"The Microfaculty","WF","WF-1","Chingford/ Walthamstow"]
[45323,"F86004",16030,782,553,518,484,280,"Handsworth Medical Centre","WF","WF-2","Chingford E4"]
[45323,"F86018",9864,486,437,306,280,150,"The Ecclesbourne Practice","WF","WF-4","Forest Integrated Health"]
[45323,"F86026",6948,282,225,227,168,140,"Forest Surgery","WF","WF-1","Chingford/ Walthamstow"]
[45323,"F86074",14709,392,308,275,266,149,"Leyton Healthcare (Oliver Road)","WF","WF-3","Leyton Collaborative"]
[45323,"F86638",4745,236,189,174,184,120,"The Microfaculty","WF","WF-1","Chingford/ Walthamstow"]
[45352,"F86004",16027,778,589,576,497,362,"Handsworth Medical Centre","WF","WF-2","Chingford E4"]
[45352,"F86018",9844,489,445,327,297,180,"The Ecclesbourne Practice","WF","WF-4","Forest Integrated Health"]
[45352,"F86026",6945,287,224,229,184,151,"Forest Surgery","WF","WF-1","Chingford/ Walthamstow"]
[45352,"F86074",14608,392,305,283,271,158,"Leyton Healthcare (Oliver Road)","WF","WF-3","Leyton Collaborative"]
[45352,"F86638",4673,236,188,184,194,130,"The Microfaculty","WF","WF-1","Chingford/ Walthamstow"]
[45383,"F86004",15999,793,604,604,517,402,"Handsworth Medical Centre","WF","WF-2","Chingford E4"]
[45383,"F86018",9803,488,449,353,311,274,"The Ecclesbourne Practice","WF","WF-4","Forest Integrated Health"]
[45383,"F86026",6843,284,218,227,185,192,"Forest Surgery","WF","WF-1","Chingford/ Walthamstow"]
[45383,"F86074",14528,389,303,283,270,166,"Leyton Healthcare (Oliver Road)","WF","WF-3","Leyton Collaborative"]
[45383,"F86638",4628,239,188,193,193,133,"The Microfaculty","WF","WF-1","Chingford/ Walthamstow"]