{"text_format":"1","workbook":"xlsx","n_sheets":7,"sheets":["Post-operative wound care","Composite Data","EMIS Data","Other Data","Control Panel","RB","Sheet2"],"not_rendered":{"charts":0,"images":1,"macros":0,"external_links":0,"defined_names":5,"comments":0,"pivot_tables":0},"unopened":[],"bounds":{"document_bytes":16777216,"sheet_cells":100000,"rows_first":2000,"rows_last":500,"rows_between":2000,"halvings":0,"cell_chars":16384,"cell_head_chars":4096},"cells_cut":0,"cells_raw":0,"read":"whole","date_system":"1900"}

{"sheet":"Post-operative wound care","index":0,"n_rows":54,"n_cols":16,"rows_kept":54,"cut":false,"hidden":false,"merged":[]}
[null,null,null,"Redbridge"]
[null,null,null,"Post-Operative Wound Care"]
[null,null,null,"01/04/2022 - 01/04/2023","Q4"]
[null,null,null,{"$f":"INDEX('Control Panel'!$E$2:$E$17,COLUMN(A1))","v":"Currently Registered Regular Patients"},{"$f":"INDEX('Control Panel'!$E$2:$E$17,COLUMN(B1))","v":"POWC 01 Post-operative wound care 2022"},{"$f":"INDEX('Control Panel'!$E$2:$E$17,COLUMN(C1))","v":0},{"$f":"INDEX('Control Panel'!$E$2:$E$17,COLUMN(D1))","v":"POWC 01 Post-operative wound care activity"},{"$f":"INDEX('Control Panel'!$E$2:$E$17,COLUMN(E1))","v":0},{"$f":"INDEX('Control Panel'!$E$2:$E$17,COLUMN(F1))","v":"POWC 0101 Referral to tissue viability service"},null,{"$f":"INDEX('Control Panel'!$E$2:$E$17,COLUMN(G1))","v":"POWC 0102 Refer to district nurse"},{"$f":"INDEX('Control Panel'!$E$2:$E$17,COLUMN(H1))","v":"POWC 0103 Orthopaedic referral"},null,null,null,{"$f":"INDEX('Control Panel'!$E$2:$E$17,COLUMN(I1))","v":"POWC 0104 Advice given about wound care"}]
[null,null,null,{"$f":"INDEX('Control Panel'!$F$2:$F$10,COLUMN(A1))","v":"Currently Registered Regular Patients"},{"$f":"INDEX('Control Panel'!$F$2:$F$10,COLUMN(B1))","v":"Patients with Post-operative wound care 2022-23"},"%",{"$f":"INDEX('Control Panel'!$F$2:$F$10,COLUMN(D1))","v":"Post-operative wound care activity recorded 2022-23"},"%",{"$f":"INDEX('Control Panel'!$F$2:$F$10,COLUMN(F1))","v":"Referral to tissue viability service"},"%",{"$f":"INDEX('Control Panel'!$F$2:$F$10,COLUMN(G1))","v":"Refer to district nurse"},"%",{"$f":"INDEX('Control Panel'!$F$2:$F$10,COLUMN(H1))","v":"Orthopaedic referral"},"%",{"$f":"INDEX('Control Panel'!$F$2:$F$10,COLUMN(I1))","v":"Advice given about wound care"},"%"]
[{"$f":"'Control Panel'!A5","v":"RB-1"},{"$f":"'Control Panel'!B5","v":"Cranbrook"},"L1",{"$f":"SUMIFS(D$13:D$54,$A$13:$A$54,$A6)","v":46123},{"$f":"SUMIFS(E$13:E$54,$A$13:$A$54,$A6)","v":148},{"$f":"SUM(E6/D6)","v":3.2088112221668147E-3},{"$f":"SUMIFS(G$13:G$20,$A$13:$A$20,$A6)","v":127},{"$f":"SUM(G6/D6)","v":2.7535069271296315E-3},{"$f":"SUMIFS(I$13:I$54,$A$13:$A$54,$A6)","v":4},{"$f":"SUM(I6/E6)","v":2.7027027027027029E-2},{"$f":"SUMIFS(K$13:K$54,$A$13:$A$54,$A6)","v":1},{"$f":"SUM(K6/E6)","v":6.7567567567567571E-3},{"$f":"SUMIFS(M$13:M$54,$A$13:$A$54,$A6)","v":10},{"$f":"SUM(M6/E6)","v":6.7567567567567571E-2},{"$f":"SUMIFS(O$13:O$54,$A$13:$A$54,$A6)","v":83},{"$f":"SUM(O6/E6)","v":0.56081081081081086}]
[{"$f":"'Control Panel'!A6","v":"RB-2"},{"$f":"'Control Panel'!B6","v":"Fairlop"},"L2",{"$f":"SUMIFS(D$13:D$54,$A$13:$A$54,$A7)","v":46556},244,{"$f":"SUM(E7/D7)","v":5.241000085918034E-3},{"$f":"SUMIFS(G$13:G$54,$A$13:$A$54,$A7)","v":507},{"$f":"SUM(G7/D7)","v":1.0890110834264112E-2},{"$f":"SUMIFS(I$13:I$54,$A$13:$A$54,$A7)","v":1},{"$f":"SUM(I7/E7)","v":4.0983606557377051E-3},{"$f":"SUMIFS(K$13:K$54,$A$13:$A$54,$A7)","v":1},{"$f":"SUM(K7/E7)","v":4.0983606557377051E-3},13,{"$f":"SUM(M7/E7)","v":5.3278688524590161E-2},174,{"$f":"SUM(O7/E7)","v":0.71311475409836067}]
[{"$f":"'Control Panel'!A7","v":"RB-3"},{"$f":"'Control Panel'!B7","v":"Seven Kings"},"L3",50302,141,2.8030694604588287E-3,{"$f":"SUMIFS(G$13:G$54,$A$13:$A$54,$A8)","v":247},4.9103415371158201E-3,1,7.0921985815602835E-3,2,1.4184397163120567E-2,9,6.3829787234042548E-2,35,0.24822695035460993]
[{"$f":"'Control Panel'!A8","v":"RB-4"},{"$f":"'Control Panel'!B8","v":"Wanstead & Woodford"},"L4",76237,398,5.2205621942101607E-3,706,9.2605952490260636E-3,3,7.537688442211055E-3,12,3.015075376884422E-2,36,9.0452261306532666E-2,122,0.30653266331658291]
[{"$f":"'Control Panel'!A9","v":"RB-5"},{"$f":"'Control Panel'!B9","v":"Loxford"},null,54963,132,2.4016156323344797E-3,19,3.4568709859359933E-4,4,3.0303030303030304E-2,6,4.5454545454545456E-2,11,8.3333333333333329E-2,77,0.58333333333333337]
[{"$f":"'Control Panel'!A10","v":"RB-6"},{"$f":"'Control Panel'!B10","v":"NewCross Alliance"},null,34773,66,1.8980243292209473E-3,{"$f":"SUMIFS(G$13:G$54,$A$13:$A$54,$A11)","v":74},2.1280878842780317E-3,0,0,0,0,4,6.0606060606060608E-2,2,3.0303030303030304E-2]
[null,"Redbridge","Total",{"$f":"SUM(D13:D54)","v":308954},{"$f":"SUM(E13:E54)","v":1129},{"$f":"SUM(E12/D12)","v":3.6542656835645438E-3},{"$f":"SUM(G13:G54)","v":1680},{"$f":"SUM(G12/D12)","v":5.4377027000783286E-3},{"$f":"SUM(I13:I54)","v":13},{"$f":"SUM(I12/E12)","v":1.1514614703277236E-2},{"$f":"SUM(K13:K54)","v":22},{"$f":"SUM(K11/E11)","v":0},{"$f":"SUM(M13:M54)","v":83},{"$f":"SUM(M12/E12)","v":7.3516386182462354E-2},{"$f":"SUM(O13:O54)","v":493},{"$f":"SUM(O12/E12)","v":0.43666961913197522}]
["RB-1","Drive Surgery","F86652",{"$f":"HLOOKUP($C13,'Composite Data'!$B$2:$AQ$9,MATCH('Post-operative wound care'!D$4,'Composite Data'!$A$2:$A$10,0),FALSE)","v":7227},{"$f":"HLOOKUP($C13,'Composite Data'!$B$2:$AQ$9,MATCH('Post-operative wound care'!E$4,'Composite Data'!$A$2:$A$10,0),FALSE)","v":12},1.6604400166044002E-3,{"$f":"HLOOKUP($C13,'Composite Data'!$B$2:$AQ$9,MATCH('Post-operative wound care'!G$4,'Composite Data'!$A$2:$A$10,0),FALSE)","v":20},2.7674000276740004E-3,{"$f":"HLOOKUP($C13,'Composite Data'!$B$2:$AQ$9,MATCH('Post-operative wound care'!I$4,'Composite Data'!$A$2:$A$10,0),FALSE)","v":0},{"$f":"IFERROR(SUM(I13/E13),\"0.0\"%)","v":0},{"$f":"HLOOKUP($C13,'Composite Data'!$B$2:$AQ$9,MATCH('Post-operative wound care'!K$4,'Composite Data'!$A$2:$A$10,0),FALSE)","v":0},{"$f":"IFERROR(SUM(K13/E13),\"0.0%\")","v":0},{"$f":"HLOOKUP($C13,'Composite Data'!$B$2:$AQ$9,MATCH('Post-operative wound care'!L$4,'Composite Data'!$A$2:$A$10,0),FALSE)","v":2},{"$f":"IFERROR(SUM(M13/E13),\"0.0\"%)","v":0.16666666666666666},{"$f":"HLOOKUP($C13,'Composite Data'!$B$2:$AQ$9,MATCH('Post-operative wound care'!P$4,'Composite Data'!$A$2:$A$10,0),FALSE)","v":3},{"$f":"IFERROR(SUM(O13/E13),\"0.0\"%)","v":0.25}]
["RB-1","St Clements Surgery","F86702",{"$f":"HLOOKUP($C14,'Composite Data'!$B$2:$AQ$9,MATCH('Post-operative wound care'!D$4,'Composite Data'!$A$2:$A$10,0),FALSE)","v":5186},{"$f":"HLOOKUP($C14,'Composite Data'!$B$2:$AQ$9,MATCH('Post-operative wound care'!E$4,'Composite Data'!$A$2:$A$10,0),FALSE)","v":1},1.9282684149633629E-4,{"$f":"HLOOKUP($C14,'Composite Data'!$B$2:$AQ$9,MATCH('Post-operative wound care'!G$4,'Composite Data'!$A$2:$A$10,0),FALSE)","v":1},1.9282684149633629E-4,{"$f":"HLOOKUP($C14,'Composite Data'!$B$2:$AQ$9,MATCH('Post-operative wound care'!I$4,'Composite Data'!$A$2:$A$10,0),FALSE)","v":0},{"$f":"IFERROR(SUM(I14/E14),\"0.0\"%)","v":0},{"$f":"HLOOKUP($C14,'Composite Data'!$B$2:$AQ$9,MATCH('Post-operative wound care'!K$4,'Composite Data'!$A$2:$A$10,0),FALSE)","v":0},{"$f":"IFERROR(SUM(K14/E14),\"0.0%\")","v":0},{"$f":"HLOOKUP($C14,'Composite Data'!$B$2:$AQ$9,MATCH('Post-operative wound care'!L$4,'Composite Data'!$A$2:$A$10,0),FALSE)","v":1},{"$f":"IFERROR(SUM(M14/E14),\"0.0\"%)","v":1},{"$f":"HLOOKUP($C14,'Composite Data'!$B$2:$AQ$9,MATCH('Post-operative wound care'!P$4,'Composite Data'!$A$2:$A$10,0),FALSE)","v":0},{"$f":"IFERROR(SUM(O14/E14),\"0.0\"%)","v":0}]
["RB-1","Granville Medical Centre","Y00918",{"$f":"HLOOKUP($C15,'Composite Data'!$B$2:$AQ$9,MATCH('Post-operative wound care'!D$4,'Composite Data'!$A$2:$A$10,0),FALSE)","v":6592},{"$f":"HLOOKUP($C15,'Composite Data'!$B$2:$AQ$9,MATCH('Post-operative wound care'!E$4,'Composite Data'!$A$2:$A$10,0),FALSE)","v":30},4.5509708737864075E-3,{"$f":"HLOOKUP($C15,'Composite Data'!$B$2:$AQ$9,MATCH('Post-operative wound care'!G$4,'Composite Data'!$A$2:$A$10,0),FALSE)","v":0},0,{"$f":"HLOOKUP($C15,'Composite Data'!$B$2:$AQ$9,MATCH('Post-operative wound care'!I$4,'Composite Data'!$A$2:$A$10,0),FALSE)","v":3},0.1,{"$f":"HLOOKUP($C15,'Composite Data'!$B$2:$AQ$9,MATCH('Post-operative wound care'!K$4,'Composite Data'!$A$2:$A$10,0),FALSE)","v":1},3.3333333333333333E-2,{"$f":"HLOOKUP($C15,'Composite Data'!$B$2:$AQ$9,MATCH('Post-operative wound care'!L$4,'Composite Data'!$A$2:$A$10,0),FALSE)","v":1},3.3333333333333333E-2,{"$f":"HLOOKUP($C15,'Composite Data'!$B$2:$AQ$9,MATCH('Post-operative wound care'!P$4,'Composite Data'!$A$2:$A$10,0),FALSE)","v":25},0.83333333333333337]
["RB-1","Balfour Road Surgery","F86042",{"$f":"HLOOKUP($C16,'Composite Data'!$B$2:$AQ$9,MATCH('Post-operative wound care'!D$4,'Composite Data'!$A$2:$A$10,0),FALSE)","v":6270},{"$f":"HLOOKUP($C16,'Composite Data'!$B$2:$AQ$9,MATCH('Post-operative wound care'!E$4,'Composite Data'!$A$2:$A$10,0),FALSE)","v":33},5.263157894736842E-3,{"$f":"HLOOKUP($C16,'Composite Data'!$B$2:$AQ$9,MATCH('Post-operative wound care'!G$4,'Composite Data'!$A$2:$A$10,0),FALSE)","v":47},7.4960127591706541E-3,{"$f":"HLOOKUP($C16,'Composite Data'!$B$2:$AQ$9,MATCH('Post-operative wound care'!I$4,'Composite Data'!$A$2:$A$10,0),FALSE)","v":1},3.0303030303030304E-2,{"$f":"HLOOKUP($C16,'Composite Data'!$B$2:$AQ$9,MATCH('Post-operative wound care'!K$4,'Composite Data'!$A$2:$A$10,0),FALSE)","v":0},0,{"$f":"HLOOKUP($C16,'Composite Data'!$B$2:$AQ$9,MATCH('Post-operative wound care'!L$4,'Composite Data'!$A$2:$A$10,0),FALSE)","v":2},6.0606060606060608E-2,{"$f":"HLOOKUP($C16,'Composite Data'!$B$2:$AQ$9,MATCH('Post-operative wound care'!P$4,'Composite Data'!$A$2:$A$10,0),FALSE)","v":22},0.66666666666666663]
["RB-1","Cranbrook Surgery","F86698",{"$f":"HLOOKUP($C17,'Composite Data'!$B$2:$AQ$9,MATCH('Post-operative wound care'!D$4,'Composite Data'!$A$2:$A$10,0),FALSE)","v":5433},{"$f":"HLOOKUP($C17,'Composite Data'!$B$2:$AQ$9,MATCH('Post-operative wound care'!E$4,'Composite Data'!$A$2:$A$10,0),FALSE)","v":11},2.0246640898214613E-3,{"$f":"HLOOKUP($C17,'Composite Data'!$B$2:$AQ$9,MATCH('Post-operative wound care'!G$4,'Composite Data'!$A$2:$A$10,0),FALSE)","v":17},3.1290263206331676E-3,{"$f":"HLOOKUP($C17,'Composite Data'!$B$2:$AQ$9,MATCH('Post-operative wound care'!I$4,'Composite Data'!$A$2:$A$10,0),FALSE)","v":0},0,{"$f":"HLOOKUP($C17,'Composite Data'!$B$2:$AQ$9,MATCH('Post-operative wound care'!K$4,'Composite Data'!$A$2:$A$10,0),FALSE)","v":0},0,{"$f":"HLOOKUP($C17,'Composite Data'!$B$2:$AQ$9,MATCH('Post-operative wound care'!L$4,'Composite Data'!$A$2:$A$10,0),FALSE)","v":1},9.0909090909090912E-2,{"$f":"HLOOKUP($C17,'Composite Data'!$B$2:$AQ$9,MATCH('Post-operative wound care'!P$4,'Composite Data'!$A$2:$A$10,0),FALSE)","v":2},0.18181818181818182]
["RB-1","Gants Hill Medical Centre","F86008",{"$f":"HLOOKUP($C18,'Composite Data'!$B$2:$AQ$9,MATCH('Post-operative wound care'!D$4,'Composite Data'!$A$2:$A$10,0),FALSE)","v":11581},{"$f":"HLOOKUP($C18,'Composite Data'!$B$2:$AQ$9,MATCH('Post-operative wound care'!E$4,'Composite Data'!$A$2:$A$10,0),FALSE)","v":37},3.1948881789137379E-3,{"$f":"HLOOKUP($C18,'Composite Data'!$B$2:$AQ$9,MATCH('Post-operative wound care'!G$4,'Composite Data'!$A$2:$A$10,0),FALSE)","v":42},3.6266298247128919E-3,{"$f":"HLOOKUP($C18,'Composite Data'!$B$2:$AQ$9,MATCH('Post-operative wound care'!I$4,'Composite Data'!$A$2:$A$10,0),FALSE)","v":0},0,{"$f":"HLOOKUP($C18,'Composite Data'!$B$2:$AQ$9,MATCH('Post-operative wound care'!K$4,'Composite Data'!$A$2:$A$10,0),FALSE)","v":0},0,{"$f":"HLOOKUP($C18,'Composite Data'!$B$2:$AQ$9,MATCH('Post-operative wound care'!L$4,'Composite Data'!$A$2:$A$10,0),FALSE)","v":2},5.4054054054054057E-2,{"$f":"HLOOKUP($C18,'Composite Data'!$B$2:$AQ$9,MATCH('Post-operative wound care'!P$4,'Composite Data'!$A$2:$A$10,0),FALSE)","v":31},0.83783783783783783]
["RB-1","Redbridge Surgery","F86703",{"$f":"HLOOKUP($C19,'Composite Data'!$B$2:$AQ$9,MATCH('Post-operative wound care'!D$4,'Composite Data'!$A$2:$A$10,0),FALSE)","v":3834},{"$f":"HLOOKUP($C19,'Composite Data'!$B$2:$AQ$9,MATCH('Post-operative wound care'!E$4,'Composite Data'!$A$2:$A$10,0),FALSE)","v":24},6.2597809076682318E-3,{"$f":"HLOOKUP($C19,'Composite Data'!$B$2:$AQ$9,MATCH('Post-operative wound care'!G$4,'Composite Data'!$A$2:$A$10,0),FALSE)","v":0},0,{"$f":"HLOOKUP($C19,'Composite Data'!$B$2:$AQ$9,MATCH('Post-operative wound care'!I$4,'Composite Data'!$A$2:$A$10,0),FALSE)","v":0},0,{"$f":"HLOOKUP($C19,'Composite Data'!$B$2:$AQ$9,MATCH('Post-operative wound care'!K$4,'Composite Data'!$A$2:$A$10,0),FALSE)","v":0},0,{"$f":"HLOOKUP($C19,'Composite Data'!$B$2:$AQ$9,MATCH('Post-operative wound care'!L$4,'Composite Data'!$A$2:$A$10,0),FALSE)","v":1},4.1666666666666664E-2,{"$f":"HLOOKUP($C19,'Composite Data'!$B$2:$AQ$9,MATCH('Post-operative wound care'!P$4,'Composite Data'!$A$2:$A$10,0),FALSE)","v":0},0]
["RB-1","York Road Surgery","F86657",{"$f":"HLOOKUP($C20,'Composite Data'!$B$2:$AQ$9,MATCH('Post-operative wound care'!D$4,'Composite Data'!$A$2:$A$10,0),FALSE)","v":"8355"},{"$f":"HLOOKUP($C20,'Composite Data'!$B$2:$AQ$9,MATCH('Post-operative wound care'!E$4,'Composite Data'!$A$2:$A$10,0),FALSE)","v":"27"},3.2315978456014362E-3,0,0,0,0,{"$f":"HLOOKUP($C20,'Composite Data'!$B$2:$AQ$9,MATCH('Post-operative wound care'!K$4,'Composite Data'!$A$2:$A$10,0),FALSE)","v":0},0,{"$f":"HLOOKUP($C20,'Composite Data'!$B$2:$AQ$9,MATCH('Post-operative wound care'!L$4,'Composite Data'!$A$2:$A$10,0),FALSE)","v":"1"},3.7037037037037035E-2,{"$f":"HLOOKUP($C20,'Composite Data'!$B$2:$AQ$9,MATCH('Post-operative wound care'!P$4,'Composite Data'!$A$2:$A$10,0),FALSE)","v":0},0]
["RB-2","Kenwood Medical Centre","F86081",{"$f":"HLOOKUP($C21,'Composite Data'!$B$2:$AQ$9,MATCH('Post-operative wound care'!D$4,'Composite Data'!$A$2:$A$10,0),FALSE)","v":6454},{"$f":"HLOOKUP($C21,'Composite Data'!$B$2:$AQ$9,MATCH('Post-operative wound care'!E$4,'Composite Data'!$A$2:$A$10,0),FALSE)","v":11},1.7043693833281685E-3,{"$f":"HLOOKUP($C21,'Composite Data'!$B$2:$AQ$9,MATCH('Post-operative wound care'!G$4,'Composite Data'!$A$2:$A$10,0),FALSE)","v":17},2.6340254105980789E-3,{"$f":"HLOOKUP($C21,'Composite Data'!$B$2:$AQ$9,MATCH('Post-operative wound care'!I$4,'Composite Data'!$A$2:$A$10,0),FALSE)","v":0},0,{"$f":"HLOOKUP($C21,'Composite Data'!$B$2:$AQ$9,MATCH('Post-operative wound care'!K$4,'Composite Data'!$A$2:$A$10,0),FALSE)","v":0},0,{"$f":"HLOOKUP($C21,'Composite Data'!$B$2:$AQ$9,MATCH('Post-operative wound care'!L$4,'Composite Data'!$A$2:$A$10,0),FALSE)","v":1},9.0909090909090912E-2,{"$f":"HLOOKUP($C21,'Composite Data'!$B$2:$AQ$9,MATCH('Post-operative wound care'!P$4,'Composite Data'!$A$2:$A$10,0),FALSE)","v":0},0]
["RB-2","Eastern Avenue Medical Centre","F86083",{"$f":"HLOOKUP($C22,'Composite Data'!$B$2:$AQ$9,MATCH('Post-operative wound care'!D$4,'Composite Data'!$A$2:$A$10,0),FALSE)","v":6785},{"$f":"HLOOKUP($C22,'Composite Data'!$B$2:$AQ$9,MATCH('Post-operative wound care'!E$4,'Composite Data'!$A$2:$A$10,0),FALSE)","v":27},3.9793662490788502E-3,{"$f":"HLOOKUP($C22,'Composite Data'!$B$2:$AQ$9,MATCH('Post-operative wound care'!G$4,'Composite Data'!$A$2:$A$10,0),FALSE)","v":30},4.4215180545320561E-3,{"$f":"HLOOKUP($C22,'Composite Data'!$B$2:$AQ$9,MATCH('Post-operative wound care'!I$4,'Composite Data'!$A$2:$A$10,0),FALSE)","v":0},0,{"$f":"HLOOKUP($C22,'Composite Data'!$B$2:$AQ$9,MATCH('Post-operative wound care'!K$4,'Composite Data'!$A$2:$A$10,0),FALSE)","v":0},0,{"$f":"HLOOKUP($C22,'Composite Data'!$B$2:$AQ$9,MATCH('Post-operative wound care'!L$4,'Composite Data'!$A$2:$A$10,0),FALSE)","v":4},0.14814814814814814,{"$f":"HLOOKUP($C22,'Composite Data'!$B$2:$AQ$9,MATCH('Post-operative wound care'!P$4,'Composite Data'!$A$2:$A$10,0),FALSE)","v":5},0.18518518518518517]
["RB-2","Fullwell Avenue Surgery","F86612",{"$f":"HLOOKUP($C23,'Composite Data'!$B$2:$AQ$9,MATCH('Post-operative wound care'!D$4,'Composite Data'!$A$2:$A$10,0),FALSE)","v":3307},{"$f":"HLOOKUP($C23,'Composite Data'!$B$2:$AQ$9,MATCH('Post-operative wound care'!E$4,'Composite Data'!$A$2:$A$10,0),FALSE)","v":10},3.0238887208950713E-3,{"$f":"HLOOKUP($C23,'Composite Data'!$B$2:$AQ$9,MATCH('Post-operative wound care'!G$4,'Composite Data'!$A$2:$A$10,0),FALSE)","v":16},4.8382219534321138E-3,{"$f":"HLOOKUP($C23,'Composite Data'!$B$2:$AQ$9,MATCH('Post-operative wound care'!I$4,'Composite Data'!$A$2:$A$10,0),FALSE)","v":0},0,{"$f":"HLOOKUP($C23,'Composite Data'!$B$2:$AQ$9,MATCH('Post-operative wound care'!K$4,'Composite Data'!$A$2:$A$10,0),FALSE)","v":0},0,{"$f":"HLOOKUP($C23,'Composite Data'!$B$2:$AQ$9,MATCH('Post-operative wound care'!L$4,'Composite Data'!$A$2:$A$10,0),FALSE)","v":2},0.2,{"$f":"HLOOKUP($C23,'Composite Data'!$B$2:$AQ$9,MATCH('Post-operative wound care'!P$4,'Composite Data'!$A$2:$A$10,0),FALSE)","v":4},0.4]
["RB-2","Heathcote Primary Care Centre","F86624",{"$f":"HLOOKUP($C24,'Composite Data'!$B$2:$AQ$9,MATCH('Post-operative wound care'!D$4,'Composite Data'!$A$2:$A$10,0),FALSE)","v":3122},{"$f":"HLOOKUP($C24,'Composite Data'!$B$2:$AQ$9,MATCH('Post-operative wound care'!E$4,'Composite Data'!$A$2:$A$10,0),FALSE)","v":2},6.406149903907751E-4,{"$f":"HLOOKUP($C24,'Composite Data'!$B$2:$AQ$9,MATCH('Post-operative wound care'!G$4,'Composite Data'!$A$2:$A$10,0),FALSE)","v":2},6.406149903907751E-4,{"$f":"HLOOKUP($C24,'Composite Data'!$B$2:$AQ$9,MATCH('Post-operative wound care'!I$4,'Composite Data'!$A$2:$A$10,0),FALSE)","v":0},0,{"$f":"HLOOKUP($C24,'Composite Data'!$B$2:$AQ$9,MATCH('Post-operative wound care'!K$4,'Composite Data'!$A$2:$A$10,0),FALSE)","v":0},0,{"$f":"HLOOKUP($C24,'Composite Data'!$B$2:$AQ$9,MATCH('Post-operative wound care'!L$4,'Composite Data'!$A$2:$A$10,0),FALSE)","v":0},0,{"$f":"HLOOKUP($C24,'Composite Data'!$B$2:$AQ$9,MATCH('Post-operative wound care'!P$4,'Composite Data'!$A$2:$A$10,0),FALSE)","v":1},0.5]
["RB-2","Fencepiece Road Medical Practice","F86707",{"$f":"HLOOKUP($C25,'Composite Data'!$B$2:$AQ$9,MATCH('Post-operative wound care'!D$4,'Composite Data'!$A$2:$A$10,0),FALSE)","v":6752},{"$f":"HLOOKUP($C25,'Composite Data'!$B$2:$AQ$9,MATCH('Post-operative wound care'!E$4,'Composite Data'!$A$2:$A$10,0),FALSE)","v":14},2.0734597156398106E-3,{"$f":"HLOOKUP($C25,'Composite Data'!$B$2:$AQ$9,MATCH('Post-operative wound care'!G$4,'Composite Data'!$A$2:$A$10,0),FALSE)","v":0},0,{"$f":"HLOOKUP($C25,'Composite Data'!$B$2:$AQ$9,MATCH('Post-operative wound care'!I$4,'Composite Data'!$A$2:$A$10,0),FALSE)","v":0},0,{"$f":"HLOOKUP($C25,'Composite Data'!$B$2:$AQ$9,MATCH('Post-operative wound care'!K$4,'Composite Data'!$A$2:$A$10,0),FALSE)","v":0},0,{"$f":"HLOOKUP($C25,'Composite Data'!$B$2:$AQ$9,MATCH('Post-operative wound care'!L$4,'Composite Data'!$A$2:$A$10,0),FALSE)","v":0},0,{"$f":"HLOOKUP($C25,'Composite Data'!$B$2:$AQ$9,MATCH('Post-operative wound care'!P$4,'Composite Data'!$A$2:$A$10,0),FALSE)","v":7},0.5]
["RB-2","The Willows Practice","F86057",{"$f":"HLOOKUP($C26,'Composite Data'!$B$2:$AQ$9,MATCH('Post-operative wound care'!D$4,'Composite Data'!$A$2:$A$10,0),FALSE)","v":6471},{"$f":"HLOOKUP($C26,'Composite Data'!$B$2:$AQ$9,MATCH('Post-operative wound care'!E$4,'Composite Data'!$A$2:$A$10,0),FALSE)","v":15},2.3180343069077423E-3,{"$f":"HLOOKUP($C26,'Composite Data'!$B$2:$AQ$9,MATCH('Post-operative wound care'!G$4,'Composite Data'!$A$2:$A$10,0),FALSE)","v":23},3.5543192705918716E-3,{"$f":"HLOOKUP($C26,'Composite Data'!$B$2:$AQ$9,MATCH('Post-operative wound care'!I$4,'Composite Data'!$A$2:$A$10,0),FALSE)","v":0},0,{"$f":"HLOOKUP($C26,'Composite Data'!$B$2:$AQ$9,MATCH('Post-operative wound care'!K$4,'Composite Data'!$A$2:$A$10,0),FALSE)","v":0},0,{"$f":"HLOOKUP($C26,'Composite Data'!$B$2:$AQ$9,MATCH('Post-operative wound care'!L$4,'Composite Data'!$A$2:$A$10,0),FALSE)","v":2},0.13333333333333333,{"$f":"HLOOKUP($C26,'Composite Data'!$B$2:$AQ$9,MATCH('Post-operative wound care'!P$4,'Composite Data'!$A$2:$A$10,0),FALSE)","v":2},0.13333333333333333]
["RB-2","Forest Edge Practice","F86007",{"$f":"HLOOKUP($C27,'Composite Data'!$B$2:$AQ$9,MATCH('Post-operative wound care'!D$4,'Composite Data'!$A$2:$A$10,0),FALSE)","v":13665},{"$f":"HLOOKUP($C27,'Composite Data'!$B$2:$AQ$9,MATCH('Post-operative wound care'!E$4,'Composite Data'!$A$2:$A$10,0),FALSE)","v":165},1.2074643249176729E-2,{"$f":"HLOOKUP($C27,'Composite Data'!$B$2:$AQ$9,MATCH('Post-operative wound care'!G$4,'Composite Data'!$A$2:$A$10,0),FALSE)","v":419},3.0662275887303331E-2,{"$f":"HLOOKUP($C27,'Composite Data'!$B$2:$AQ$9,MATCH('Post-operative wound care'!I$4,'Composite Data'!$A$2:$A$10,0),FALSE)","v":1},6.0606060606060606E-3,{"$f":"HLOOKUP($C27,'Composite Data'!$B$2:$AQ$9,MATCH('Post-operative wound care'!K$4,'Composite Data'!$A$2:$A$10,0),FALSE)","v":1},6.0606060606060606E-3,{"$f":"HLOOKUP($C27,'Composite Data'!$B$2:$AQ$9,MATCH('Post-operative wound care'!L$4,'Composite Data'!$A$2:$A$10,0),FALSE)","v":4},2.4242424242424242E-2,{"$f":"HLOOKUP($C27,'Composite Data'!$B$2:$AQ$9,MATCH('Post-operative wound care'!P$4,'Composite Data'!$A$2:$A$10,0),FALSE)","v":155},0.93939393939393945]
["RB-3","The Palms Medical Centre","F86009",{"$f":"HLOOKUP($C28,'Composite Data'!$B$2:$AQ$9,MATCH('Post-operative wound care'!D$4,'Composite Data'!$A$2:$A$10,0),FALSE)","v":7561},{"$f":"HLOOKUP($C28,'Composite Data'!$B$2:$AQ$9,MATCH('Post-operative wound care'!E$4,'Composite Data'!$A$2:$A$10,0),FALSE)","v":39},5.1580478772649124E-3,{"$f":"HLOOKUP($C28,'Composite Data'!$B$2:$AQ$9,MATCH('Post-operative wound care'!G$4,'Composite Data'!$A$2:$A$10,0),FALSE)","v":51},6.7451395318079621E-3,{"$f":"HLOOKUP($C28,'Composite Data'!$B$2:$AQ$9,MATCH('Post-operative wound care'!I$4,'Composite Data'!$A$2:$A$10,0),FALSE)","v":1},2.564102564102564E-2,{"$f":"HLOOKUP($C28,'Composite Data'!$B$2:$AQ$9,MATCH('Post-operative wound care'!K$4,'Composite Data'!$A$2:$A$10,0),FALSE)","v":1},2.564102564102564E-2,{"$f":"HLOOKUP($C28,'Composite Data'!$B$2:$AQ$9,MATCH('Post-operative wound care'!L$4,'Composite Data'!$A$2:$A$10,0),FALSE)","v":3},7.6923076923076927E-2,{"$f":"HLOOKUP($C28,'Composite Data'!$B$2:$AQ$9,MATCH('Post-operative wound care'!P$4,'Composite Data'!$A$2:$A$10,0),FALSE)","v":0},0]
["RB-3","Goodmayes Medical Centre","F86087",{"$f":"HLOOKUP($C29,'Composite Data'!$B$2:$AQ$9,MATCH('Post-operative wound care'!D$4,'Composite Data'!$A$2:$A$10,0),FALSE)","v":7626},{"$f":"HLOOKUP($C29,'Composite Data'!$B$2:$AQ$9,MATCH('Post-operative wound care'!E$4,'Composite Data'!$A$2:$A$10,0),FALSE)","v":12},1.5735641227380016E-3,{"$f":"HLOOKUP($C29,'Composite Data'!$B$2:$AQ$9,MATCH('Post-operative wound care'!G$4,'Composite Data'!$A$2:$A$10,0),FALSE)","v":15},1.966955153422502E-3,{"$f":"HLOOKUP($C29,'Composite Data'!$B$2:$AQ$9,MATCH('Post-operative wound care'!I$4,'Composite Data'!$A$2:$A$10,0),FALSE)","v":0},0,{"$f":"HLOOKUP($C29,'Composite Data'!$B$2:$AQ$9,MATCH('Post-operative wound care'!K$4,'Composite Data'!$A$2:$A$10,0),FALSE)","v":0},0,{"$f":"HLOOKUP($C29,'Composite Data'!$B$2:$AQ$9,MATCH('Post-operative wound care'!L$4,'Composite Data'!$A$2:$A$10,0),FALSE)","v":2},0.16666666666666666,{"$f":"HLOOKUP($C29,'Composite Data'!$B$2:$AQ$9,MATCH('Post-operative wound care'!P$4,'Composite Data'!$A$2:$A$10,0),FALSE)","v":3},0.25]
["RB-3","Seven Kings Practice","F86637",{"$f":"HLOOKUP($C30,'Composite Data'!$B$2:$AQ$9,MATCH('Post-operative wound care'!D$4,'Composite Data'!$A$2:$A$10,0),FALSE)","v":4918},{"$f":"HLOOKUP($C30,'Composite Data'!$B$2:$AQ$9,MATCH('Post-operative wound care'!E$4,'Composite Data'!$A$2:$A$10,0),FALSE)","v":11},2.2366815778771857E-3,{"$f":"HLOOKUP($C30,'Composite Data'!$B$2:$AQ$9,MATCH('Post-operative wound care'!G$4,'Composite Data'!$A$2:$A$10,0),FALSE)","v":14},2.8466856445709637E-3,{"$f":"HLOOKUP($C30,'Composite Data'!$B$2:$AQ$9,MATCH('Post-operative wound care'!I$4,'Composite Data'!$A$2:$A$10,0),FALSE)","v":0},0,{"$f":"HLOOKUP($C30,'Composite Data'!$B$2:$AQ$9,MATCH('Post-operative wound care'!K$4,'Composite Data'!$A$2:$A$10,0),FALSE)","v":0},0,{"$f":"HLOOKUP($C30,'Composite Data'!$B$2:$AQ$9,MATCH('Post-operative wound care'!L$4,'Composite Data'!$A$2:$A$10,0),FALSE)","v":0},0,{"$f":"HLOOKUP($C30,'Composite Data'!$B$2:$AQ$9,MATCH('Post-operative wound care'!P$4,'Composite Data'!$A$2:$A$10,0),FALSE)","v":0},0]
["RB-3","Doctor's House","Y00090",{"$f":"HLOOKUP($C31,'Composite Data'!$B$2:$AQ$9,MATCH('Post-operative wound care'!D$4,'Composite Data'!$A$2:$A$10,0),FALSE)","v":8283},{"$f":"HLOOKUP($C31,'Composite Data'!$B$2:$AQ$9,MATCH('Post-operative wound care'!E$4,'Composite Data'!$A$2:$A$10,0),FALSE)","v":4},4.8291681757817216E-4,{"$f":"HLOOKUP($C31,'Composite Data'!$B$2:$AQ$9,MATCH('Post-operative wound care'!G$4,'Composite Data'!$A$2:$A$10,0),FALSE)","v":0},0,{"$f":"HLOOKUP($C31,'Composite Data'!$B$2:$AQ$9,MATCH('Post-operative wound care'!I$4,'Composite Data'!$A$2:$A$10,0),FALSE)","v":0},0,{"$f":"HLOOKUP($C31,'Composite Data'!$B$2:$AQ$9,MATCH('Post-operative wound care'!K$4,'Composite Data'!$A$2:$A$10,0),FALSE)","v":0},0,{"$f":"HLOOKUP($C31,'Composite Data'!$B$2:$AQ$9,MATCH('Post-operative wound care'!L$4,'Composite Data'!$A$2:$A$10,0),FALSE)","v":0},0,{"$f":"HLOOKUP($C31,'Composite Data'!$B$2:$AQ$9,MATCH('Post-operative wound care'!P$4,'Composite Data'!$A$2:$A$10,0),FALSE)","v":0},0]
["RB-3","Green Lane, Goodmayes Medical practice","F86034",{"$f":"HLOOKUP($C32,'Composite Data'!$B$2:$AQ$9,MATCH('Post-operative wound care'!D$4,'Composite Data'!$A$2:$A$10,0),FALSE)","v":6154},{"$f":"HLOOKUP($C32,'Composite Data'!$B$2:$AQ$9,MATCH('Post-operative wound care'!E$4,'Composite Data'!$A$2:$A$10,0),FALSE)","v":0},0,{"$f":"HLOOKUP($C32,'Composite Data'!$B$2:$AQ$9,MATCH('Post-operative wound care'!G$4,'Composite Data'!$A$2:$A$10,0),FALSE)","v":0},0,{"$f":"HLOOKUP($C32,'Composite Data'!$B$2:$AQ$9,MATCH('Post-operative wound care'!I$4,'Composite Data'!$A$2:$A$10,0),FALSE)","v":0},0,{"$f":"HLOOKUP($C32,'Composite Data'!$B$2:$AQ$9,MATCH('Post-operative wound care'!K$4,'Composite Data'!$A$2:$A$10,0),FALSE)","v":0},"0.0%",{"$f":"HLOOKUP($C32,'Composite Data'!$B$2:$AQ$9,MATCH('Post-operative wound care'!L$4,'Composite Data'!$A$2:$A$10,0),FALSE)","v":0},0,{"$f":"HLOOKUP($C32,'Composite Data'!$B$2:$AQ$9,MATCH('Post-operative wound care'!P$4,'Composite Data'!$A$2:$A$10,0),FALSE)","v":0},0]
["RB-3","Castleton Road Surgery","F86642",{"$f":"HLOOKUP($C33,'Composite Data'!$B$2:$AQ$9,MATCH('Post-operative wound care'!D$4,'Composite Data'!$A$2:$A$10,0),FALSE)","v":5086},{"$f":"HLOOKUP($C33,'Composite Data'!$B$2:$AQ$9,MATCH('Post-operative wound care'!E$4,'Composite Data'!$A$2:$A$10,0),FALSE)","v":4},7.8647267007471487E-4,{"$f":"HLOOKUP($C33,'Composite Data'!$B$2:$AQ$9,MATCH('Post-operative wound care'!G$4,'Composite Data'!$A$2:$A$10,0),FALSE)","v":4},7.8647267007471487E-4,{"$f":"HLOOKUP($C33,'Composite Data'!$B$2:$AQ$9,MATCH('Post-operative wound care'!I$4,'Composite Data'!$A$2:$A$10,0),FALSE)","v":0},0,{"$f":"HLOOKUP($C33,'Composite Data'!$B$2:$AQ$9,MATCH('Post-operative wound care'!K$4,'Composite Data'!$A$2:$A$10,0),FALSE)","v":0},0,{"$f":"HLOOKUP($C33,'Composite Data'!$B$2:$AQ$9,MATCH('Post-operative wound care'!L$4,'Composite Data'!$A$2:$A$10,0),FALSE)","v":1},0.25,{"$f":"HLOOKUP($C33,'Composite Data'!$B$2:$AQ$9,MATCH('Post-operative wound care'!P$4,'Composite Data'!$A$2:$A$10,0),FALSE)","v":0},0]
["RB-3","Chadwell Heath Surgery","F86028",{"$f":"HLOOKUP($C34,'Composite Data'!$B$2:$AQ$9,MATCH('Post-operative wound care'!D$4,'Composite Data'!$A$2:$A$10,0),FALSE)","v":10674},{"$f":"HLOOKUP($C34,'Composite Data'!$B$2:$AQ$9,MATCH('Post-operative wound care'!E$4,'Composite Data'!$A$2:$A$10,0),FALSE)","v":71},6.6516769720816942E-3,{"$f":"HLOOKUP($C34,'Composite Data'!$B$2:$AQ$9,MATCH('Post-operative wound care'!G$4,'Composite Data'!$A$2:$A$10,0),FALSE)","v":163},1.5270751358441071E-2,{"$f":"HLOOKUP($C34,'Composite Data'!$B$2:$AQ$9,MATCH('Post-operative wound care'!I$4,'Composite Data'!$A$2:$A$10,0),FALSE)","v":0},0,{"$f":"HLOOKUP($C34,'Composite Data'!$B$2:$AQ$9,MATCH('Post-operative wound care'!K$4,'Composite Data'!$A$2:$A$10,0),FALSE)","v":1},1.4084507042253521E-2,{"$f":"HLOOKUP($C34,'Composite Data'!$B$2:$AQ$9,MATCH('Post-operative wound care'!L$4,'Composite Data'!$A$2:$A$10,0),FALSE)","v":3},4.2253521126760563E-2,{"$f":"HLOOKUP($C34,'Composite Data'!$B$2:$AQ$9,MATCH('Post-operative wound care'!P$4,'Composite Data'!$A$2:$A$10,0),FALSE)","v":32},0.45070422535211269]
["RB-3","Grove Surgery","Y00155",{"$f":"HLOOKUP($C35,'Composite Data'!$B$2:$AQ$9,MATCH('Post-operative wound care'!D$4,'Composite Data'!$A$2:$A$10,0),FALSE)","v":"10075"},{"$f":"HLOOKUP($C35,'Composite Data'!$B$2:$AQ$9,MATCH('Post-operative wound care'!E$4,'Composite Data'!$A$2:$A$10,0),FALSE)","v":"1"},9.9255583126550868E-5,0,0,0,0,{"$f":"HLOOKUP($C35,'Composite Data'!$B$2:$AQ$9,MATCH('Post-operative wound care'!K$4,'Composite Data'!$A$2:$A$10,0),FALSE)","v":0},0,{"$f":"HLOOKUP($C35,'Composite Data'!$B$2:$AQ$9,MATCH('Post-operative wound care'!L$4,'Composite Data'!$A$2:$A$10,0),FALSE)","v":"1"},1,{"$f":"HLOOKUP($C35,'Composite Data'!$B$2:$AQ$9,MATCH('Post-operative wound care'!P$4,'Composite Data'!$A$2:$A$10,0),FALSE)","v":0},0]
["RB-4","Broadway Surgery","F86013",{"$f":"HLOOKUP($C36,'Composite Data'!$B$2:$AQ$9,MATCH('Post-operative wound care'!D$4,'Composite Data'!$A$2:$A$10,0),FALSE)","v":"7149"},{"$f":"HLOOKUP($C36,'Composite Data'!$B$2:$AQ$9,MATCH('Post-operative wound care'!E$4,'Composite Data'!$A$2:$A$10,0),FALSE)","v":"27"},3.7767519932857744E-3,0,0,0,0,{"$f":"HLOOKUP($C36,'Composite Data'!$B$2:$AQ$9,MATCH('Post-operative wound care'!K$4,'Composite Data'!$A$2:$A$10,0),FALSE)","v":"1"},3.7037037037037035E-2,{"$f":"HLOOKUP($C36,'Composite Data'!$B$2:$AQ$9,MATCH('Post-operative wound care'!L$4,'Composite Data'!$A$2:$A$10,0),FALSE)","v":"2"},7.407407407407407E-2,{"$f":"HLOOKUP($C36,'Composite Data'!$B$2:$AQ$9,MATCH('Post-operative wound care'!P$4,'Composite Data'!$A$2:$A$10,0),FALSE)","v":"1"},3.7037037037037035E-2]
["RB-4","The Evergreen Practice","F86023",{"$f":"HLOOKUP($C37,'Composite Data'!$B$2:$AQ$9,MATCH('Post-operative wound care'!D$4,'Composite Data'!$A$2:$A$10,0),FALSE)","v":9894},{"$f":"HLOOKUP($C37,'Composite Data'!$B$2:$AQ$9,MATCH('Post-operative wound care'!E$4,'Composite Data'!$A$2:$A$10,0),FALSE)","v":86},8.6921366484738229E-3,{"$f":"HLOOKUP($C37,'Composite Data'!$B$2:$AQ$9,MATCH('Post-operative wound care'!G$4,'Composite Data'!$A$2:$A$10,0),FALSE)","v":168},1.6979987871437233E-2,{"$f":"HLOOKUP($C37,'Composite Data'!$B$2:$AQ$9,MATCH('Post-operative wound care'!I$4,'Composite Data'!$A$2:$A$10,0),FALSE)","v":0},0,{"$f":"HLOOKUP($C37,'Composite Data'!$B$2:$AQ$9,MATCH('Post-operative wound care'!K$4,'Composite Data'!$A$2:$A$10,0),FALSE)","v":1},1.1627906976744186E-2,{"$f":"HLOOKUP($C37,'Composite Data'!$B$2:$AQ$9,MATCH('Post-operative wound care'!L$4,'Composite Data'!$A$2:$A$10,0),FALSE)","v":6},6.9767441860465115E-2,{"$f":"HLOOKUP($C37,'Composite Data'!$B$2:$AQ$9,MATCH('Post-operative wound care'!P$4,'Composite Data'!$A$2:$A$10,0),FALSE)","v":60},0.69767441860465118]
["RB-4","Wanstead Place Surgery","F86032",{"$f":"HLOOKUP($C38,'Composite Data'!$B$2:$AQ$9,MATCH('Post-operative wound care'!D$4,'Composite Data'!$A$2:$A$10,0),FALSE)","v":9305},{"$f":"HLOOKUP($C38,'Composite Data'!$B$2:$AQ$9,MATCH('Post-operative wound care'!E$4,'Composite Data'!$A$2:$A$10,0),FALSE)","v":54},5.8033315421816226E-3,{"$f":"HLOOKUP($C38,'Composite Data'!$B$2:$AQ$9,MATCH('Post-operative wound care'!G$4,'Composite Data'!$A$2:$A$10,0),FALSE)","v":144},1.5475550779150995E-2,{"$f":"HLOOKUP($C38,'Composite Data'!$B$2:$AQ$9,MATCH('Post-operative wound care'!I$4,'Composite Data'!$A$2:$A$10,0),FALSE)","v":0},0,{"$f":"HLOOKUP($C38,'Composite Data'!$B$2:$AQ$9,MATCH('Post-operative wound care'!K$4,'Composite Data'!$A$2:$A$10,0),FALSE)","v":3},5.5555555555555552E-2,{"$f":"HLOOKUP($C38,'Composite Data'!$B$2:$AQ$9,MATCH('Post-operative wound care'!L$4,'Composite Data'!$A$2:$A$10,0),FALSE)","v":3},5.5555555555555552E-2,{"$f":"HLOOKUP($C38,'Composite Data'!$B$2:$AQ$9,MATCH('Post-operative wound care'!P$4,'Composite Data'!$A$2:$A$10,0),FALSE)","v":19},0.35185185185185186]
["RB-4","Aldersbrook Medical Centre","F86731",{"$f":"HLOOKUP($C39,'Composite Data'!$B$2:$AQ$9,MATCH('Post-operative wound care'!D$4,'Composite Data'!$A$2:$A$10,0),FALSE)","v":4627},{"$f":"HLOOKUP($C39,'Composite Data'!$B$2:$AQ$9,MATCH('Post-operative wound care'!E$4,'Composite Data'!$A$2:$A$10,0),FALSE)","v":18},3.8902096390749947E-3,{"$f":"HLOOKUP($C39,'Composite Data'!$B$2:$AQ$9,MATCH('Post-operative wound care'!G$4,'Composite Data'!$A$2:$A$10,0),FALSE)","v":0},0,{"$f":"HLOOKUP($C39,'Composite Data'!$B$2:$AQ$9,MATCH('Post-operative wound care'!I$4,'Composite Data'!$A$2:$A$10,0),FALSE)","v":0},0,{"$f":"HLOOKUP($C39,'Composite Data'!$B$2:$AQ$9,MATCH('Post-operative wound care'!K$4,'Composite Data'!$A$2:$A$10,0),FALSE)","v":0},0,{"$f":"HLOOKUP($C39,'Composite Data'!$B$2:$AQ$9,MATCH('Post-operative wound care'!L$4,'Composite Data'!$A$2:$A$10,0),FALSE)","v":2},0.1111111111111111,{"$f":"HLOOKUP($C39,'Composite Data'!$B$2:$AQ$9,MATCH('Post-operative wound care'!P$4,'Composite Data'!$A$2:$A$10,0),FALSE)","v":0},0]
["RB-4","Southdene Surgery","F86066",{"$f":"HLOOKUP($C40,'Composite Data'!$B$2:$AQ$9,MATCH('Post-operative wound care'!D$4,'Composite Data'!$A$2:$A$10,0),FALSE)","v":7890},{"$f":"HLOOKUP($C40,'Composite Data'!$B$2:$AQ$9,MATCH('Post-operative wound care'!E$4,'Composite Data'!$A$2:$A$10,0),FALSE)","v":93},1.1787072243346007E-2,{"$f":"HLOOKUP($C40,'Composite Data'!$B$2:$AQ$9,MATCH('Post-operative wound care'!G$4,'Composite Data'!$A$2:$A$10,0),FALSE)","v":175},2.2179974651457542E-2,{"$f":"HLOOKUP($C40,'Composite Data'!$B$2:$AQ$9,MATCH('Post-operative wound care'!I$4,'Composite Data'!$A$2:$A$10,0),FALSE)","v":2},2.1505376344086023E-2,{"$f":"HLOOKUP($C40,'Composite Data'!$B$2:$AQ$9,MATCH('Post-operative wound care'!K$4,'Composite Data'!$A$2:$A$10,0),FALSE)","v":6},6.4516129032258063E-2,{"$f":"HLOOKUP($C40,'Composite Data'!$B$2:$AQ$9,MATCH('Post-operative wound care'!L$4,'Composite Data'!$A$2:$A$10,0),FALSE)","v":13},0.13978494623655913,{"$f":"HLOOKUP($C40,'Composite Data'!$B$2:$AQ$9,MATCH('Post-operative wound care'!P$4,'Composite Data'!$A$2:$A$10,0),FALSE)","v":16},0.17204301075268819]
["RB-4","Shrubberies Medical Centre","F86641",{"$f":"HLOOKUP($C41,'Composite Data'!$B$2:$AQ$9,MATCH('Post-operative wound care'!D$4,'Composite Data'!$A$2:$A$10,0),FALSE)","v":7920},{"$f":"HLOOKUP($C41,'Composite Data'!$B$2:$AQ$9,MATCH('Post-operative wound care'!E$4,'Composite Data'!$A$2:$A$10,0),FALSE)","v":20},2.5252525252525255E-3,{"$f":"HLOOKUP($C41,'Composite Data'!$B$2:$AQ$9,MATCH('Post-operative wound care'!G$4,'Composite Data'!$A$2:$A$10,0),FALSE)","v":30},3.787878787878788E-3,{"$f":"HLOOKUP($C41,'Composite Data'!$B$2:$AQ$9,MATCH('Post-operative wound care'!I$4,'Composite Data'!$A$2:$A$10,0),FALSE)","v":0},0,{"$f":"HLOOKUP($C41,'Composite Data'!$B$2:$AQ$9,MATCH('Post-operative wound care'!K$4,'Composite Data'!$A$2:$A$10,0),FALSE)","v":0},0,{"$f":"HLOOKUP($C41,'Composite Data'!$B$2:$AQ$9,MATCH('Post-operative wound care'!L$4,'Composite Data'!$A$2:$A$10,0),FALSE)","v":1},0.05,{"$f":"HLOOKUP($C41,'Composite Data'!$B$2:$AQ$9,MATCH('Post-operative wound care'!P$4,'Composite Data'!$A$2:$A$10,0),FALSE)","v":7},0.35]
["RB-4","Glebelands Practice","F86020",{"$f":"HLOOKUP($C42,'Composite Data'!$B$2:$AQ$9,MATCH('Post-operative wound care'!D$4,'Composite Data'!$A$2:$A$10,0),FALSE)","v":5826},{"$f":"HLOOKUP($C42,'Composite Data'!$B$2:$AQ$9,MATCH('Post-operative wound care'!E$4,'Composite Data'!$A$2:$A$10,0),FALSE)","v":20},3.4328870580157913E-3,{"$f":"HLOOKUP($C42,'Composite Data'!$B$2:$AQ$9,MATCH('Post-operative wound care'!G$4,'Composite Data'!$A$2:$A$10,0),FALSE)","v":24},4.1194644696189494E-3,{"$f":"HLOOKUP($C42,'Composite Data'!$B$2:$AQ$9,MATCH('Post-operative wound care'!I$4,'Composite Data'!$A$2:$A$10,0),FALSE)","v":0},0,{"$f":"HLOOKUP($C42,'Composite Data'!$B$2:$AQ$9,MATCH('Post-operative wound care'!K$4,'Composite Data'!$A$2:$A$10,0),FALSE)","v":1},0.05,{"$f":"HLOOKUP($C42,'Composite Data'!$B$2:$AQ$9,MATCH('Post-operative wound care'!L$4,'Composite Data'!$A$2:$A$10,0),FALSE)","v":3},0.15,{"$f":"HLOOKUP($C42,'Composite Data'!$B$2:$AQ$9,MATCH('Post-operative wound care'!P$4,'Composite Data'!$A$2:$A$10,0),FALSE)","v":17},0.85]
["RB-4","Elmhurst Practice","F86064",{"$f":"HLOOKUP($C43,'Composite Data'!$B$2:$AQ$9,MATCH('Post-operative wound care'!D$4,'Composite Data'!$A$2:$A$10,0),FALSE)","v":4778},{"$f":"HLOOKUP($C43,'Composite Data'!$B$2:$AQ$9,MATCH('Post-operative wound care'!E$4,'Composite Data'!$A$2:$A$10,0),FALSE)","v":27},5.650899958141482E-3,{"$f":"HLOOKUP($C43,'Composite Data'!$B$2:$AQ$9,MATCH('Post-operative wound care'!G$4,'Composite Data'!$A$2:$A$10,0),FALSE)","v":31},6.48807032231059E-3,{"$f":"HLOOKUP($C43,'Composite Data'!$B$2:$AQ$9,MATCH('Post-operative wound care'!I$4,'Composite Data'!$A$2:$A$10,0),FALSE)","v":0},0,{"$f":"HLOOKUP($C43,'Composite Data'!$B$2:$AQ$9,MATCH('Post-operative wound care'!K$4,'Composite Data'!$A$2:$A$10,0),FALSE)","v":0},0,{"$f":"HLOOKUP($C43,'Composite Data'!$B$2:$AQ$9,MATCH('Post-operative wound care'!L$4,'Composite Data'!$A$2:$A$10,0),FALSE)","v":0},0,{"$f":"HLOOKUP($C43,'Composite Data'!$B$2:$AQ$9,MATCH('Post-operative wound care'!P$4,'Composite Data'!$A$2:$A$10,0),FALSE)","v":2},7.407407407407407E-2]
["RB-4","Clayhall Clinic","F86691",{"$f":"HLOOKUP($C44,'Composite Data'!$B$2:$AQ$9,MATCH('Post-operative wound care'!D$4,'Composite Data'!$A$2:$A$10,0),FALSE)","v":10967},{"$f":"HLOOKUP($C44,'Composite Data'!$B$2:$AQ$9,MATCH('Post-operative wound care'!E$4,'Composite Data'!$A$2:$A$10,0),FALSE)","v":42},3.8296708306738399E-3,{"$f":"HLOOKUP($C44,'Composite Data'!$B$2:$AQ$9,MATCH('Post-operative wound care'!G$4,'Composite Data'!$A$2:$A$10,0),FALSE)","v":91},8.2976201331266524E-3,{"$f":"HLOOKUP($C44,'Composite Data'!$B$2:$AQ$9,MATCH('Post-operative wound care'!I$4,'Composite Data'!$A$2:$A$10,0),FALSE)","v":0},0,{"$f":"HLOOKUP($C44,'Composite Data'!$B$2:$AQ$9,MATCH('Post-operative wound care'!K$4,'Composite Data'!$A$2:$A$10,0),FALSE)","v":0},0,{"$f":"HLOOKUP($C44,'Composite Data'!$B$2:$AQ$9,MATCH('Post-operative wound care'!L$4,'Composite Data'!$A$2:$A$10,0),FALSE)","v":5},0.11904761904761904,{"$f":"HLOOKUP($C44,'Composite Data'!$B$2:$AQ$9,MATCH('Post-operative wound care'!P$4,'Composite Data'!$A$2:$A$10,0),FALSE)","v":0},0]
["RB-4","Rydal Practice","F86012",{"$f":"HLOOKUP($C45,'Composite Data'!$B$2:$AQ$9,MATCH('Post-operative wound care'!D$4,'Composite Data'!$A$2:$A$10,0),FALSE)","v":9522},{"$f":"HLOOKUP($C45,'Composite Data'!$B$2:$AQ$9,MATCH('Post-operative wound care'!E$4,'Composite Data'!$A$2:$A$10,0),FALSE)","v":33},3.4656584751102709E-3,{"$f":"HLOOKUP($C45,'Composite Data'!$B$2:$AQ$9,MATCH('Post-operative wound care'!G$4,'Composite Data'!$A$2:$A$10,0),FALSE)","v":37},3.8857382902751521E-3,{"$f":"HLOOKUP($C45,'Composite Data'!$B$2:$AQ$9,MATCH('Post-operative wound care'!I$4,'Composite Data'!$A$2:$A$10,0),FALSE)","v":1},3.0303030303030304E-2,{"$f":"HLOOKUP($C45,'Composite Data'!$B$2:$AQ$9,MATCH('Post-operative wound care'!K$4,'Composite Data'!$A$2:$A$10,0),FALSE)","v":0},0,{"$f":"HLOOKUP($C45,'Composite Data'!$B$2:$AQ$9,MATCH('Post-operative wound care'!L$4,'Composite Data'!$A$2:$A$10,0),FALSE)","v":2},6.0606060606060608E-2,{"$f":"HLOOKUP($C45,'Composite Data'!$B$2:$AQ$9,MATCH('Post-operative wound care'!P$4,'Composite Data'!$A$2:$A$10,0),FALSE)","v":0},0]
["RB-4","Queen Mary Practice","F86658",{"$f":"HLOOKUP($C46,'Composite Data'!$B$2:$AQ$9,MATCH('Post-operative wound care'!D$4,'Composite Data'!$A$2:$A$10,0),FALSE)","v":5508},{"$f":"HLOOKUP($C46,'Composite Data'!$B$2:$AQ$9,MATCH('Post-operative wound care'!E$4,'Composite Data'!$A$2:$A$10,0),FALSE)","v":5},9.0777051561365292E-4,{"$f":"HLOOKUP($C46,'Composite Data'!$B$2:$AQ$9,MATCH('Post-operative wound care'!G$4,'Composite Data'!$A$2:$A$10,0),FALSE)","v":6},1.0893246187363835E-3,{"$f":"HLOOKUP($C46,'Composite Data'!$B$2:$AQ$9,MATCH('Post-operative wound care'!I$4,'Composite Data'!$A$2:$A$10,0),FALSE)","v":0},0,{"$f":"HLOOKUP($C46,'Composite Data'!$B$2:$AQ$9,MATCH('Post-operative wound care'!K$4,'Composite Data'!$A$2:$A$10,0),FALSE)","v":1},0.2,{"$f":"HLOOKUP($C46,'Composite Data'!$B$2:$AQ$9,MATCH('Post-operative wound care'!L$4,'Composite Data'!$A$2:$A$10,0),FALSE)","v":1},0.2,{"$f":"HLOOKUP($C46,'Composite Data'!$B$2:$AQ$9,MATCH('Post-operative wound care'!P$4,'Composite Data'!$A$2:$A$10,0),FALSE)","v":1},0.2]
["RB-5","Ilford Medical Centre","F86022",{"$f":"HLOOKUP($C47,'Composite Data'!$B$2:$AQ$9,MATCH('Post-operative wound care'!D$4,'Composite Data'!$A$2:$A$10,0),FALSE)","v":14533},{"$f":"HLOOKUP($C47,'Composite Data'!$B$2:$AQ$9,MATCH('Post-operative wound care'!E$4,'Composite Data'!$A$2:$A$10,0),FALSE)","v":6},4.1285350581435354E-4,{"$f":"HLOOKUP($C47,'Composite Data'!$B$2:$AQ$9,MATCH('Post-operative wound care'!G$4,'Composite Data'!$A$2:$A$10,0),FALSE)","v":10},6.8808917635725586E-4,{"$f":"HLOOKUP($C47,'Composite Data'!$B$2:$AQ$9,MATCH('Post-operative wound care'!I$4,'Composite Data'!$A$2:$A$10,0),FALSE)","v":0},0,{"$f":"HLOOKUP($C47,'Composite Data'!$B$2:$AQ$9,MATCH('Post-operative wound care'!K$4,'Composite Data'!$A$2:$A$10,0),FALSE)","v":0},0,{"$f":"HLOOKUP($C47,'Composite Data'!$B$2:$AQ$9,MATCH('Post-operative wound care'!L$4,'Composite Data'!$A$2:$A$10,0),FALSE)","v":0},0,{"$f":"HLOOKUP($C47,'Composite Data'!$B$2:$AQ$9,MATCH('Post-operative wound care'!P$4,'Composite Data'!$A$2:$A$10,0),FALSE)","v":2},0.33333333333333331]
["RB-5","The Practice Loxford","Y02987",{"$f":"HLOOKUP($C48,'Composite Data'!$B$2:$AQ$9,MATCH('Post-operative wound care'!D$4,'Composite Data'!$A$2:$A$10,0),FALSE)","v":29551},{"$f":"HLOOKUP($C48,'Composite Data'!$B$2:$AQ$9,MATCH('Post-operative wound care'!E$4,'Composite Data'!$A$2:$A$10,0),FALSE)","v":120},4.060776285066495E-3,{"$f":"HLOOKUP($C48,'Composite Data'!$B$2:$AQ$9,MATCH('Post-operative wound care'!G$4,'Composite Data'!$A$2:$A$10,0),FALSE)","v":0},0,{"$f":"HLOOKUP($C48,'Composite Data'!$B$2:$AQ$9,MATCH('Post-operative wound care'!I$4,'Composite Data'!$A$2:$A$10,0),FALSE)","v":4},3.3333333333333333E-2,{"$f":"HLOOKUP($C48,'Composite Data'!$B$2:$AQ$9,MATCH('Post-operative wound care'!K$4,'Composite Data'!$A$2:$A$10,0),FALSE)","v":6},0.05,{"$f":"HLOOKUP($C48,'Composite Data'!$B$2:$AQ$9,MATCH('Post-operative wound care'!L$4,'Composite Data'!$A$2:$A$10,0),FALSE)","v":10},8.3333333333333329E-2,{"$f":"HLOOKUP($C48,'Composite Data'!$B$2:$AQ$9,MATCH('Post-operative wound care'!P$4,'Composite Data'!$A$2:$A$10,0),FALSE)","v":75},0.625]
["RB-5","Mathukias Surgery","F86692",{"$f":"HLOOKUP($C49,'Composite Data'!$B$2:$AQ$9,MATCH('Post-operative wound care'!D$4,'Composite Data'!$A$2:$A$10,0),FALSE)","v":10879},{"$f":"HLOOKUP($C49,'Composite Data'!$B$2:$AQ$9,MATCH('Post-operative wound care'!E$4,'Composite Data'!$A$2:$A$10,0),FALSE)","v":6},5.5152127952936853E-4,{"$f":"HLOOKUP($C49,'Composite Data'!$B$2:$AQ$9,MATCH('Post-operative wound care'!G$4,'Composite Data'!$A$2:$A$10,0),FALSE)","v":9},8.272819192940528E-4,{"$f":"HLOOKUP($C49,'Composite Data'!$B$2:$AQ$9,MATCH('Post-operative wound care'!I$4,'Composite Data'!$A$2:$A$10,0),FALSE)","v":0},0,{"$f":"HLOOKUP($C49,'Composite Data'!$B$2:$AQ$9,MATCH('Post-operative wound care'!K$4,'Composite Data'!$A$2:$A$10,0),FALSE)","v":0},0,{"$f":"HLOOKUP($C49,'Composite Data'!$B$2:$AQ$9,MATCH('Post-operative wound care'!L$4,'Composite Data'!$A$2:$A$10,0),FALSE)","v":1},0.16666666666666666,{"$f":"HLOOKUP($C49,'Composite Data'!$B$2:$AQ$9,MATCH('Post-operative wound care'!P$4,'Composite Data'!$A$2:$A$10,0),FALSE)","v":0},0]
["RB-5","Ilford Lane Surgery","F86082",{"$f":"HLOOKUP($C50,'Composite Data'!$B$2:$AQ$9,MATCH('Post-operative wound care'!D$4,'Composite Data'!$A$2:$A$10,0),FALSE)","v":"6052"},{"$f":"HLOOKUP($C50,'Composite Data'!$B$2:$AQ$9,MATCH('Post-operative wound care'!E$4,'Composite Data'!$A$2:$A$10,0),FALSE)","v":"21"},3.4699272967614013E-3,0,0,0,0,{"$f":"HLOOKUP($C50,'Composite Data'!$B$2:$AQ$9,MATCH('Post-operative wound care'!K$4,'Composite Data'!$A$2:$A$10,0),FALSE)","v":0},0,{"$f":"HLOOKUP($C50,'Composite Data'!$B$2:$AQ$9,MATCH('Post-operative wound care'!L$4,'Composite Data'!$A$2:$A$10,0),FALSE)","v":0},0,{"$f":"HLOOKUP($C50,'Composite Data'!$B$2:$AQ$9,MATCH('Post-operative wound care'!P$4,'Composite Data'!$A$2:$A$10,0),FALSE)","v":"21"},1]
["RB-5","Oak Tree Medical Practice","F86025",{"$f":"HLOOKUP($C51,'Composite Data'!$B$2:$AQ$9,MATCH('Post-operative wound care'!D$4,'Composite Data'!$A$2:$A$10,0),FALSE)","v":"17510"},{"$f":"HLOOKUP($C51,'Composite Data'!$B$2:$AQ$9,MATCH('Post-operative wound care'!E$4,'Composite Data'!$A$2:$A$10,0),FALSE)","v":"90"},5.1399200456881781E-3,0,0,0,0,{"$f":"HLOOKUP($C51,'Composite Data'!$B$2:$AQ$9,MATCH('Post-operative wound care'!K$4,'Composite Data'!$A$2:$A$10,0),FALSE)","v":"4"},4.4444444444444446E-2,{"$f":"HLOOKUP($C51,'Composite Data'!$B$2:$AQ$9,MATCH('Post-operative wound care'!L$4,'Composite Data'!$A$2:$A$10,0),FALSE)","v":"4"},4.4444444444444446E-2,{"$f":"HLOOKUP($C51,'Composite Data'!$B$2:$AQ$9,MATCH('Post-operative wound care'!P$4,'Composite Data'!$A$2:$A$10,0),FALSE)","v":"89"},0.98888888888888893]
["RB-6","Hainault Surgery","F86085",{"$f":"HLOOKUP($C52,'Composite Data'!$B$2:$AQ$9,MATCH('Post-operative wound care'!D$4,'Composite Data'!$A$2:$A$10,0),FALSE)","v":3500},{"$f":"HLOOKUP($C52,'Composite Data'!$B$2:$AQ$9,MATCH('Post-operative wound care'!E$4,'Composite Data'!$A$2:$A$10,0),FALSE)","v":7},2E-3,{"$f":"HLOOKUP($C52,'Composite Data'!$B$2:$AQ$9,MATCH('Post-operative wound care'!G$4,'Composite Data'!$A$2:$A$10,0),FALSE)","v":12},3.4285714285714284E-3,{"$f":"HLOOKUP($C52,'Composite Data'!$B$2:$AQ$9,MATCH('Post-operative wound care'!I$4,'Composite Data'!$A$2:$A$10,0),FALSE)","v":0},0,{"$f":"HLOOKUP($C52,'Composite Data'!$B$2:$AQ$9,MATCH('Post-operative wound care'!K$4,'Composite Data'!$A$2:$A$10,0),FALSE)","v":0},0,{"$f":"HLOOKUP($C52,'Composite Data'!$B$2:$AQ$9,MATCH('Post-operative wound care'!L$4,'Composite Data'!$A$2:$A$10,0),FALSE)","v":2},0.2857142857142857,{"$f":"HLOOKUP($C52,'Composite Data'!$B$2:$AQ$9,MATCH('Post-operative wound care'!P$4,'Composite Data'!$A$2:$A$10,0),FALSE)","v":0},0]
["RB-6","Fullwell Cross Medical Centre","F86010",{"$f":"HLOOKUP($C53,'Composite Data'!$B$2:$AQ$9,MATCH('Post-operative wound care'!D$4,'Composite Data'!$A$2:$A$10,0),FALSE)","v":15563},{"$f":"HLOOKUP($C53,'Composite Data'!$B$2:$AQ$9,MATCH('Post-operative wound care'!E$4,'Composite Data'!$A$2:$A$10,0),FALSE)","v":50},3.2127481847972757E-3,{"$f":"HLOOKUP($C53,'Composite Data'!$B$2:$AQ$9,MATCH('Post-operative wound care'!G$4,'Composite Data'!$A$2:$A$10,0),FALSE)","v":52},3.3412581121891665E-3,{"$f":"HLOOKUP($C53,'Composite Data'!$B$2:$AQ$9,MATCH('Post-operative wound care'!I$4,'Composite Data'!$A$2:$A$10,0),FALSE)","v":0},0,{"$f":"HLOOKUP($C53,'Composite Data'!$B$2:$AQ$9,MATCH('Post-operative wound care'!K$4,'Composite Data'!$A$2:$A$10,0),FALSE)","v":0},0,{"$f":"HLOOKUP($C53,'Composite Data'!$B$2:$AQ$9,MATCH('Post-operative wound care'!L$4,'Composite Data'!$A$2:$A$10,0),FALSE)","v":1},0.02,{"$f":"HLOOKUP($C53,'Composite Data'!$B$2:$AQ$9,MATCH('Post-operative wound care'!P$4,'Composite Data'!$A$2:$A$10,0),FALSE)","v":1},0.02]
["RB-6","Newbury Group Practice","F86060",{"$f":"HLOOKUP($C54,'Composite Data'!$B$2:$AQ$9,MATCH('Post-operative wound care'!D$4,'Composite Data'!$A$2:$A$10,0),FALSE)","v":15710},{"$f":"HLOOKUP($C54,'Composite Data'!$B$2:$AQ$9,MATCH('Post-operative wound care'!E$4,'Composite Data'!$A$2:$A$10,0),FALSE)","v":9},5.7288351368555064E-4,{"$f":"HLOOKUP($C54,'Composite Data'!$B$2:$AQ$9,MATCH('Post-operative wound care'!G$4,'Composite Data'!$A$2:$A$10,0),FALSE)","v":10},6.3653723742838951E-4,{"$f":"HLOOKUP($C54,'Composite Data'!$B$2:$AQ$9,MATCH('Post-operative wound care'!I$4,'Composite Data'!$A$2:$A$10,0),FALSE)","v":0},0,{"$f":"HLOOKUP($C54,'Composite Data'!$B$2:$AQ$9,MATCH('Post-operative wound care'!K$4,'Composite Data'!$A$2:$A$10,0),FALSE)","v":0},0,{"$f":"HLOOKUP($C54,'Composite Data'!$B$2:$AQ$9,MATCH('Post-operative wound care'!L$4,'Composite Data'!$A$2:$A$10,0),FALSE)","v":1},0.1111111111111111,{"$f":"HLOOKUP($C54,'Composite Data'!$B$2:$AQ$9,MATCH('Post-operative wound care'!P$4,'Composite Data'!$A$2:$A$10,0),FALSE)","v":1},0.1111111111111111]

{"sheet":"Composite Data","index":1,"n_rows":9,"n_cols":43,"rows_kept":9,"cut":false,"hidden":false,"merged":[]}
[null,{"$f":"MATCH(B2,'Control Panel'!$A$12:$A$53,0)","v":39},{"$f":"MATCH(C2,'Control Panel'!$A$12:$A$53,0)","v":38},{"$f":"MATCH(D2,'Control Panel'!$A$12:$A$53,0)","v":8},{"$f":"MATCH(E2,'Control Panel'!$A$12:$A$53,0)","v":15},{"$f":"MATCH(F2,'Control Panel'!$A$12:$A$53,0)","v":14},{"$f":"MATCH(G2,'Control Panel'!$A$12:$A$53,0)","v":23},{"$f":"MATCH(H2,'Control Panel'!$A$12:$A$53,0)","v":24},{"$f":"MATCH(I2,'Control Panel'!$A$12:$A$53,0)","v":34},{"$f":"MATCH(J2,'Control Panel'!$A$12:$A$53,0)","v":36},{"$f":"MATCH(K2,'Control Panel'!$A$12:$A$53,0)","v":3},{"$f":"MATCH(L2,'Control Panel'!$A$12:$A$53,0)","v":19},{"$f":"MATCH(M2,'Control Panel'!$A$12:$A$53,0)","v":27},{"$f":"MATCH(N2,'Control Panel'!$A$12:$A$53,0)","v":13},{"$f":"MATCH(O2,'Control Panel'!$A$12:$A$53,0)","v":7},{"$f":"MATCH(P2,'Control Panel'!$A$12:$A$53,0)","v":2},{"$f":"MATCH(Q2,'Control Panel'!$A$12:$A$53,0)","v":5},{"$f":"MATCH(R2,'Control Panel'!$A$12:$A$53,0)","v":37},{"$f":"MATCH(S2,'Control Panel'!$A$12:$A$53,0)","v":32},{"$f":"MATCH(T2,'Control Panel'!$A$12:$A$53,0)","v":1},{"$f":"MATCH(U2,'Control Panel'!$A$12:$A$53,0)","v":21},{"$f":"MATCH(V2,'Control Panel'!$A$12:$A$53,0)","v":29},{"$f":"MATCH(W2,'Control Panel'!$A$12:$A$53,0)","v":18},{"$f":"MATCH(X2,'Control Panel'!$A$12:$A$53,0)","v":12},{"$f":"MATCH(Y2,'Control Panel'!$A$12:$A$53,0)","v":11},{"$f":"MATCH(Z2,'Control Panel'!$A$12:$A$53,0)","v":17},{"$f":"MATCH(AA2,'Control Panel'!$A$12:$A$53,0)","v":40},{"$f":"MATCH(AB2,'Control Panel'!$A$12:$A$53,0)","v":10},{"$f":"MATCH(AC2,'Control Panel'!$A$12:$A$53,0)","v":9},{"$f":"MATCH(AD2,'Control Panel'!$A$12:$A$53,0)","v":28},{"$f":"MATCH(AE2,'Control Panel'!$A$12:$A$53,0)","v":31},{"$f":"MATCH(AF2,'Control Panel'!$A$12:$A$53,0)","v":42},{"$f":"MATCH(AG2,'Control Panel'!$A$12:$A$53,0)","v":4},{"$f":"MATCH(AH2,'Control Panel'!$A$12:$A$53,0)","v":20},{"$f":"MATCH(AI2,'Control Panel'!$A$12:$A$53,0)","v":26},{"$f":"MATCH(AJ2,'Control Panel'!$A$12:$A$53,0)","v":22},{"$f":"MATCH(AK2,'Control Panel'!$A$12:$A$53,0)","v":25},{"$f":"MATCH(AL2,'Control Panel'!$A$12:$A$53,0)","v":35},{"$f":"MATCH(AM2,'Control Panel'!$A$12:$A$53,0)","v":30},{"$f":"MATCH(AN2,'Control Panel'!$A$12:$A$53,0)","v":33},{"$f":"MATCH(AO2,'Control Panel'!$A$12:$A$53,0)","v":41},{"$f":"MATCH(AP2,'Control Panel'!$A$12:$A$53,0)","v":16},{"$f":"MATCH(AQ2,'Control Panel'!$A$12:$A$53,0)","v":6}]
[null,"F86025","F86082","F86657","F86007","F86057","Y00155","F86013","F86658","Y02987","Y00918","Y00090","F86731","F86707","F86703","F86702","F86698","F86692","F86691","F86652","F86642","F86641","F86637","F86624","F86612","F86087","F86085","F86083","F86081","F86066","F86064","F86060","F86042","F86034","F86032","F86028","F86023","F86022","F86020","F86012","F86010","F86009","F86008"]
["Currently Registered Regular Patients",{"$f":"VLOOKUP($A3,'Other Data'!A2:F10,MATCH('Composite Data'!B2,'Other Data'!A2:F2,0),FALSE)","v":"17510"},{"$f":"VLOOKUP($A3,'Other Data'!$A$4:$J$10,MATCH('Composite Data'!C$2,'Other Data'!$A$2:$J$2,0),FALSE)","v":"6052"},{"$f":"VLOOKUP($A3,'Other Data'!$A$4:$J$10,MATCH('Composite Data'!D$2,'Other Data'!$A$2:$J$2,0),FALSE)","v":"8355"},{"$f":"VLOOKUP($A3,'EMIS Data'!$A$10:$DG$16,MATCH('Composite Data'!E$2,'EMIS Data'!$A$8:$DG$8,0),FALSE)","v":13665},{"$f":"VLOOKUP($A3,'EMIS Data'!$A$10:$DG$16,MATCH('Composite Data'!F$2,'EMIS Data'!$A$8:$DG$8,0),FALSE)","v":6471},{"$f":"VLOOKUP($A3,'Other Data'!$A$4:$J$10,MATCH('Composite Data'!G$2,'Other Data'!$A$2:$J$2,0),FALSE)","v":"10075"},{"$f":"VLOOKUP($A3,'Other Data'!$A$4:$J$10,MATCH('Composite Data'!H$2,'Other Data'!$A$2:$J$2,0),FALSE)","v":"7149"},{"$f":"VLOOKUP($A3,'EMIS Data'!$A$10:$DG$16,MATCH('Composite Data'!I$2,'EMIS Data'!$A$8:$DG$8,0),FALSE)","v":5508},{"$f":"VLOOKUP($A3,'EMIS Data'!$A$10:$DH$16,MATCH('Composite Data'!J$2,'EMIS Data'!$A$8:$DH$8,0),FALSE)","v":29551},{"$f":"VLOOKUP($A3,'EMIS Data'!$A$10:$DG$16,MATCH('Composite Data'!K$2,'EMIS Data'!$A$8:$DG$8,0),FALSE)","v":6592},{"$f":"VLOOKUP($A3,'EMIS Data'!$A$10:$DG$16,MATCH('Composite Data'!L$2,'EMIS Data'!$A$8:$DG$8,0),FALSE)","v":8283},{"$f":"VLOOKUP($A3,'EMIS Data'!$A$10:$DG$16,MATCH('Composite Data'!M$2,'EMIS Data'!$A$8:$DG$8,0),FALSE)","v":4627},{"$f":"VLOOKUP($A3,'EMIS Data'!$A$10:$DG$16,MATCH('Composite Data'!N$2,'EMIS Data'!$A$8:$DG$8,0),FALSE)","v":6752},{"$f":"VLOOKUP($A3,'EMIS Data'!$A$10:$DG$16,MATCH('Composite Data'!O$2,'EMIS Data'!$A$8:$DG$8,0),FALSE)","v":3834},{"$f":"VLOOKUP($A3,'EMIS Data'!$A$10:$DG$16,MATCH('Composite Data'!P$2,'EMIS Data'!$A$8:$DG$8,0),FALSE)","v":5186},{"$f":"VLOOKUP($A3,'EMIS Data'!$A$10:$DG$16,MATCH('Composite Data'!Q$2,'EMIS Data'!$A$8:$DG$8,0),FALSE)","v":5433},{"$f":"VLOOKUP($A3,'EMIS Data'!$A$10:$DG$16,MATCH('Composite Data'!R$2,'EMIS Data'!$A$8:$DG$8,0),FALSE)","v":10879},{"$f":"VLOOKUP($A3,'EMIS Data'!$A$10:$DG$16,MATCH('Composite Data'!S$2,'EMIS Data'!$A$8:$DG$8,0),FALSE)","v":10967},{"$f":"VLOOKUP($A3,'EMIS Data'!$A$10:$DG$16,MATCH('Composite Data'!T$2,'EMIS Data'!$A$8:$DG$8,0),FALSE)","v":7227},{"$f":"VLOOKUP($A3,'EMIS Data'!$A$10:$DG$16,MATCH('Composite Data'!U$2,'EMIS Data'!$A$8:$DG$8,0),FALSE)","v":5086},{"$f":"VLOOKUP($A3,'EMIS Data'!$A$10:$DG$16,MATCH('Composite Data'!V$2,'EMIS Data'!$A$8:$DG$8,0),FALSE)","v":7920},{"$f":"VLOOKUP($A3,'EMIS Data'!$A$10:$DG$16,MATCH('Composite Data'!W$2,'EMIS Data'!$A$8:$DG$8,0),FALSE)","v":4918},{"$f":"VLOOKUP($A3,'EMIS Data'!$A$10:$DG$16,MATCH('Composite Data'!X$2,'EMIS Data'!$A$8:$DG$8,0),FALSE)","v":3122},{"$f":"VLOOKUP($A3,'EMIS Data'!$A$10:$DG$16,MATCH('Composite Data'!Y$2,'EMIS Data'!$A$8:$DG$8,0),FALSE)","v":3307},{"$f":"VLOOKUP($A3,'EMIS Data'!$A$10:$DG$16,MATCH('Composite Data'!Z$2,'EMIS Data'!$A$8:$DG$8,0),FALSE)","v":7626},{"$f":"VLOOKUP($A3,'EMIS Data'!$A$10:$DG$16,MATCH('Composite Data'!AA$2,'EMIS Data'!$A$8:$DG$8,0),FALSE)","v":3500},{"$f":"VLOOKUP($A3,'EMIS Data'!$A$10:$DG$16,MATCH('Composite Data'!AB$2,'EMIS Data'!$A$8:$DG$8,0),FALSE)","v":6785},{"$f":"VLOOKUP($A3,'EMIS Data'!$A$10:$DG$16,MATCH('Composite Data'!AC$2,'EMIS Data'!$A$8:$DG$8,0),FALSE)","v":6454},{"$f":"VLOOKUP($A3,'EMIS Data'!$A$10:$DG$16,MATCH('Composite Data'!AD$2,'EMIS Data'!$A$8:$DG$8,0),FALSE)","v":7890},{"$f":"VLOOKUP($A3,'EMIS Data'!$A$10:$DG$16,MATCH('Composite Data'!AE$2,'EMIS Data'!$A$8:$DG$8,0),FALSE)","v":4778},{"$f":"VLOOKUP($A3,'EMIS Data'!$A$10:$DG$16,MATCH('Composite Data'!AF$2,'EMIS Data'!$A$8:$DG$8,0),FALSE)","v":15710},{"$f":"VLOOKUP($A3,'EMIS Data'!$A$10:$DG$16,MATCH('Composite Data'!AG$2,'EMIS Data'!$A$8:$DG$8,0),FALSE)","v":6270},{"$f":"VLOOKUP($A3,'EMIS Data'!$A$10:$DG$16,MATCH('Composite Data'!AH$2,'EMIS Data'!$A$8:$DG$8,0),FALSE)","v":6154},{"$f":"VLOOKUP($A3,'EMIS Data'!$A$10:$DG$16,MATCH('Composite Data'!AI$2,'EMIS Data'!$A$8:$DG$8,0),FALSE)","v":9305},{"$f":"VLOOKUP($A3,'EMIS Data'!$A$10:$DG$16,MATCH('Composite Data'!AJ$2,'EMIS Data'!$A$8:$DG$8,0),FALSE)","v":10674},{"$f":"VLOOKUP($A3,'EMIS Data'!$A$10:$DG$16,MATCH('Composite Data'!AK$2,'EMIS Data'!$A$8:$DG$8,0),FALSE)","v":9894},{"$f":"VLOOKUP($A3,'EMIS Data'!$A$10:$DG$16,MATCH('Composite Data'!AL$2,'EMIS Data'!$A$8:$DG$8,0),FALSE)","v":14533},{"$f":"VLOOKUP($A3,'EMIS Data'!$A$10:$DG$16,MATCH('Composite Data'!AM$2,'EMIS Data'!$A$8:$DG$8,0),FALSE)","v":5826},{"$f":"VLOOKUP($A3,'EMIS Data'!$A$10:$DG$16,MATCH('Composite Data'!AN$2,'EMIS Data'!$A$8:$DG$8,0),FALSE)","v":9522},{"$f":"VLOOKUP($A3,'EMIS Data'!$A$10:$DG$16,MATCH('Composite Data'!AO$2,'EMIS Data'!$A$8:$DG$8,0),FALSE)","v":15563},{"$f":"VLOOKUP($A3,'EMIS Data'!$A$10:$DG$16,MATCH('Composite Data'!AP$2,'EMIS Data'!$A$8:$DG$8,0),FALSE)","v":7561},{"$f":"VLOOKUP($A3,'EMIS Data'!$A$10:$DG$16,MATCH('Composite Data'!AQ$2,'EMIS Data'!$A$8:$DG$8,0),FALSE)","v":11581}]
["POWC 01 Post-operative wound care 2022",{"$f":"VLOOKUP($A4,'Other Data'!$A$4:$J$10,MATCH('Composite Data'!B$2,'Other Data'!$A$2:$J$2,0),FALSE)","v":"90"},{"$f":"VLOOKUP($A4,'Other Data'!$A$4:$J$10,MATCH('Composite Data'!C$2,'Other Data'!$A$2:$J$2,0),FALSE)","v":"21"},{"$f":"VLOOKUP($A4,'Other Data'!$A$4:$J$10,MATCH('Composite Data'!D$2,'Other Data'!$A$2:$J$2,0),FALSE)","v":"27"},{"$f":"VLOOKUP($A4,'EMIS Data'!$A$10:$DG$16,MATCH('Composite Data'!E$2,'EMIS Data'!$A$8:$DG$8,0),FALSE)","v":165},{"$f":"VLOOKUP($A4,'EMIS Data'!$A$10:$DG$16,MATCH('Composite Data'!F$2,'EMIS Data'!$A$8:$DG$8,0),FALSE)","v":15},{"$f":"VLOOKUP($A4,'Other Data'!$A$4:$J$10,MATCH('Composite Data'!G$2,'Other Data'!$A$2:$J$2,0),FALSE)","v":"1"},{"$f":"VLOOKUP($A4,'Other Data'!$A$4:$J$10,MATCH('Composite Data'!H$2,'Other Data'!$A$2:$J$2,0),FALSE)","v":"27"},{"$f":"VLOOKUP($A4,'EMIS Data'!$A$10:$DG$16,MATCH('Composite Data'!I$2,'EMIS Data'!$A$8:$DG$8,0),FALSE)","v":5},{"$f":"VLOOKUP($A4,'EMIS Data'!$A$10:$DH$16,MATCH('Composite Data'!J$2,'EMIS Data'!$A$8:$DH$8,0),FALSE)","v":120},{"$f":"VLOOKUP($A4,'EMIS Data'!$A$10:$DG$16,MATCH('Composite Data'!K$2,'EMIS Data'!$A$8:$DG$8,0),FALSE)","v":30},{"$f":"VLOOKUP($A4,'EMIS Data'!$A$10:$DG$16,MATCH('Composite Data'!L$2,'EMIS Data'!$A$8:$DG$8,0),FALSE)","v":4},{"$f":"VLOOKUP($A4,'EMIS Data'!$A$10:$DG$16,MATCH('Composite Data'!M$2,'EMIS Data'!$A$8:$DG$8,0),FALSE)","v":18},{"$f":"VLOOKUP($A4,'EMIS Data'!$A$10:$DG$16,MATCH('Composite Data'!N$2,'EMIS Data'!$A$8:$DG$8,0),FALSE)","v":14},{"$f":"VLOOKUP($A4,'EMIS Data'!$A$10:$DG$16,MATCH('Composite Data'!O$2,'EMIS Data'!$A$8:$DG$8,0),FALSE)","v":24},{"$f":"VLOOKUP($A4,'EMIS Data'!$A$10:$DG$16,MATCH('Composite Data'!P$2,'EMIS Data'!$A$8:$DG$8,0),FALSE)","v":1},{"$f":"VLOOKUP($A4,'EMIS Data'!$A$10:$DG$16,MATCH('Composite Data'!Q$2,'EMIS Data'!$A$8:$DG$8,0),FALSE)","v":11},{"$f":"VLOOKUP($A4,'EMIS Data'!$A$10:$DG$16,MATCH('Composite Data'!R$2,'EMIS Data'!$A$8:$DG$8,0),FALSE)","v":6},{"$f":"VLOOKUP($A4,'EMIS Data'!$A$10:$DG$16,MATCH('Composite Data'!S$2,'EMIS Data'!$A$8:$DG$8,0),FALSE)","v":42},{"$f":"VLOOKUP($A4,'EMIS Data'!$A$10:$DG$16,MATCH('Composite Data'!T$2,'EMIS Data'!$A$8:$DG$8,0),FALSE)","v":12},{"$f":"VLOOKUP($A4,'EMIS Data'!$A$10:$DG$16,MATCH('Composite Data'!U$2,'EMIS Data'!$A$8:$DG$8,0),FALSE)","v":4},{"$f":"VLOOKUP($A4,'EMIS Data'!$A$10:$DG$16,MATCH('Composite Data'!V$2,'EMIS Data'!$A$8:$DG$8,0),FALSE)","v":20},{"$f":"VLOOKUP($A4,'EMIS Data'!$A$10:$DG$16,MATCH('Composite Data'!W$2,'EMIS Data'!$A$8:$DG$8,0),FALSE)","v":11},{"$f":"VLOOKUP($A4,'EMIS Data'!$A$10:$DG$16,MATCH('Composite Data'!X$2,'EMIS Data'!$A$8:$DG$8,0),FALSE)","v":2},{"$f":"VLOOKUP($A4,'EMIS Data'!$A$10:$DG$16,MATCH('Composite Data'!Y$2,'EMIS Data'!$A$8:$DG$8,0),FALSE)","v":10},{"$f":"VLOOKUP($A4,'EMIS Data'!$A$10:$DG$16,MATCH('Composite Data'!Z$2,'EMIS Data'!$A$8:$DG$8,0),FALSE)","v":12},{"$f":"VLOOKUP($A4,'EMIS Data'!$A$10:$DG$16,MATCH('Composite Data'!AA$2,'EMIS Data'!$A$8:$DG$8,0),FALSE)","v":7},{"$f":"VLOOKUP($A4,'EMIS Data'!$A$10:$DG$16,MATCH('Composite Data'!AB$2,'EMIS Data'!$A$8:$DG$8,0),FALSE)","v":27},{"$f":"VLOOKUP($A4,'EMIS Data'!$A$10:$DG$16,MATCH('Composite Data'!AC$2,'EMIS Data'!$A$8:$DG$8,0),FALSE)","v":11},{"$f":"VLOOKUP($A4,'EMIS Data'!$A$10:$DG$16,MATCH('Composite Data'!AD$2,'EMIS Data'!$A$8:$DG$8,0),FALSE)","v":93},{"$f":"VLOOKUP($A4,'EMIS Data'!$A$10:$DG$16,MATCH('Composite Data'!AE$2,'EMIS Data'!$A$8:$DG$8,0),FALSE)","v":27},{"$f":"VLOOKUP($A4,'EMIS Data'!$A$10:$DG$16,MATCH('Composite Data'!AF$2,'EMIS Data'!$A$8:$DG$8,0),FALSE)","v":9},{"$f":"VLOOKUP($A4,'EMIS Data'!$A$10:$DG$16,MATCH('Composite Data'!AG$2,'EMIS Data'!$A$8:$DG$8,0),FALSE)","v":33},{"$f":"VLOOKUP($A4,'EMIS Data'!$A$10:$DG$16,MATCH('Composite Data'!AH$2,'EMIS Data'!$A$8:$DG$8,0),FALSE)","v":0},{"$f":"VLOOKUP($A4,'EMIS Data'!$A$10:$DG$16,MATCH('Composite Data'!AI$2,'EMIS Data'!$A$8:$DG$8,0),FALSE)","v":54},{"$f":"VLOOKUP($A4,'EMIS Data'!$A$10:$DG$16,MATCH('Composite Data'!AJ$2,'EMIS Data'!$A$8:$DG$8,0),FALSE)","v":71},{"$f":"VLOOKUP($A4,'EMIS Data'!$A$10:$DG$16,MATCH('Composite Data'!AK$2,'EMIS Data'!$A$8:$DG$8,0),FALSE)","v":86},{"$f":"VLOOKUP($A4,'EMIS Data'!$A$10:$DG$16,MATCH('Composite Data'!AL$2,'EMIS Data'!$A$8:$DG$8,0),FALSE)","v":6},{"$f":"VLOOKUP($A4,'EMIS Data'!$A$10:$DG$16,MATCH('Composite Data'!AM$2,'EMIS Data'!$A$8:$DG$8,0),FALSE)","v":20},{"$f":"VLOOKUP($A4,'EMIS Data'!$A$10:$DG$16,MATCH('Composite Data'!AN$2,'EMIS Data'!$A$8:$DG$8,0),FALSE)","v":33},{"$f":"VLOOKUP($A4,'EMIS Data'!$A$10:$DG$16,MATCH('Composite Data'!AO$2,'EMIS Data'!$A$8:$DG$8,0),FALSE)","v":50},{"$f":"VLOOKUP($A4,'EMIS Data'!$A$10:$DG$16,MATCH('Composite Data'!AP$2,'EMIS Data'!$A$8:$DG$8,0),FALSE)","v":39},{"$f":"VLOOKUP($A4,'EMIS Data'!$A$10:$DG$16,MATCH('Composite Data'!AQ$2,'EMIS Data'!$A$8:$DG$8,0),FALSE)","v":37}]
["POWC 01 Post-operative wound care Activity",{"$f":"VLOOKUP($A5,'Other Data'!$A$4:$J$10,MATCH('Composite Data'!B$2,'Other Data'!$A$2:$J$2,0),FALSE)","v":{"$error":"#N/A"}},{"$f":"VLOOKUP($A5,'Other Data'!$A$4:$J$10,MATCH('Composite Data'!C$2,'Other Data'!$A$2:$J$2,0),FALSE)","v":{"$error":"#N/A"}},{"$f":"VLOOKUP($A5,'Other Data'!$A$4:$J$10,MATCH('Composite Data'!D$2,'Other Data'!$A$2:$J$2,0),FALSE)","v":{"$error":"#N/A"}},{"$f":"VLOOKUP($A5,'EMIS Data'!$A$10:$DG$16,MATCH('Composite Data'!E$2,'EMIS Data'!$A$8:$DG$8,0),FALSE)","v":419},{"$f":"VLOOKUP($A5,'EMIS Data'!$A$10:$DG$16,MATCH('Composite Data'!F$2,'EMIS Data'!$A$8:$DG$8,0),FALSE)","v":23},{"$f":"VLOOKUP($A5,'Other Data'!$A$4:$J$10,MATCH('Composite Data'!G$2,'Other Data'!$A$2:$J$2,0),FALSE)","v":{"$error":"#N/A"}},{"$f":"VLOOKUP($A5,'Other Data'!$A$4:$J$10,MATCH('Composite Data'!H$2,'Other Data'!$A$2:$J$2,0),FALSE)","v":{"$error":"#N/A"}},{"$f":"VLOOKUP($A5,'EMIS Data'!$A$10:$DG$16,MATCH('Composite Data'!I$2,'EMIS Data'!$A$8:$DG$8,0),FALSE)","v":6},{"$f":"VLOOKUP($A5,'EMIS Data'!$A$10:$DH$16,MATCH('Composite Data'!J$2,'EMIS Data'!$A$8:$DH$8,0),FALSE)","v":0},{"$f":"VLOOKUP($A5,'EMIS Data'!$A$10:$DG$16,MATCH('Composite Data'!K$2,'EMIS Data'!$A$8:$DG$8,0),FALSE)","v":0},{"$f":"VLOOKUP($A5,'EMIS Data'!$A$10:$DG$16,MATCH('Composite Data'!L$2,'EMIS Data'!$A$8:$DG$8,0),FALSE)","v":0},{"$f":"VLOOKUP($A5,'EMIS Data'!$A$10:$DG$16,MATCH('Composite Data'!M$2,'EMIS Data'!$A$8:$DG$8,0),FALSE)","v":0},{"$f":"VLOOKUP($A5,'EMIS Data'!$A$10:$DG$16,MATCH('Composite Data'!N$2,'EMIS Data'!$A$8:$DG$8,0),FALSE)","v":0},{"$f":"VLOOKUP($A5,'EMIS Data'!$A$10:$DG$16,MATCH('Composite Data'!O$2,'EMIS Data'!$A$8:$DG$8,0),FALSE)","v":0},{"$f":"VLOOKUP($A5,'EMIS Data'!$A$10:$DG$16,MATCH('Composite Data'!P$2,'EMIS Data'!$A$8:$DG$8,0),FALSE)","v":1},{"$f":"VLOOKUP($A5,'EMIS Data'!$A$10:$DG$16,MATCH('Composite Data'!Q$2,'EMIS Data'!$A$8:$DG$8,0),FALSE)","v":17},{"$f":"VLOOKUP($A5,'EMIS Data'!$A$10:$DG$16,MATCH('Composite Data'!R$2,'EMIS Data'!$A$8:$DG$8,0),FALSE)","v":9},{"$f":"VLOOKUP($A5,'EMIS Data'!$A$10:$DG$16,MATCH('Composite Data'!S$2,'EMIS Data'!$A$8:$DG$8,0),FALSE)","v":91},{"$f":"VLOOKUP($A5,'EMIS Data'!$A$10:$DG$16,MATCH('Composite Data'!T$2,'EMIS Data'!$A$8:$DG$8,0),FALSE)","v":20},{"$f":"VLOOKUP($A5,'EMIS Data'!$A$10:$DG$16,MATCH('Composite Data'!U$2,'EMIS Data'!$A$8:$DG$8,0),FALSE)","v":4},{"$f":"VLOOKUP($A5,'EMIS Data'!$A$10:$DG$16,MATCH('Composite Data'!V$2,'EMIS Data'!$A$8:$DG$8,0),FALSE)","v":30},{"$f":"VLOOKUP($A5,'EMIS Data'!$A$10:$DG$16,MATCH('Composite Data'!W$2,'EMIS Data'!$A$8:$DG$8,0),FALSE)","v":14},{"$f":"VLOOKUP($A5,'EMIS Data'!$A$10:$DG$16,MATCH('Composite Data'!X$2,'EMIS Data'!$A$8:$DG$8,0),FALSE)","v":2},{"$f":"VLOOKUP($A5,'EMIS Data'!$A$10:$DG$16,MATCH('Composite Data'!Y$2,'EMIS Data'!$A$8:$DG$8,0),FALSE)","v":16},{"$f":"VLOOKUP($A5,'EMIS Data'!$A$10:$DG$16,MATCH('Composite Data'!Z$2,'EMIS Data'!$A$8:$DG$8,0),FALSE)","v":15},{"$f":"VLOOKUP($A5,'EMIS Data'!$A$10:$DG$16,MATCH('Composite Data'!AA$2,'EMIS Data'!$A$8:$DG$8,0),FALSE)","v":12},{"$f":"VLOOKUP($A5,'EMIS Data'!$A$10:$DG$16,MATCH('Composite Data'!AB$2,'EMIS Data'!$A$8:$DG$8,0),FALSE)","v":30},{"$f":"VLOOKUP($A5,'EMIS Data'!$A$10:$DG$16,MATCH('Composite Data'!AC$2,'EMIS Data'!$A$8:$DG$8,0),FALSE)","v":17},{"$f":"VLOOKUP($A5,'EMIS Data'!$A$10:$DG$16,MATCH('Composite Data'!AD$2,'EMIS Data'!$A$8:$DG$8,0),FALSE)","v":175},{"$f":"VLOOKUP($A5,'EMIS Data'!$A$10:$DG$16,MATCH('Composite Data'!AE$2,'EMIS Data'!$A$8:$DG$8,0),FALSE)","v":31},{"$f":"VLOOKUP($A5,'EMIS Data'!$A$10:$DG$16,MATCH('Composite Data'!AF$2,'EMIS Data'!$A$8:$DG$8,0),FALSE)","v":10},{"$f":"VLOOKUP($A5,'EMIS Data'!$A$10:$DG$16,MATCH('Composite Data'!AG$2,'EMIS Data'!$A$8:$DG$8,0),FALSE)","v":47},{"$f":"VLOOKUP($A5,'EMIS Data'!$A$10:$DG$16,MATCH('Composite Data'!AH$2,'EMIS Data'!$A$8:$DG$8,0),FALSE)","v":0},{"$f":"VLOOKUP($A5,'EMIS Data'!$A$10:$DG$16,MATCH('Composite Data'!AI$2,'EMIS Data'!$A$8:$DG$8,0),FALSE)","v":144},{"$f":"VLOOKUP($A5,'EMIS Data'!$A$10:$DG$16,MATCH('Composite Data'!AJ$2,'EMIS Data'!$A$8:$DG$8,0),FALSE)","v":163},{"$f":"VLOOKUP($A5,'EMIS Data'!$A$10:$DG$16,MATCH('Composite Data'!AK$2,'EMIS Data'!$A$8:$DG$8,0),FALSE)","v":168},{"$f":"VLOOKUP($A5,'EMIS Data'!$A$10:$DG$16,MATCH('Composite Data'!AL$2,'EMIS Data'!$A$8:$DG$8,0),FALSE)","v":10},{"$f":"VLOOKUP($A5,'EMIS Data'!$A$10:$DG$16,MATCH('Composite Data'!AM$2,'EMIS Data'!$A$8:$DG$8,0),FALSE)","v":24},{"$f":"VLOOKUP($A5,'EMIS Data'!$A$10:$DG$16,MATCH('Composite Data'!AN$2,'EMIS Data'!$A$8:$DG$8,0),FALSE)","v":37},{"$f":"VLOOKUP($A5,'EMIS Data'!$A$10:$DG$16,MATCH('Composite Data'!AO$2,'EMIS Data'!$A$8:$DG$8,0),FALSE)","v":52},{"$f":"VLOOKUP($A5,'EMIS Data'!$A$10:$DG$16,MATCH('Composite Data'!AP$2,'EMIS Data'!$A$8:$DG$8,0),FALSE)","v":51},{"$f":"VLOOKUP($A5,'EMIS Data'!$A$10:$DG$16,MATCH('Composite Data'!AQ$2,'EMIS Data'!$A$8:$DG$8,0),FALSE)","v":42}]
["POWC 0101 Referral to tissue viability service",{"$f":"VLOOKUP($A6,'Other Data'!$A$4:$J$10,MATCH('Composite Data'!B$2,'Other Data'!$A$2:$J$2,0),FALSE)","v":{"$error":"#N/A"}},{"$f":"VLOOKUP($A6,'Other Data'!$A$4:$J$10,MATCH('Composite Data'!C$2,'Other Data'!$A$2:$J$2,0),FALSE)","v":{"$error":"#N/A"}},{"$f":"VLOOKUP($A6,'Other Data'!$A$4:$J$10,MATCH('Composite Data'!D$2,'Other Data'!$A$2:$J$2,0),FALSE)","v":{"$error":"#N/A"}},{"$f":"VLOOKUP($A6,'EMIS Data'!$A$10:$DG$16,MATCH('Composite Data'!E$2,'EMIS Data'!$A$8:$DG$8,0),FALSE)","v":1},{"$f":"VLOOKUP($A6,'EMIS Data'!$A$10:$DG$16,MATCH('Composite Data'!F$2,'EMIS Data'!$A$8:$DG$8,0),FALSE)","v":0},{"$f":"VLOOKUP($A6,'Other Data'!$A$4:$J$10,MATCH('Composite Data'!G$2,'Other Data'!$A$2:$J$2,0),FALSE)","v":{"$error":"#N/A"}},{"$f":"VLOOKUP($A6,'Other Data'!$A$4:$J$10,MATCH('Composite Data'!H$2,'Other Data'!$A$2:$J$2,0),FALSE)","v":{"$error":"#N/A"}},{"$f":"VLOOKUP($A6,'EMIS Data'!$A$10:$DG$16,MATCH('Composite Data'!I$2,'EMIS Data'!$A$8:$DG$8,0),FALSE)","v":0},{"$f":"VLOOKUP($A6,'EMIS Data'!$A$10:$DH$16,MATCH('Composite Data'!J$2,'EMIS Data'!$A$8:$DH$8,0),FALSE)","v":4},{"$f":"VLOOKUP($A6,'EMIS Data'!$A$10:$DG$16,MATCH('Composite Data'!K$2,'EMIS Data'!$A$8:$DG$8,0),FALSE)","v":3},{"$f":"VLOOKUP($A6,'EMIS Data'!$A$10:$DG$16,MATCH('Composite Data'!L$2,'EMIS Data'!$A$8:$DG$8,0),FALSE)","v":0},{"$f":"VLOOKUP($A6,'EMIS Data'!$A$10:$DG$16,MATCH('Composite Data'!M$2,'EMIS Data'!$A$8:$DG$8,0),FALSE)","v":0},{"$f":"VLOOKUP($A6,'EMIS Data'!$A$10:$DG$16,MATCH('Composite Data'!N$2,'EMIS Data'!$A$8:$DG$8,0),FALSE)","v":0},{"$f":"VLOOKUP($A6,'EMIS Data'!$A$10:$DG$16,MATCH('Composite Data'!O$2,'EMIS Data'!$A$8:$DG$8,0),FALSE)","v":0},{"$f":"VLOOKUP($A6,'EMIS Data'!$A$10:$DG$16,MATCH('Composite Data'!P$2,'EMIS Data'!$A$8:$DG$8,0),FALSE)","v":0},{"$f":"VLOOKUP($A6,'EMIS Data'!$A$10:$DG$16,MATCH('Composite Data'!Q$2,'EMIS Data'!$A$8:$DG$8,0),FALSE)","v":0},{"$f":"VLOOKUP($A6,'EMIS Data'!$A$10:$DG$16,MATCH('Composite Data'!R$2,'EMIS Data'!$A$8:$DG$8,0),FALSE)","v":0},{"$f":"VLOOKUP($A6,'EMIS Data'!$A$10:$DG$16,MATCH('Composite Data'!S$2,'EMIS Data'!$A$8:$DG$8,0),FALSE)","v":0},{"$f":"VLOOKUP($A6,'EMIS Data'!$A$10:$DG$16,MATCH('Composite Data'!T$2,'EMIS Data'!$A$8:$DG$8,0),FALSE)","v":0},{"$f":"VLOOKUP($A6,'EMIS Data'!$A$10:$DG$16,MATCH('Composite Data'!U$2,'EMIS Data'!$A$8:$DG$8,0),FALSE)","v":0},{"$f":"VLOOKUP($A6,'EMIS Data'!$A$10:$DG$16,MATCH('Composite Data'!V$2,'EMIS Data'!$A$8:$DG$8,0),FALSE)","v":0},{"$f":"VLOOKUP($A6,'EMIS Data'!$A$10:$DG$16,MATCH('Composite Data'!W$2,'EMIS Data'!$A$8:$DG$8,0),FALSE)","v":0},{"$f":"VLOOKUP($A6,'EMIS Data'!$A$10:$DG$16,MATCH('Composite Data'!X$2,'EMIS Data'!$A$8:$DG$8,0),FALSE)","v":0},{"$f":"VLOOKUP($A6,'EMIS Data'!$A$10:$DG$16,MATCH('Composite Data'!Y$2,'EMIS Data'!$A$8:$DG$8,0),FALSE)","v":0},{"$f":"VLOOKUP($A6,'EMIS Data'!$A$10:$DG$16,MATCH('Composite Data'!Z$2,'EMIS Data'!$A$8:$DG$8,0),FALSE)","v":0},{"$f":"VLOOKUP($A6,'EMIS Data'!$A$10:$DG$16,MATCH('Composite Data'!AA$2,'EMIS Data'!$A$8:$DG$8,0),FALSE)","v":0},{"$f":"VLOOKUP($A6,'EMIS Data'!$A$10:$DG$16,MATCH('Composite Data'!AB$2,'EMIS Data'!$A$8:$DG$8,0),FALSE)","v":0},{"$f":"VLOOKUP($A6,'EMIS Data'!$A$10:$DG$16,MATCH('Composite Data'!AC$2,'EMIS Data'!$A$8:$DG$8,0),FALSE)","v":0},{"$f":"VLOOKUP($A6,'EMIS Data'!$A$10:$DG$16,MATCH('Composite Data'!AD$2,'EMIS Data'!$A$8:$DG$8,0),FALSE)","v":2},{"$f":"VLOOKUP($A6,'EMIS Data'!$A$10:$DG$16,MATCH('Composite Data'!AE$2,'EMIS Data'!$A$8:$DG$8,0),FALSE)","v":0},{"$f":"VLOOKUP($A6,'EMIS Data'!$A$10:$DG$16,MATCH('Composite Data'!AF$2,'EMIS Data'!$A$8:$DG$8,0),FALSE)","v":0},{"$f":"VLOOKUP($A6,'EMIS Data'!$A$10:$DG$16,MATCH('Composite Data'!AG$2,'EMIS Data'!$A$8:$DG$8,0),FALSE)","v":1},{"$f":"VLOOKUP($A6,'EMIS Data'!$A$10:$DG$16,MATCH('Composite Data'!AH$2,'EMIS Data'!$A$8:$DG$8,0),FALSE)","v":0},{"$f":"VLOOKUP($A6,'EMIS Data'!$A$10:$DG$16,MATCH('Composite Data'!AI$2,'EMIS Data'!$A$8:$DG$8,0),FALSE)","v":0},{"$f":"VLOOKUP($A6,'EMIS Data'!$A$10:$DG$16,MATCH('Composite Data'!AJ$2,'EMIS Data'!$A$8:$DG$8,0),FALSE)","v":0},{"$f":"VLOOKUP($A6,'EMIS Data'!$A$10:$DG$16,MATCH('Composite Data'!AK$2,'EMIS Data'!$A$8:$DG$8,0),FALSE)","v":0},{"$f":"VLOOKUP($A6,'EMIS Data'!$A$10:$DG$16,MATCH('Composite Data'!AL$2,'EMIS Data'!$A$8:$DG$8,0),FALSE)","v":0},{"$f":"VLOOKUP($A6,'EMIS Data'!$A$10:$DG$16,MATCH('Composite Data'!AM$2,'EMIS Data'!$A$8:$DG$8,0),FALSE)","v":0},{"$f":"VLOOKUP($A6,'EMIS Data'!$A$10:$DG$16,MATCH('Composite Data'!AN$2,'EMIS Data'!$A$8:$DG$8,0),FALSE)","v":1},{"$f":"VLOOKUP($A6,'EMIS Data'!$A$10:$DG$16,MATCH('Composite Data'!AO$2,'EMIS Data'!$A$8:$DG$8,0),FALSE)","v":0},{"$f":"VLOOKUP($A6,'EMIS Data'!$A$10:$DG$16,MATCH('Composite Data'!AP$2,'EMIS Data'!$A$8:$DG$8,0),FALSE)","v":1},{"$f":"VLOOKUP($A6,'EMIS Data'!$A$10:$DG$16,MATCH('Composite Data'!AQ$2,'EMIS Data'!$A$8:$DG$8,0),FALSE)","v":0}]
["POWC 0102 Refer to district nurse",{"$f":"VLOOKUP($A7,'Other Data'!$A$4:$J$10,MATCH('Composite Data'!B$2,'Other Data'!$A$2:$J$2,0),FALSE)","v":"4"},{"$f":"VLOOKUP($A7,'Other Data'!$A$4:$J$10,MATCH('Composite Data'!C$2,'Other Data'!$A$2:$J$2,0),FALSE)","v":0},{"$f":"VLOOKUP($A7,'Other Data'!$A$4:$J$10,MATCH('Composite Data'!D$2,'Other Data'!$A$2:$J$2,0),FALSE)","v":0},{"$f":"VLOOKUP($A7,'EMIS Data'!$A$10:$DG$16,MATCH('Composite Data'!E$2,'EMIS Data'!$A$8:$DG$8,0),FALSE)","v":1},{"$f":"VLOOKUP($A7,'EMIS Data'!$A$10:$DG$16,MATCH('Composite Data'!F$2,'EMIS Data'!$A$8:$DG$8,0),FALSE)","v":0},{"$f":"VLOOKUP($A7,'Other Data'!$A$4:$J$10,MATCH('Composite Data'!G$2,'Other Data'!$A$2:$J$2,0),FALSE)","v":0},{"$f":"VLOOKUP($A7,'Other Data'!$A$4:$J$10,MATCH('Composite Data'!H$2,'Other Data'!$A$2:$J$2,0),FALSE)","v":"1"},{"$f":"VLOOKUP($A7,'EMIS Data'!$A$10:$DG$16,MATCH('Composite Data'!I$2,'EMIS Data'!$A$8:$DG$8,0),FALSE)","v":1},{"$f":"VLOOKUP($A7,'EMIS Data'!$A$10:$DH$16,MATCH('Composite Data'!J$2,'EMIS Data'!$A$8:$DH$8,0),FALSE)","v":6},{"$f":"VLOOKUP($A7,'EMIS Data'!$A$10:$DG$16,MATCH('Composite Data'!K$2,'EMIS Data'!$A$8:$DG$8,0),FALSE)","v":1},{"$f":"VLOOKUP($A7,'EMIS Data'!$A$10:$DG$16,MATCH('Composite Data'!L$2,'EMIS Data'!$A$8:$DG$8,0),FALSE)","v":0},{"$f":"VLOOKUP($A7,'EMIS Data'!$A$10:$DG$16,MATCH('Composite Data'!M$2,'EMIS Data'!$A$8:$DG$8,0),FALSE)","v":0},{"$f":"VLOOKUP($A7,'EMIS Data'!$A$10:$DG$16,MATCH('Composite Data'!N$2,'EMIS Data'!$A$8:$DG$8,0),FALSE)","v":0},{"$f":"VLOOKUP($A7,'EMIS Data'!$A$10:$DG$16,MATCH('Composite Data'!O$2,'EMIS Data'!$A$8:$DG$8,0),FALSE)","v":0},{"$f":"VLOOKUP($A7,'EMIS Data'!$A$10:$DG$16,MATCH('Composite Data'!P$2,'EMIS Data'!$A$8:$DG$8,0),FALSE)","v":0},{"$f":"VLOOKUP($A7,'EMIS Data'!$A$10:$DG$16,MATCH('Composite Data'!Q$2,'EMIS Data'!$A$8:$DG$8,0),FALSE)","v":0},{"$f":"VLOOKUP($A7,'EMIS Data'!$A$10:$DG$16,MATCH('Composite Data'!R$2,'EMIS Data'!$A$8:$DG$8,0),FALSE)","v":0},{"$f":"VLOOKUP($A7,'EMIS Data'!$A$10:$DG$16,MATCH('Composite Data'!S$2,'EMIS Data'!$A$8:$DG$8,0),FALSE)","v":0},{"$f":"VLOOKUP($A7,'EMIS Data'!$A$10:$DG$16,MATCH('Composite Data'!T$2,'EMIS Data'!$A$8:$DG$8,0),FALSE)","v":0},{"$f":"VLOOKUP($A7,'EMIS Data'!$A$10:$DG$16,MATCH('Composite Data'!U$2,'EMIS Data'!$A$8:$DG$8,0),FALSE)","v":0},{"$f":"VLOOKUP($A7,'EMIS Data'!$A$10:$DG$16,MATCH('Composite Data'!V$2,'EMIS Data'!$A$8:$DG$8,0),FALSE)","v":0},{"$f":"VLOOKUP($A7,'EMIS Data'!$A$10:$DG$16,MATCH('Composite Data'!W$2,'EMIS Data'!$A$8:$DG$8,0),FALSE)","v":0},{"$f":"VLOOKUP($A7,'EMIS Data'!$A$10:$DG$16,MATCH('Composite Data'!X$2,'EMIS Data'!$A$8:$DG$8,0),FALSE)","v":0},{"$f":"VLOOKUP($A7,'EMIS Data'!$A$10:$DG$16,MATCH('Composite Data'!Y$2,'EMIS Data'!$A$8:$DG$8,0),FALSE)","v":0},{"$f":"VLOOKUP($A7,'EMIS Data'!$A$10:$DG$16,MATCH('Composite Data'!Z$2,'EMIS Data'!$A$8:$DG$8,0),FALSE)","v":0},{"$f":"VLOOKUP($A7,'EMIS Data'!$A$10:$DG$16,MATCH('Composite Data'!AA$2,'EMIS Data'!$A$8:$DG$8,0),FALSE)","v":0},{"$f":"VLOOKUP($A7,'EMIS Data'!$A$10:$DG$16,MATCH('Composite Data'!AB$2,'EMIS Data'!$A$8:$DG$8,0),FALSE)","v":0},{"$f":"VLOOKUP($A7,'EMIS Data'!$A$10:$DG$16,MATCH('Composite Data'!AC$2,'EMIS Data'!$A$8:$DG$8,0),FALSE)","v":0},{"$f":"VLOOKUP($A7,'EMIS Data'!$A$10:$DG$16,MATCH('Composite Data'!AD$2,'EMIS Data'!$A$8:$DG$8,0),FALSE)","v":6},{"$f":"VLOOKUP($A7,'EMIS Data'!$A$10:$DG$16,MATCH('Composite Data'!AE$2,'EMIS Data'!$A$8:$DG$8,0),FALSE)","v":0},{"$f":"VLOOKUP($A7,'EMIS Data'!$A$10:$DG$16,MATCH('Composite Data'!AF$2,'EMIS Data'!$A$8:$DG$8,0),FALSE)","v":0},{"$f":"VLOOKUP($A7,'EMIS Data'!$A$10:$DG$16,MATCH('Composite Data'!AG$2,'EMIS Data'!$A$8:$DG$8,0),FALSE)","v":0},{"$f":"VLOOKUP($A7,'EMIS Data'!$A$10:$DG$16,MATCH('Composite Data'!AH$2,'EMIS Data'!$A$8:$DG$8,0),FALSE)","v":0},{"$f":"VLOOKUP($A7,'EMIS Data'!$A$10:$DG$16,MATCH('Composite Data'!AI$2,'EMIS Data'!$A$8:$DG$8,0),FALSE)","v":3},{"$f":"VLOOKUP($A7,'EMIS Data'!$A$10:$DG$16,MATCH('Composite Data'!AJ$2,'EMIS Data'!$A$8:$DG$8,0),FALSE)","v":1},{"$f":"VLOOKUP($A7,'EMIS Data'!$A$10:$DG$16,MATCH('Composite Data'!AK$2,'EMIS Data'!$A$8:$DG$8,0),FALSE)","v":1},{"$f":"VLOOKUP($A7,'EMIS Data'!$A$10:$DG$16,MATCH('Composite Data'!AL$2,'EMIS Data'!$A$8:$DG$8,0),FALSE)","v":0},{"$f":"VLOOKUP($A7,'EMIS Data'!$A$10:$DG$16,MATCH('Composite Data'!AM$2,'EMIS Data'!$A$8:$DG$8,0),FALSE)","v":1},{"$f":"VLOOKUP($A7,'EMIS Data'!$A$10:$DG$16,MATCH('Composite Data'!AN$2,'EMIS Data'!$A$8:$DG$8,0),FALSE)","v":0},{"$f":"VLOOKUP($A7,'EMIS Data'!$A$10:$DG$16,MATCH('Composite Data'!AO$2,'EMIS Data'!$A$8:$DG$8,0),FALSE)","v":0},{"$f":"VLOOKUP($A7,'EMIS Data'!$A$10:$DG$16,MATCH('Composite Data'!AP$2,'EMIS Data'!$A$8:$DG$8,0),FALSE)","v":1},{"$f":"VLOOKUP($A7,'EMIS Data'!$A$10:$DG$16,MATCH('Composite Data'!AQ$2,'EMIS Data'!$A$8:$DG$8,0),FALSE)","v":0}]
["POWC 0103 Orthopaedic referral",{"$f":"VLOOKUP($A8,'Other Data'!$A$4:$J$10,MATCH('Composite Data'!B$2,'Other Data'!$A$2:$J$2,0),FALSE)","v":"4"},{"$f":"VLOOKUP($A8,'Other Data'!$A$4:$J$10,MATCH('Composite Data'!C$2,'Other Data'!$A$2:$J$2,0),FALSE)","v":0},{"$f":"VLOOKUP($A8,'Other Data'!$A$4:$J$10,MATCH('Composite Data'!D$2,'Other Data'!$A$2:$J$2,0),FALSE)","v":"1"},{"$f":"VLOOKUP($A8,'EMIS Data'!$A$10:$DG$16,MATCH('Composite Data'!E$2,'EMIS Data'!$A$8:$DG$8,0),FALSE)","v":4},{"$f":"VLOOKUP($A8,'EMIS Data'!$A$10:$DG$16,MATCH('Composite Data'!F$2,'EMIS Data'!$A$8:$DG$8,0),FALSE)","v":2},{"$f":"VLOOKUP($A8,'Other Data'!$A$4:$J$10,MATCH('Composite Data'!G$2,'Other Data'!$A$2:$J$2,0),FALSE)","v":"1"},{"$f":"VLOOKUP($A8,'Other Data'!$A$4:$J$10,MATCH('Composite Data'!H$2,'Other Data'!$A$2:$J$2,0),FALSE)","v":"2"},{"$f":"VLOOKUP($A8,'EMIS Data'!$A$10:$DG$16,MATCH('Composite Data'!I$2,'EMIS Data'!$A$8:$DG$8,0),FALSE)","v":1},{"$f":"VLOOKUP($A8,'EMIS Data'!$A$10:$DH$16,MATCH('Composite Data'!J$2,'EMIS Data'!$A$8:$DH$8,0),FALSE)","v":10},{"$f":"VLOOKUP($A8,'EMIS Data'!$A$10:$DG$16,MATCH('Composite Data'!K$2,'EMIS Data'!$A$8:$DG$8,0),FALSE)","v":1},{"$f":"VLOOKUP($A8,'EMIS Data'!$A$10:$DG$16,MATCH('Composite Data'!L$2,'EMIS Data'!$A$8:$DG$8,0),FALSE)","v":0},{"$f":"VLOOKUP($A8,'EMIS Data'!$A$10:$DG$16,MATCH('Composite Data'!M$2,'EMIS Data'!$A$8:$DG$8,0),FALSE)","v":2},{"$f":"VLOOKUP($A8,'EMIS Data'!$A$10:$DG$16,MATCH('Composite Data'!N$2,'EMIS Data'!$A$8:$DG$8,0),FALSE)","v":0},{"$f":"VLOOKUP($A8,'EMIS Data'!$A$10:$DG$16,MATCH('Composite Data'!O$2,'EMIS Data'!$A$8:$DG$8,0),FALSE)","v":1},{"$f":"VLOOKUP($A8,'EMIS Data'!$A$10:$DG$16,MATCH('Composite Data'!P$2,'EMIS Data'!$A$8:$DG$8,0),FALSE)","v":1},{"$f":"VLOOKUP($A8,'EMIS Data'!$A$10:$DG$16,MATCH('Composite Data'!Q$2,'EMIS Data'!$A$8:$DG$8,0),FALSE)","v":1},{"$f":"VLOOKUP($A8,'EMIS Data'!$A$10:$DG$16,MATCH('Composite Data'!R$2,'EMIS Data'!$A$8:$DG$8,0),FALSE)","v":1},{"$f":"VLOOKUP($A8,'EMIS Data'!$A$10:$DG$16,MATCH('Composite Data'!S$2,'EMIS Data'!$A$8:$DG$8,0),FALSE)","v":5},{"$f":"VLOOKUP($A8,'EMIS Data'!$A$10:$DG$16,MATCH('Composite Data'!T$2,'EMIS Data'!$A$8:$DG$8,0),FALSE)","v":2},{"$f":"VLOOKUP($A8,'EMIS Data'!$A$10:$DG$16,MATCH('Composite Data'!U$2,'EMIS Data'!$A$8:$DG$8,0),FALSE)","v":1},{"$f":"VLOOKUP($A8,'EMIS Data'!$A$10:$DG$16,MATCH('Composite Data'!V$2,'EMIS Data'!$A$8:$DG$8,0),FALSE)","v":1},{"$f":"VLOOKUP($A8,'EMIS Data'!$A$10:$DG$16,MATCH('Composite Data'!W$2,'EMIS Data'!$A$8:$DG$8,0),FALSE)","v":0},{"$f":"VLOOKUP($A8,'EMIS Data'!$A$10:$DG$16,MATCH('Composite Data'!X$2,'EMIS Data'!$A$8:$DG$8,0),FALSE)","v":0},{"$f":"VLOOKUP($A8,'EMIS Data'!$A$10:$DG$16,MATCH('Composite Data'!Y$2,'EMIS Data'!$A$8:$DG$8,0),FALSE)","v":2},{"$f":"VLOOKUP($A8,'EMIS Data'!$A$10:$DG$16,MATCH('Composite Data'!Z$2,'EMIS Data'!$A$8:$DG$8,0),FALSE)","v":2},{"$f":"VLOOKUP($A8,'EMIS Data'!$A$10:$DG$16,MATCH('Composite Data'!AA$2,'EMIS Data'!$A$8:$DG$8,0),FALSE)","v":2},{"$f":"VLOOKUP($A8,'EMIS Data'!$A$10:$DG$16,MATCH('Composite Data'!AB$2,'EMIS Data'!$A$8:$DG$8,0),FALSE)","v":4},{"$f":"VLOOKUP($A8,'EMIS Data'!$A$10:$DG$16,MATCH('Composite Data'!AC$2,'EMIS Data'!$A$8:$DG$8,0),FALSE)","v":1},{"$f":"VLOOKUP($A8,'EMIS Data'!$A$10:$DG$16,MATCH('Composite Data'!AD$2,'EMIS Data'!$A$8:$DG$8,0),FALSE)","v":13},{"$f":"VLOOKUP($A8,'EMIS Data'!$A$10:$DG$16,MATCH('Composite Data'!AE$2,'EMIS Data'!$A$8:$DG$8,0),FALSE)","v":0},{"$f":"VLOOKUP($A8,'EMIS Data'!$A$10:$DG$16,MATCH('Composite Data'!AF$2,'EMIS Data'!$A$8:$DG$8,0),FALSE)","v":1},{"$f":"VLOOKUP($A8,'EMIS Data'!$A$10:$DG$16,MATCH('Composite Data'!AG$2,'EMIS Data'!$A$8:$DG$8,0),FALSE)","v":2},{"$f":"VLOOKUP($A8,'EMIS Data'!$A$10:$DG$16,MATCH('Composite Data'!AH$2,'EMIS Data'!$A$8:$DG$8,0),FALSE)","v":0},{"$f":"VLOOKUP($A8,'EMIS Data'!$A$10:$DG$16,MATCH('Composite Data'!AI$2,'EMIS Data'!$A$8:$DG$8,0),FALSE)","v":3},{"$f":"VLOOKUP($A8,'EMIS Data'!$A$10:$DG$16,MATCH('Composite Data'!AJ$2,'EMIS Data'!$A$8:$DG$8,0),FALSE)","v":3},{"$f":"VLOOKUP($A8,'EMIS Data'!$A$10:$DG$16,MATCH('Composite Data'!AK$2,'EMIS Data'!$A$8:$DG$8,0),FALSE)","v":6},{"$f":"VLOOKUP($A8,'EMIS Data'!$A$10:$DG$16,MATCH('Composite Data'!AL$2,'EMIS Data'!$A$8:$DG$8,0),FALSE)","v":0},{"$f":"VLOOKUP($A8,'EMIS Data'!$A$10:$DG$16,MATCH('Composite Data'!AM$2,'EMIS Data'!$A$8:$DG$8,0),FALSE)","v":3},{"$f":"VLOOKUP($A8,'EMIS Data'!$A$10:$DG$16,MATCH('Composite Data'!AN$2,'EMIS Data'!$A$8:$DG$8,0),FALSE)","v":2},{"$f":"VLOOKUP($A8,'EMIS Data'!$A$10:$DG$16,MATCH('Composite Data'!AO$2,'EMIS Data'!$A$8:$DG$8,0),FALSE)","v":1},{"$f":"VLOOKUP($A8,'EMIS Data'!$A$10:$DG$16,MATCH('Composite Data'!AP$2,'EMIS Data'!$A$8:$DG$8,0),FALSE)","v":3},{"$f":"VLOOKUP($A8,'EMIS Data'!$A$10:$DG$16,MATCH('Composite Data'!AQ$2,'EMIS Data'!$A$8:$DG$8,0),FALSE)","v":2}]
["POWC 0104 Advice given about wound care",{"$f":"VLOOKUP($A9,'Other Data'!$A$4:$J$10,MATCH('Composite Data'!B$2,'Other Data'!$A$2:$J$2,0),FALSE)","v":"89"},{"$f":"VLOOKUP($A9,'Other Data'!$A$4:$J$10,MATCH('Composite Data'!C$2,'Other Data'!$A$2:$J$2,0),FALSE)","v":"21"},{"$f":"VLOOKUP($A9,'Other Data'!$A$4:$J$10,MATCH('Composite Data'!D$2,'Other Data'!$A$2:$J$2,0),FALSE)","v":0},{"$f":"VLOOKUP($A9,'EMIS Data'!$A$10:$DG$16,MATCH('Composite Data'!E$2,'EMIS Data'!$A$8:$DG$8,0),FALSE)","v":155},{"$f":"VLOOKUP($A9,'EMIS Data'!$A$10:$DG$16,MATCH('Composite Data'!F$2,'EMIS Data'!$A$8:$DG$8,0),FALSE)","v":2},{"$f":"VLOOKUP($A9,'Other Data'!$A$4:$J$10,MATCH('Composite Data'!G$2,'Other Data'!$A$2:$J$2,0),FALSE)","v":0},{"$f":"VLOOKUP($A9,'Other Data'!$A$4:$J$10,MATCH('Composite Data'!H$2,'Other Data'!$A$2:$J$2,0),FALSE)","v":"1"},{"$f":"VLOOKUP($A9,'EMIS Data'!$A$10:$DG$16,MATCH('Composite Data'!I$2,'EMIS Data'!$A$8:$DG$8,0),FALSE)","v":1},{"$f":"VLOOKUP($A9,'EMIS Data'!$A$10:$DH$16,MATCH('Composite Data'!J$2,'EMIS Data'!$A$8:$DH$8,0),FALSE)","v":75},{"$f":"VLOOKUP($A9,'EMIS Data'!$A$10:$DG$16,MATCH('Composite Data'!K$2,'EMIS Data'!$A$8:$DG$8,0),FALSE)","v":25},{"$f":"VLOOKUP($A9,'EMIS Data'!$A$10:$DG$16,MATCH('Composite Data'!L$2,'EMIS Data'!$A$8:$DG$8,0),FALSE)","v":0},{"$f":"VLOOKUP($A9,'EMIS Data'!$A$10:$DG$16,MATCH('Composite Data'!M$2,'EMIS Data'!$A$8:$DG$8,0),FALSE)","v":0},{"$f":"VLOOKUP($A9,'EMIS Data'!$A$10:$DG$16,MATCH('Composite Data'!N$2,'EMIS Data'!$A$8:$DG$8,0),FALSE)","v":7},{"$f":"VLOOKUP($A9,'EMIS Data'!$A$10:$DG$16,MATCH('Composite Data'!O$2,'EMIS Data'!$A$8:$DG$8,0),FALSE)","v":0},{"$f":"VLOOKUP($A9,'EMIS Data'!$A$10:$DG$16,MATCH('Composite Data'!P$2,'EMIS Data'!$A$8:$DG$8,0),FALSE)","v":0},{"$f":"VLOOKUP($A9,'EMIS Data'!$A$10:$DG$16,MATCH('Composite Data'!Q$2,'EMIS Data'!$A$8:$DG$8,0),FALSE)","v":2},{"$f":"VLOOKUP($A9,'EMIS Data'!$A$10:$DG$16,MATCH('Composite Data'!R$2,'EMIS Data'!$A$8:$DG$8,0),FALSE)","v":0},{"$f":"VLOOKUP($A9,'EMIS Data'!$A$10:$DG$16,MATCH('Composite Data'!S$2,'EMIS Data'!$A$8:$DG$8,0),FALSE)","v":0},{"$f":"VLOOKUP($A9,'EMIS Data'!$A$10:$DG$16,MATCH('Composite Data'!T$2,'EMIS Data'!$A$8:$DG$8,0),FALSE)","v":3},{"$f":"VLOOKUP($A9,'EMIS Data'!$A$10:$DG$16,MATCH('Composite Data'!U$2,'EMIS Data'!$A$8:$DG$8,0),FALSE)","v":0},{"$f":"VLOOKUP($A9,'EMIS Data'!$A$10:$DG$16,MATCH('Composite Data'!V$2,'EMIS Data'!$A$8:$DG$8,0),FALSE)","v":7},{"$f":"VLOOKUP($A9,'EMIS Data'!$A$10:$DG$16,MATCH('Composite Data'!W$2,'EMIS Data'!$A$8:$DG$8,0),FALSE)","v":0},{"$f":"VLOOKUP($A9,'EMIS Data'!$A$10:$DG$16,MATCH('Composite Data'!X$2,'EMIS Data'!$A$8:$DG$8,0),FALSE)","v":1},{"$f":"VLOOKUP($A9,'EMIS Data'!$A$10:$DG$16,MATCH('Composite Data'!Y$2,'EMIS Data'!$A$8:$DG$8,0),FALSE)","v":4},{"$f":"VLOOKUP($A9,'EMIS Data'!$A$10:$DG$16,MATCH('Composite Data'!Z$2,'EMIS Data'!$A$8:$DG$8,0),FALSE)","v":3},{"$f":"VLOOKUP($A9,'EMIS Data'!$A$10:$DG$16,MATCH('Composite Data'!AA$2,'EMIS Data'!$A$8:$DG$8,0),FALSE)","v":0},{"$f":"VLOOKUP($A9,'EMIS Data'!$A$10:$DG$16,MATCH('Composite Data'!AB$2,'EMIS Data'!$A$8:$DG$8,0),FALSE)","v":5},{"$f":"VLOOKUP($A9,'EMIS Data'!$A$10:$DG$16,MATCH('Composite Data'!AC$2,'EMIS Data'!$A$8:$DG$8,0),FALSE)","v":0},{"$f":"VLOOKUP($A9,'EMIS Data'!$A$10:$DG$16,MATCH('Composite Data'!AD$2,'EMIS Data'!$A$8:$DG$8,0),FALSE)","v":16},{"$f":"VLOOKUP($A9,'EMIS Data'!$A$10:$DG$16,MATCH('Composite Data'!AE$2,'EMIS Data'!$A$8:$DG$8,0),FALSE)","v":2},{"$f":"VLOOKUP($A9,'EMIS Data'!$A$10:$DG$16,MATCH('Composite Data'!AF$2,'EMIS Data'!$A$8:$DG$8,0),FALSE)","v":1},{"$f":"VLOOKUP($A9,'EMIS Data'!$A$10:$DG$16,MATCH('Composite Data'!AG$2,'EMIS Data'!$A$8:$DG$8,0),FALSE)","v":22},{"$f":"VLOOKUP($A9,'EMIS Data'!$A$10:$DG$16,MATCH('Composite Data'!AH$2,'EMIS Data'!$A$8:$DG$8,0),FALSE)","v":0},{"$f":"VLOOKUP($A9,'EMIS Data'!$A$10:$DG$16,MATCH('Composite Data'!AI$2,'EMIS Data'!$A$8:$DG$8,0),FALSE)","v":19},{"$f":"VLOOKUP($A9,'EMIS Data'!$A$10:$DG$16,MATCH('Composite Data'!AJ$2,'EMIS Data'!$A$8:$DG$8,0),FALSE)","v":32},{"$f":"VLOOKUP($A9,'EMIS Data'!$A$10:$DG$16,MATCH('Composite Data'!AK$2,'EMIS Data'!$A$8:$DG$8,0),FALSE)","v":60},{"$f":"VLOOKUP($A9,'EMIS Data'!$A$10:$DG$16,MATCH('Composite Data'!AL$2,'EMIS Data'!$A$8:$DG$8,0),FALSE)","v":2},{"$f":"VLOOKUP($A9,'EMIS Data'!$A$10:$DG$16,MATCH('Composite Data'!AM$2,'EMIS Data'!$A$8:$DG$8,0),FALSE)","v":17},{"$f":"VLOOKUP($A9,'EMIS Data'!$A$10:$DG$16,MATCH('Composite Data'!AN$2,'EMIS Data'!$A$8:$DG$8,0),FALSE)","v":0},{"$f":"VLOOKUP($A9,'EMIS Data'!$A$10:$DG$16,MATCH('Composite Data'!AO$2,'EMIS Data'!$A$8:$DG$8,0),FALSE)","v":1},{"$f":"VLOOKUP($A9,'EMIS Data'!$A$10:$DG$16,MATCH('Composite Data'!AP$2,'EMIS Data'!$A$8:$DG$8,0),FALSE)","v":0},{"$f":"VLOOKUP($A9,'EMIS Data'!$A$10:$DG$16,MATCH('Composite Data'!AQ$2,'EMIS Data'!$A$8:$DG$8,0),FALSE)","v":31}]

{"sheet":"EMIS Data","index":2,"n_rows":131,"n_cols":112,"rows_kept":131,"cut":false,"hidden":false,"merged":[]}
["POWC 2022 Audit Report"]
[]
["Last Run:","2023-05-09T14:40:00","Relative Date:","2023-04-01"]
[]
["Population Count","Males","Females"]
[836881,421081,415800]
[]
[null,"Organisation Code","F82001","F82002","F82003","F82005","F82006","F82007","F82008","F82009","F82010","F82011","F82012","F82013","F82014","F82015","F82016","F82017","F82018","F82019","F82021","F82022","F82023","F82025","F82027","F82028","F82030","F82031","F82033","F82034","F82038","F82039","F82040","F82042","F82045","F82051","F82053","F82055","F82604","F82607","F82609","F82610","F82612","F82619","F82621","F82624","F82625","F82627","F82630","F82634","F82638","F82642","F82647","F82648","F82649","F82650","F82660","F82661","F82663","F82666","F82670","F82671","F82674","F82675","F82677","F82678","F82679","F82686","F86007","F86008","F86009","F86010","F86012","F86020","F86022","F86023","F86028","F86032","F86034","F86040","F86042","F86057","F86060","F86064","F86066","F86081","F86083","F86085","F86087","F86612","F86624","F86637","F86641","F86642","F86652","F86658","F86691","F86692","F86698","F86702","F86703","F86707","F86731","Y00090","Y00312","Y00918","Y01280","Y01719","Y01795","Y02575","Y02973","Y02987"]
["Search"]
["Currently Registered Regular Patients",null,5959,6645,5922,6593,12535,10996,13578,20549,8239,9929,3957,17471,7323,5088,6804,8722,11384,6609,9949,12422,3286,5746,2102,9646,14301,4310,3488,5613,5273,4106,3312,19636,3499,9671,3245,9976,5539,5297,4561,2896,6123,3846,4500,3971,7360,5800,7198,5992,7051,7136,4982,3611,4473,9491,20551,4075,4030,5156,3766,3287,5391,3527,7312,4904,5548,4001,13665,11581,7561,15563,9522,5826,14533,9894,10674,9305,6154,5658,6270,6471,15710,4778,7890,6454,6785,3500,7626,3307,3122,4918,7920,5086,7227,5508,10967,10879,5433,5186,3834,6752,4627,8283,4843,6592,2380,7598,4647,21080,8671,29551]
["POWC 01 Post-operative wound care 2022",null,45,13,36,55,16,71,33,44,8,4,13,9,14,29,3,88,60,43,9,14,8,53,14,9,25,64,3,37,22,2,15,80,3,26,0,6,14,49,3,3,41,1,13,6,27,4,3,36,10,21,17,9,3,40,139,26,5,5,1,2,2,2,20,10,37,18,165,37,39,50,33,20,6,86,71,54,0,11,33,15,9,27,93,11,27,7,12,10,2,11,20,4,12,5,42,6,11,1,24,14,18,4,5,30,5,23,21,35,10,120]
["POWC 0101 Referral to tissue viability service",null,2,1,1,1,0,1,0,1,0,0,1,0,0,2,0,0,0,1,0,0,0,0,0,0,0,2,0,2,1,0,0,3,0,0,0,0,1,0,0,0,0,0,2,0,0,0,0,0,0,0,1,0,0,0,4,0,0,0,0,0,0,0,0,0,0,0,1,0,1,0,1,0,0,0,0,0,0,0,1,0,0,0,2,0,0,0,0,0,0,0,0,0,0,0,0,0,0,0,0,0,0,0,0,3,0,0,0,0,0,4]
["POWC 0102 Refer to district nurse",null,2,0,3,1,0,0,0,1,0,1,0,0,0,1,0,0,1,0,0,0,0,1,0,0,0,2,0,2,0,0,1,0,0,0,0,0,0,0,0,0,1,0,0,0,0,0,0,0,0,1,0,0,0,1,0,2,0,0,0,0,0,0,0,0,0,1,1,0,1,0,0,1,0,1,1,3,0,0,0,0,0,0,6,0,0,0,0,0,0,0,0,0,0,1,0,0,0,0,0,0,0,0,0,1,0,0,1,0,0,6]
["POWC 0103 Orthopaedic referral",null,0,0,2,8,1,2,2,6,0,1,0,1,0,1,0,1,2,1,1,1,1,8,1,0,0,5,1,3,3,0,0,5,1,2,0,0,2,4,2,0,4,0,1,0,0,0,0,3,3,2,3,1,0,7,11,4,0,0,0,0,0,0,0,0,1,1,4,2,3,1,2,3,0,6,3,3,0,2,2,2,1,0,13,1,4,2,2,2,0,0,1,1,2,1,5,1,1,1,1,0,2,0,1,1,0,2,1,1,0,10]
["POWC 0104 Advice given about wound care",null,15,0,11,1,2,11,0,2,1,0,1,0,0,4,0,9,6,6,0,0,4,0,3,0,1,0,0,25,3,0,2,5,0,2,0,0,2,45,0,1,2,1,1,0,10,0,2,0,0,0,5,1,0,2,21,0,0,0,0,0,0,0,6,0,5,3,155,31,0,1,0,17,2,60,32,19,0,0,22,2,1,2,16,0,5,0,3,4,1,0,7,0,3,1,0,0,2,0,0,7,0,0,0,25,0,7,3,2,1,75]
["POWC 01 Post-operative wound care Activity",null,{"$f":"IFERROR(VLOOKUP(C8,$A$23:$B$118,2,FALSE),0)","v":205},{"$f":"IFERROR(VLOOKUP(D8,$A$23:$B$118,2,FALSE),0)","v":26},136,176,25,130,43,118,10,6,79,23,23,112,55,227,196,69,12,19,17,144,36,17,28,156,10,168,59,2,44,411,3,56,0,10,23,287,4,4,130,1,42,17,180,26,23,123,11,54,45,13,3,199,682,105,5,6,1,2,3,3,58,37,96,{"$f":"IFERROR(VLOOKUP(BP8,$A$23:$B$118,2,FALSE),0)","v":51},419,42,51,52,37,24,10,168,163,144,0,13,47,23,10,31,175,17,30,12,15,16,2,14,30,4,20,6,91,9,17,1,0,0,0,0,0,0,0,0,0,0,0,0]
[]
[]
[]
[]
[]
[]
["F82001",205]
["F82002",26]
["F82003",136]
["F82005",176]
["F82006",25]
["F82007",130]
["F82008",43]
["F82009",118]
["F82010",10]
["F82011",6]
["F82012",79]
["F82013",23]
["F82014",23]
["F82015",112]
["F82016",55]
["F82017",227]
["F82018",196]
["F82019",69]
["F82021",12]
["F82022",19]
["F82023",17]
["F82025",144]
["F82027",36]
["F82028",17]
["F82030",28]
["F82031",156]
["F82033",10]
["F82034",168]
["F82038",59]
["F82039",2]
["F82040",44]
["F82042",411]
["F82045",3]
["F82051",56]
["F82055",10]
["F82604",23]
["F82607",287]
["F82609",4]
["F82610",4]
["F82612",130]
["F82619",1]
["F82621",42]
["F82624",17]
["F82625",180]
["F82627",26]
["F82630",23]
["F82634",123]
["F82638",11]
["F82642",54]
["F82647",45]
["F82648",13]
["F82649",3]
["F82650",199]
["F82660",682]
["F82661",105]
["F82663",5]
["F82666",6]
["F82670",1]
["F82671",2]
["F82674",3]
["F82675",3]
["F82677",58]
["F82678",37]
["F82679",96]
["F82686",51]
["F86007",419]
["F86008",42]
["F86009",51]
["F86010",52]
["F86012",37]
["F86020",24]
["F86022",10]
["F86023",168]
["F86028",163]
["F86032",144]
["F86040",13]
["F86042",47]
["F86057",23]
["F86060",10]
["F86064",31]
["F86066",175]
["F86081",17]
["F86083",30]
["F86085",12]
["F86087",15]
["F86612",16]
["F86624",2]
["F86637",14]
["F86641",30]
["F86642",4]
["F86652",20]
["F86658",6]
["F86691",91]
["F86692",9]
["F86698",17]
["F86702",1]
["F86703",29]
["F86707",20]
["F86731",31]
["Organisation Code",0]
["Y00090",5]
["Y00312",5]
["Y00918",67]
["Y01280",45]
["Y01719",45]
["Y01795",50]
["Y02575",77]
["Y02973",15]
["Y02987",248]

{"sheet":"Other Data","index":3,"n_rows":25,"n_cols":7,"rows_kept":25,"cut":false,"hidden":false,"merged":[]}
[]
[null,"Y00155","F86082","F86025","F86013","F86657"]
[]
["Currently Registered Regular Patients",{"$f":"VLOOKUP(B$2,Sheet2!$B$4:$H$9,MATCH('Other Data'!$A4,Sheet2!$B$4:$H$4,0),FALSE)","v":"10075"},{"$f":"VLOOKUP(C$2,Sheet2!$B$4:$H$9,MATCH('Other Data'!$A4,Sheet2!$B$4:$H$4,0),FALSE)","v":"6052"},{"$f":"VLOOKUP(D$2,Sheet2!$B$4:$H$9,MATCH('Other Data'!$A4,Sheet2!$B$4:$H$4,0),FALSE)","v":"17510"},{"$f":"VLOOKUP(E$2,Sheet2!$B$4:$H$9,MATCH('Other Data'!$A4,Sheet2!$B$4:$H$4,0),FALSE)","v":"7149"},{"$f":"VLOOKUP(F$2,Sheet2!$B$4:$H$9,MATCH('Other Data'!$A4,Sheet2!$B$4:$H$4,0),FALSE)","v":"8355"}]
["POWC 01 Post-operative wound care 2022",{"$f":"VLOOKUP(B$2,Sheet2!$B$4:$H$9,MATCH('Other Data'!$A5,Sheet2!$B$4:$H$4,0),FALSE)","v":"1"},{"$f":"VLOOKUP(C$2,Sheet2!$B$4:$H$9,MATCH('Other Data'!$A5,Sheet2!$B$4:$H$4,0),FALSE)","v":"21"},{"$f":"VLOOKUP(D$2,Sheet2!$B$4:$H$9,MATCH('Other Data'!$A5,Sheet2!$B$4:$H$4,0),FALSE)","v":"90"},{"$f":"VLOOKUP(E$2,Sheet2!$B$4:$H$9,MATCH('Other Data'!$A5,Sheet2!$B$4:$H$4,0),FALSE)","v":"27"},{"$f":"VLOOKUP(F$2,Sheet2!$B$4:$H$9,MATCH('Other Data'!$A5,Sheet2!$B$4:$H$4,0),FALSE)","v":"27"}]
["POWC 01 Post-operative wound care activity",{"$f":"VLOOKUP(B$2,Sheet2!$B$4:$H$9,MATCH('Other Data'!$A6,Sheet2!$B$4:$H$4,0),FALSE)","v":{"$error":"#N/A"}},{"$f":"VLOOKUP(C$2,Sheet2!$B$4:$H$9,MATCH('Other Data'!$A6,Sheet2!$B$4:$H$4,0),FALSE)","v":{"$error":"#N/A"}},{"$f":"VLOOKUP(D$2,Sheet2!$B$4:$H$9,MATCH('Other Data'!$A6,Sheet2!$B$4:$H$4,0),FALSE)","v":{"$error":"#N/A"}},{"$f":"VLOOKUP(E$2,Sheet2!$B$4:$H$9,MATCH('Other Data'!$A6,Sheet2!$B$4:$H$4,0),FALSE)","v":{"$error":"#N/A"}},{"$f":"VLOOKUP(F$2,Sheet2!$B$4:$H$9,MATCH('Other Data'!$A6,Sheet2!$B$4:$H$4,0),FALSE)","v":{"$error":"#N/A"}}]
["POWC 0101 Referral to tissue viability service",{"$f":"VLOOKUP(B$2,Sheet2!$B$4:$H$9,MATCH('Other Data'!$A7,Sheet2!$B$4:$H$4,0),FALSE)","v":{"$error":"#N/A"}},{"$f":"VLOOKUP(C$2,Sheet2!$B$4:$H$9,MATCH('Other Data'!$A7,Sheet2!$B$4:$H$4,0),FALSE)","v":{"$error":"#N/A"}},{"$f":"VLOOKUP(D$2,Sheet2!$B$4:$H$9,MATCH('Other Data'!$A7,Sheet2!$B$4:$H$4,0),FALSE)","v":{"$error":"#N/A"}},{"$f":"VLOOKUP(E$2,Sheet2!$B$4:$H$9,MATCH('Other Data'!$A7,Sheet2!$B$4:$H$4,0),FALSE)","v":{"$error":"#N/A"}},{"$f":"VLOOKUP(F$2,Sheet2!$B$4:$H$9,MATCH('Other Data'!$A7,Sheet2!$B$4:$H$4,0),FALSE)","v":{"$error":"#N/A"}}]
["POWC 0102 Refer to district nurse",{"$f":"VLOOKUP(B$2,Sheet2!$B$4:$H$9,MATCH('Other Data'!$A8,Sheet2!$B$4:$H$4,0),FALSE)","v":0},{"$f":"VLOOKUP(C$2,Sheet2!$B$4:$H$9,MATCH('Other Data'!$A8,Sheet2!$B$4:$H$4,0),FALSE)","v":0},{"$f":"VLOOKUP(D$2,Sheet2!$B$4:$H$9,MATCH('Other Data'!$A8,Sheet2!$B$4:$H$4,0),FALSE)","v":"4"},{"$f":"VLOOKUP(E$2,Sheet2!$B$4:$H$9,MATCH('Other Data'!$A8,Sheet2!$B$4:$H$4,0),FALSE)","v":"1"},{"$f":"VLOOKUP(F$2,Sheet2!$B$4:$H$9,MATCH('Other Data'!$A8,Sheet2!$B$4:$H$4,0),FALSE)","v":0}]
["POWC 0103 Orthopaedic referral",{"$f":"VLOOKUP(B$2,Sheet2!$B$4:$H$9,MATCH('Other Data'!$A9,Sheet2!$B$4:$H$4,0),FALSE)","v":"1"},{"$f":"VLOOKUP(C$2,Sheet2!$B$4:$H$9,MATCH('Other Data'!$A9,Sheet2!$B$4:$H$4,0),FALSE)","v":0},{"$f":"VLOOKUP(D$2,Sheet2!$B$4:$H$9,MATCH('Other Data'!$A9,Sheet2!$B$4:$H$4,0),FALSE)","v":"4"},{"$f":"VLOOKUP(E$2,Sheet2!$B$4:$H$9,MATCH('Other Data'!$A9,Sheet2!$B$4:$H$4,0),FALSE)","v":"2"},{"$f":"VLOOKUP(F$2,Sheet2!$B$4:$H$9,MATCH('Other Data'!$A9,Sheet2!$B$4:$H$4,0),FALSE)","v":"1"}]
["POWC 0104 Advice given about wound care",{"$f":"VLOOKUP(B$2,Sheet2!$B$4:$H$9,MATCH('Other Data'!$A10,Sheet2!$B$4:$H$4,0),FALSE)","v":0},{"$f":"VLOOKUP(C$2,Sheet2!$B$4:$H$9,MATCH('Other Data'!$A10,Sheet2!$B$4:$H$4,0),FALSE)","v":"21"},{"$f":"VLOOKUP(D$2,Sheet2!$B$4:$H$9,MATCH('Other Data'!$A10,Sheet2!$B$4:$H$4,0),FALSE)","v":"89"},{"$f":"VLOOKUP(E$2,Sheet2!$B$4:$H$9,MATCH('Other Data'!$A10,Sheet2!$B$4:$H$4,0),FALSE)","v":"1"},{"$f":"VLOOKUP(F$2,Sheet2!$B$4:$H$9,MATCH('Other Data'!$A10,Sheet2!$B$4:$H$4,0),FALSE)","v":0}]
[]
[]
[]
[]
[]
[]
[]
[]
[]
[]
[]
["Row Labels","Sum of Q4 Activity","Sum of Q4 Patients","Sum of #Tissue viability nurseQ4","Sum of #Refer to district nurseQ4","Sum of #Orthopaedic referralQ4","Sum of #Advice given about wound careQ4"]
["F86007",57,57,0,2,1,2]
["F86057",8,8,0,0,4,0]
["Grand Total",65,65,0,2,5,2]

{"sheet":"Control Panel","index":4,"n_rows":53,"n_cols":6,"rows_kept":53,"cut":false,"hidden":false,"merged":[]}
["2020-01-01",null,null,null,"Search Title","Report Title"]
[null,null,null,null,"Currently Registered Regular Patients","Currently Registered Regular Patients"]
[null,null,null,null,"POWC 01 Post-operative wound care 2022","Patients with Post-operative wound care 2022-23"]
[null,null,null,null,null,"Patients per 1000 patients"]
["RB-1","Cranbrook",null,null,"POWC 01 Post-operative wound care activity","Post-operative wound care activity recorded 2022-23"]
["RB-2","Fairlop",null,null,null,"Activity per patient"]
["RB-3","Seven Kings",null,null,"POWC 0101 Referral to tissue viability service","Referral to tissue viability service"]
["RB-4","Wanstead & Woodford",null,null,"POWC 0102 Refer to district nurse","Refer to district nurse"]
["RB-5","Loxford",null,null,"POWC 0103 Orthopaedic referral","Orthopaedic referral"]
["RB-6","NewCross Alliance",null,null,"POWC 0104 Advice given about wound care","Advice given about wound care"]
[]
["F86652","Drive Surgery","RB","Redbridge","RB-1","Cranbrook"]
["F86702","St Clements Surgery","RB","Redbridge","RB-1","Cranbrook"]
["Y00918","Granville Medical Centre","RB","Redbridge","RB-1","Cranbrook"]
["F86042","Balfour Road Surgery","RB","Redbridge","RB-1","Cranbrook"]
["F86698","Cranbrook Surgery","RB","Redbridge","RB-1","Cranbrook"]
["F86008","Gants Hill Medical Centre","RB","Redbridge","RB-1","Cranbrook"]
["F86703","Redbridge Surgery","RB","Redbridge","RB-1","Cranbrook"]
["F86657","York Road Surgery","RB","Redbridge","RB-1","Cranbrook"]
["F86081","Kenwood Medical Centre","RB","Redbridge","RB-2","Fairlop"]
["F86083","Eastern Avenue Medical Centre","RB","Redbridge","RB-2","Fairlop"]
["F86612","Fullwell Avenue Surgery","RB","Redbridge","RB-2","Fairlop"]
["F86624","Heathcote Primary Care Centre","RB","Redbridge","RB-2","Fairlop"]
["F86707","Fencepiece Road Medical Practice","RB","Redbridge","RB-2","Fairlop"]
["F86057","The Willows Practice","RB","Redbridge","RB-2","Fairlop"]
["F86007","Forest Edge Practice","RB","Redbridge","RB-2","Fairlop"]
["F86009","The Palms Medical Centre","RB","Redbridge","RB-3","Seven Kings"]
["F86087","Goodmayes Medical Centre","RB","Redbridge","RB-3","Seven Kings"]
["F86637","Seven Kings Practice","RB","Redbridge","RB-3","Seven Kings"]
["Y00090","Doctor's House","RB","Redbridge","RB-3","Seven Kings"]
["F86034","Green Lane, Goodmayes Medical practice","RB","Redbridge","RB-3","Seven Kings"]
["F86642","Castleton Road Surgery","RB","Redbridge","RB-3","Seven Kings"]
["F86028","Chadwell Heath Surgery","RB","Redbridge","RB-3","Seven Kings"]
["Y00155","Grove Surgery","RB","Redbridge","RB-3","Seven Kings"]
["F86013","Broadway Surgery","RB","Redbridge","RB-4","Wanstead & Woodford"]
["F86023","The Evergreen Practice","RB","Redbridge","RB-4","Wanstead & Woodford"]
["F86032","Wanstead Place Surgery","RB","Redbridge","RB-4","Wanstead & Woodford"]
["F86731","Aldersbrook Medical Centre","RB","Redbridge","RB-4","Wanstead & Woodford"]
["F86066","Southdene Surgery","RB","Redbridge","RB-4","Wanstead & Woodford"]
["F86641","Shrubberies Medical Centre","RB","Redbridge","RB-4","Wanstead & Woodford"]
["F86020","Glebelands Practice","RB","Redbridge","RB-4","Wanstead & Woodford"]
["F86064","Elmhurst Practice","RB","Redbridge","RB-4","Wanstead & Woodford"]
["F86691","Clayhall Clinic","RB","Redbridge","RB-4","Wanstead & Woodford"]
["F86012","Rydal Practice","RB","Redbridge","RB-4","Wanstead & Woodford"]
["F86658","Queen Mary Practice","RB","Redbridge","RB-4","Wanstead & Woodford"]
["F86022","Ilford Medical Centre","RB","Redbridge","RB-5","Loxford"]
["Y02987","The Practice Loxford","RB","Redbridge","RB-5","Loxford"]
["F86692","Mathukias Surgery","RB","Redbridge","RB-5","Loxford"]
["F86082","Ilford Lane Surgery","RB","Redbridge","RB-5","Loxford"]
["F86025","Oak Tree Medical Practice","RB","Redbridge","RB-5","Loxford"]
["F86085","Hainault Surgery","RB","Redbridge","RB-6","NewCross Alliance"]
["F86010","Fullwell Cross Medical Centre","RB","Redbridge","RB-6","NewCross Alliance"]
["F86060","Newbury Group Practice","RB","Redbridge","RB-6","NewCross Alliance"]

{"sheet":"RB","index":5,"n_rows":6,"n_cols":9,"rows_kept":6,"cut":false,"hidden":false,"merged":[]}
["Rel_D","Practice","OrgID","Currently Registered Regular Patients","L&D Population","POWC 0102 Refer to district nurse","POWC 0103 Orthopaedic referral","POWC 0104 Advice given about wound care","POWC 01 Post-operative wound care 2022"]
["2023-04-01","Grove Surgery","Y00155","10075","15096",null,"1",null,"1"]
["2023-04-01","Ilford Lane Surgery","F86082","6052","9513",null,null,"21","21"]
["2023-04-01","Oak Tree Medical Practice","F86025","17510","23553","4","4","89","90"]
["2023-04-01","The Broadway Surgery","F86013","7149","11242","1","2","1","27"]
["2023-04-01","York Surgery","F86657","8355","13430",null,"1",null,"27"]

{"sheet":"Sheet2","index":6,"n_rows":591,"n_cols":8,"rows_kept":591,"cut":false,"hidden":false,"merged":[]}
[]
[]
[]
[null,"OrgID","Currently Registered Regular Patients","L&D Population","POWC 0102 Refer to district nurse","POWC 0103 Orthopaedic referral","POWC 0104 Advice given about wound care","POWC 01 Post-operative wound care 2022"]
[null,"Y00155","10075","15096",null,"1",null,"1"]
[null,"F86082","6052","9513",null,null,"21","21"]
[null,"F86025","17510","23553","4","4","89","90"]
[null,"F86013","7149","11242","1","2","1","27"]
[null,"F86657","8355","13430",null,"1",null,"27"]
[]
[]
[]
[]
[null,"F86692",{"$f":"COUNTIF($B$14:$B$669,B14)","v":1}]
[null,"F86009",14]
[null,"F86642",3]
[null,"F86060",1]
[null,"F86087",6]
[null,"F86087",6]
[null,"F86007",88]
[null,"Y02987",67]
[null,"F86028",19]
[null,"F86081",5]
[null,"F86707",13]
[null,"F86707",13]
[null,"F86637",3]
[null,"F86637",3]
[null,"F86057",10]
[null,"F86007",88]
[null,"F86637",3]
[null,"F86057",10]
[null,"F86703",14]
[null,"F86703",14]
[null,"F86703",14]
[null,"F86703",14]
[null,"F86652",7]
[null,"F86658",2]
[null,"F86087",6]
[null,"F86087",6]
[null,"F86087",6]
[null,"F86023",54]
[null,"F86023",54]
[null,"F86023",54]
[null,"F86081",5]
[null,"F86083",11]
[null,"F86020",12]
[null,"F86642",3]
[null,"F86642",3]
[null,"F86083",11]
[null,"F86083",11]
[null,"F86083",11]
[null,"F86083",11]
[null,"F86641",8]
[null,"F86012",24]
[null,"F86012",24]
[null,"F86707",13]
[null,"F86707",13]
[null,"F86087",6]
[null,"F86691",19]
[null,"F86066",47]
[null,"F86066",47]
[null,"F86066",47]
[null,"F86008",22]
[null,"F86083",11]
[null,"F86083",11]
[null,"F86028",19]
[null,"F86028",19]
[null,"F86057",10]
[null,"F86731",11]
[null,"F86731",11]
[null,"F86731",11]
[null,"F86731",11]
[null,"F86731",11]
[null,"F86731",11]
[null,"F86731",11]
[null,"F86066",47]
[null,"F86085",6]
[null,"F86020",{"$f":"COUNTIF($B$14:$B$669,B78)","v":12}]
[null,"F86020",12]
[null,"F86020",12]
[null,"F86020",12]
[null,"F86020",12]
[null,"F86020",12]
[null,"F86020",12]
[null,"F86020",12]
[null,"F86020",12]
[null,"F86020",12]
[null,"F86020",12]
[null,"F86698",4]
[null,"F86698",4]
[null,"F86698",4]
[null,"F86066",47]
[null,"F86083",11]
[null,"F86083",11]
[null,"F86083",11]
[null,"F86731",11]
[null,"F86731",11]
[null,"Y02987",67]
[null,"Y02987",67]
[null,"Y02987",67]
[null,"F86081",5]
[null,"F86081",5]
[null,"F86081",5]
[null,"F86731",11]
[null,"F86731",11]
[null,"F86023",54]
[null,"F86023",54]
[null,"F86023",54]
[null,"F86023",54]
[null,"F86023",54]
[null,"F86023",54]
[null,"F86612",4]
[null,"F86612",4]
[null,"F86612",4]
[null,"F86612",4]
[null,"F86707",13]
[null,"F86707",13]
[null,"F86707",13]
[null,"F86707",13]
[null,"F86707",13]
[null,"F86707",13]
[null,"F86707",13]
[null,"F86707",13]
[null,"F86707",13]
[null,"F86028",19]
[null,"F86028",19]
[null,"F86028",19]
[null,"F86028",19]
[null,"F86028",19]
[null,"F86028",19]
[null,"F86028",19]
[null,"F86028",19]
[null,"F86028",19]
[null,"F86028",19]
[null,"F86028",19]
[null,"F86028",19]
[null,"F86028",19]
[null,"F86028",19]
[null,"F86028",19]
[null,"F86028",19]
[null,"F86057",10]
[null,"F86057",{"$f":"COUNTIF($B$14:$B$669,B142)","v":10}]
[null,"F86057",10]
[null,"F86057",10]
[null,"F86007",88]
[null,"F86007",88]
[null,"F86641",8]
[null,"F86641",8]
[null,"F86641",8]
[null,"F86641",8]
[null,"Y00918",19]
[null,"Y00918",19]
[null,"Y00918",19]
[null,"Y00918",19]
[null,"Y00918",19]
[null,"Y00918",19]
[null,"Y00918",19]
[null,"Y00918",19]
[null,"Y00918",19]
[null,"Y00918",19]
[null,"Y00918",19]
[null,"Y00918",19]
[null,"Y00918",19]
[null,"Y00918",19]
[null,"F86064",8]
[null,"F86064",8]
[null,"F86698",4]
[null,"F86032",28]
[null,"Y00090",4]
[null,"F86641",8]
[null,"F86641",8]
[null,"F86641",8]
[null,"F86652",7]
[null,"F86010",21]
[null,"F86009",14]
[null,"F86010",21]
[null,"F86691",19]
[null,"F86691",19]
[null,"F86691",19]
[null,"Y02987",67]
[null,"Y02987",67]
[null,"Y02987",67]
[null,"Y02987",67]
[null,"Y02987",67]
[null,"Y02987",67]
[null,"Y02987",67]
[null,"Y02987",67]
[null,"Y02987",67]
[null,"Y02987",67]
[null,"Y02987",67]
[null,"Y02987",67]
[null,"F86691",19]
[null,"F86691",19]
[null,"F86691",19]
[null,"F86691",19]
[null,"F86042",23]
[null,"F86042",23]
[null,"F86042",23]
[null,"F86042",23]
[null,"F86042",23]
[null,"F86042",23]
[null,"F86042",23]
[null,"F86042",23]
[null,"F86042",23]
[null,"F86042",23]
[null,"F86042",{"$f":"COUNTIF($B$14:$B$669,B206)","v":23}]
[null,"F86042",23]
[null,"F86042",23]
[null,"F86042",23]
[null,"F86042",23]
[null,"F86042",23]
[null,"F86042",23]
[null,"F86042",23]
[null,"F86042",23]
[null,"F86042",23]
[null,"F86042",23]
[null,"F86042",23]
[null,"F86042",23]
[null,"F86057",10]
[null,"F86057",10]
[null,"Y00918",19]
[null,"Y00918",19]
[null,"Y00918",19]
[null,"Y00918",19]
[null,"Y00918",19]
[null,"F86008",22]
[null,"F86008",22]
[null,"F86008",22]
[null,"F86008",22]
[null,"F86008",22]
[null,"F86008",22]
[null,"F86066",47]
[null,"F86066",47]
[null,"F86066",47]
[null,"F86066",47]
[null,"F86066",47]
[null,"F86066",47]
[null,"F86066",47]
[null,"F86066",47]
[null,"F86066",47]
[null,"F86066",47]
[null,"F86066",47]
[null,"F86032",28]
[null,"F86032",28]
[null,"F86032",28]
[null,"F86032",28]
[null,"Y00090",4]
[null,"F86032",28]
[null,"F86032",28]
[null,"F86032",28]
[null,"F86032",28]
[null,"F86032",28]
[null,"F86032",28]
[null,"F86032",28]
[null,"F86032",28]
[null,"Y00090",4]
[null,"F86032",28]
[null,"F86064",8]
[null,"F86064",8]
[null,"F86064",8]
[null,"F86064",8]
[null,"F86064",8]
[null,"F86064",8]
[null,"F86703",14]
[null,"F86703",14]
[null,"F86703",14]
[null,"F86703",14]
[null,"F86703",14]
[null,"F86703",14]
[null,"F86703",{"$f":"COUNTIF($B$14:$B$669,B270)","v":14}]
[null,"F86703",14]
[null,"F86703",14]
[null,"F86703",14]
[null,"F86085",6]
[null,"F86085",6]
[null,"F86085",6]
[null,"F86085",6]
[null,"F86085",6]
[null,"F86658",2]
[null,"F86023",54]
[null,"F86023",54]
[null,"F86023",54]
[null,"F86023",54]
[null,"F86023",54]
[null,"F86023",54]
[null,"F86023",54]
[null,"F86023",54]
[null,"F86023",54]
[null,"F86023",54]
[null,"F86023",54]
[null,"Y02987",67]
[null,"Y02987",67]
[null,"Y02987",67]
[null,"Y02987",67]
[null,"Y02987",67]
[null,"Y02987",67]
[null,"Y02987",67]
[null,"Y02987",67]
[null,"Y02987",67]
[null,"Y02987",67]
[null,"Y02987",67]
[null,"F86008",22]
[null,"F86008",22]
[null,"F86008",22]
[null,"F86008",22]
[null,"F86008",22]
[null,"F86008",22]
[null,"F86010",21]
[null,"F86009",14]
[null,"F86009",14]
[null,"F86010",21]
[null,"F86010",21]
[null,"F86009",14]
[null,"F86009",14]
[null,"F86010",21]
[null,"F86010",21]
[null,"F86010",21]
[null,"F86010",21]
[null,"F86009",14]
[null,"F86010",21]
[null,"F86009",14]
[null,"F86009",14]
[null,"F86010",21]
[null,"F86010",21]
[null,"F86010",21]
[null,"F86009",14]
[null,"F86009",14]
[null,"F86009",14]
[null,"F86010",21]
[null,"F86010",21]
[null,"F86010",21]
[null,"F86009",14]
[null,"F86010",21]
[null,"F86010",{"$f":"COUNTIF($B$14:$B$669,B334)","v":21}]
[null,"F86010",21]
[null,"F86010",21]
[null,"F86010",21]
[null,"F86009",14]
[null,"F86691",19]
[null,"F86691",19]
[null,"F86691",19]
[null,"F86691",19]
[null,"F86691",19]
[null,"F86691",19]
[null,"F86691",19]
[null,"F86691",19]
[null,"F86691",19]
[null,"F86691",19]
[null,"F86691",19]
[null,"F86083",11]
[null,"F86007",88]
[null,"F86007",88]
[null,"F86007",88]
[null,"F86007",88]
[null,"F86007",88]
[null,"F86007",88]
[null,"F86007",88]
[null,"F86007",88]
[null,"F86007",88]
[null,"F86007",88]
[null,"F86007",88]
[null,"F86007",88]
[null,"F86007",88]
[null,"F86007",88]
[null,"F86007",88]
[null,"F86007",88]
[null,"F86007",88]
[null,"F86007",88]
[null,"F86007",88]
[null,"F86007",88]
[null,"F86007",88]
[null,"F86007",88]
[null,"F86007",88]
[null,"F86007",88]
[null,"F86007",88]
[null,"F86007",88]
[null,"F86007",88]
[null,"F86007",88]
[null,"F86007",88]
[null,"F86007",88]
[null,"F86007",88]
[null,"F86007",88]
[null,"F86007",88]
[null,"F86007",88]
[null,"F86008",22]
[null,"F86008",22]
[null,"F86008",22]
[null,"F86008",22]
[null,"F86008",22]
[null,"F86008",22]
[null,"F86008",22]
[null,"F86008",22]
[null,"F86008",22]
[null,"F86652",7]
[null,"F86652",7]
[null,"F86652",7]
[null,"F86652",7]
[null,"F86652",{"$f":"COUNTIF($B$14:$B$669,B398)","v":7}]
[null,"F86066",47]
[null,"F86066",47]
[null,"F86066",47]
[null,"F86066",47]
[null,"F86066",47]
[null,"F86007",88]
[null,"F86007",88]
[null,"F86007",88]
[null,"F86007",88]
[null,"F86007",88]
[null,"F86007",88]
[null,"F86007",88]
[null,"F86007",88]
[null,"F86007",88]
[null,"F86007",88]
[null,"F86007",88]
[null,"F86007",88]
[null,"F86007",88]
[null,"F86007",88]
[null,"F86007",88]
[null,"F86007",88]
[null,"F86007",88]
[null,"F86007",88]
[null,"F86007",88]
[null,"F86032",28]
[null,"Y00090",4]
[null,"F86032",28]
[null,"F86032",28]
[null,"F86032",28]
[null,"F86032",28]
[null,"F86032",28]
[null,"F86032",28]
[null,"F86032",28]
[null,"F86032",28]
[null,"F86032",28]
[null,"F86032",28]
[null,"F86032",28]
[null,"F86032",28]
[null,"F86032",28]
[null,"F86012",24]
[null,"F86012",24]
[null,"F86012",24]
[null,"F86012",24]
[null,"F86012",24]
[null,"F86012",24]
[null,"F86012",24]
[null,"F86012",24]
[null,"F86012",24]
[null,"F86012",24]
[null,"F86012",24]
[null,"F86012",24]
[null,"F86012",24]
[null,"F86012",24]
[null,"F86012",24]
[null,"F86012",24]
[null,"F86012",24]
[null,"F86012",24]
[null,"F86012",24]
[null,"F86012",24]
[null,"F86012",24]
[null,"F86012",24]
[null,"F86007",88]
[null,"F86007",88]
[null,"F86007",{"$f":"COUNTIF($B$14:$B$669,B462)","v":88}]
[null,"F86007",88]
[null,"F86007",88]
[null,"F86007",88]
[null,"F86007",88]
[null,"F86007",88]
[null,"F86007",88]
[null,"F86007",88]
[null,"F86007",88]
[null,"F86057",10]
[null,"F86023",54]
[null,"F86023",54]
[null,"F86023",54]
[null,"F86023",54]
[null,"F86023",54]
[null,"F86023",54]
[null,"F86023",54]
[null,"F86023",54]
[null,"F86023",54]
[null,"F86023",54]
[null,"F86023",54]
[null,"F86023",54]
[null,"F86023",54]
[null,"F86023",54]
[null,"F86023",54]
[null,"F86023",54]
[null,"F86023",54]
[null,"F86023",54]
[null,"F86023",54]
[null,"F86023",54]
[null,"F86023",54]
[null,"F86023",54]
[null,"F86023",54]
[null,"F86023",54]
[null,"F86023",54]
[null,"F86023",54]
[null,"F86023",54]
[null,"F86023",54]
[null,"F86023",54]
[null,"F86023",54]
[null,"F86023",54]
[null,"F86023",54]
[null,"F86023",54]
[null,"F86023",54]
[null,"Y02987",67]
[null,"Y02987",67]
[null,"Y02987",67]
[null,"Y02987",67]
[null,"Y02987",67]
[null,"Y02987",67]
[null,"Y02987",67]
[null,"Y02987",67]
[null,"Y02987",67]
[null,"Y02987",67]
[null,"F86007",88]
[null,"F86007",88]
[null,"F86007",88]
[null,"F86007",88]
[null,"F86007",88]
[null,"F86007",88]
[null,"F86007",88]
[null,"F86007",88]
[null,"F86007",88]
[null,"F86007",88]
[null,"F86007",{"$f":"COUNTIF($B$14:$B$669,B526)","v":88}]
[null,"F86007",88]
[null,"F86007",88]
[null,"F86007",88]
[null,"F86007",88]
[null,"F86007",88]
[null,"F86007",88]
[null,"F86007",88]
[null,"F86007",88]
[null,"F86007",88]
[null,"F86066",47]
[null,"F86066",47]
[null,"F86066",47]
[null,"F86066",47]
[null,"F86066",47]
[null,"F86066",47]
[null,"F86066",47]
[null,"F86066",47]
[null,"F86066",47]
[null,"F86066",47]
[null,"F86066",47]
[null,"F86066",47]
[null,"F86066",47]
[null,"F86066",47]
[null,"F86066",47]
[null,"F86066",47]
[null,"F86066",47]
[null,"F86066",47]
[null,"F86066",47]
[null,"F86066",47]
[null,"F86066",47]
[null,"F86066",47]
[null,"F86066",47]
[null,"F86066",47]
[null,"F86066",47]
[null,"F86066",47]
[null,"Y02987",67]
[null,"Y02987",67]
[null,"Y02987",67]
[null,"Y02987",67]
[null,"Y02987",67]
[null,"Y02987",67]
[null,"Y02987",67]
[null,"Y02987",67]
[null,"Y02987",67]
[null,"Y02987",67]
[null,"Y02987",67]
[null,"Y02987",67]
[null,"Y02987",67]
[null,"Y02987",67]
[null,"Y02987",67]
[null,"Y02987",67]
[null,"Y02987",67]
[null,"Y02987",67]
[null,"Y02987",67]
[null,"Y02987",67]
[null,"Y02987",67]
[null,"Y02987",67]
[null,"Y02987",67]
[null,"Y02987",67]
[null,"Y02987",67]
[null,"Y02987",67]
[null,"Y02987",67]
[null,"Y02987",67]
[null,"Y02987",{"$f":"COUNTIF($B$14:$B$669,B590)","v":67}]
[null,"Y02987",67]