{"text_format":"1","workbook":"xlsx","n_sheets":18,"sheets":["Cover Page","Full Explanatory Notes","2018-19 Changes","Data","Data 17-18","Control Panel","Month by month","General Health","Hypertension","CHD","Stroke","CVD Risk","Diabetes","Mental Health","CKD","COPD","Practice list","WF LDP TABLE"],"not_rendered":{"charts":0,"images":13,"macros":1,"external_links":0,"defined_names":10,"comments":0,"pivot_tables":0},"unopened":[],"bounds":{"document_bytes":16777216,"sheet_cells":100000,"rows_first":2000,"rows_last":500,"rows_between":2000,"halvings":0,"cell_chars":16384,"cell_head_chars":4096},"cells_cut":0,"cells_raw":0,"read":"whole","date_system":"1900"}

{"sheet":"Cover Page","index":0,"n_rows":30,"n_cols":3,"rows_kept":30,"cut":false,"hidden":false,"merged":[]}
[]
[]
[]
[]
[]
[]
[]
[null,null,"Waltham Forest - Practice Clinical Trends (LDP) Report"]
[]
[]
[]
[]
[]
[]
[]
[]
[]
[]
[null,"General Health","The number and percentage of patients on GP register aged over 16 with BMI and smoking status recorded"]
[null,"Hypertension","The number and percentage of patients on hypertension registers.   The number and percentage of patients on register with blood pressure measured within last 9 months is less than 150/90"]
[null,"CHD","The number and percentage of patients on CHD register.   Indicators included: cholesterol."]
[null,"Stroke/TIA","The number and percentage of patients on Stroke/TIA register.   Indicators included: BP recorded - BP <140/90."]
[null,"CVD Risk","The number and percentage of patients eligible for CVD risk score (aged 25 -84).  Indicators included: QRISK score,  QRISK greater than 20% and proxy review"]
[null,"Diabetes","The number and percentage of patients on diabetes register. Indicators include: blood pressure; cholesterol; HbA1c; flu vaccination"]
[null,"Mental Health","The number and percentage of patients on Mental Health register.  Indicators included:  severe mental illness review and smoking status"]
[null,"CKD","The number and percentage of patients on CKD register.  Indicators included: blood pressure and new diagnosis within 6 months"]
[null,"COPD","The number and percentage of patients on COPD register.  Indicators included: severe or very severe COPD (FEV1<50) and smoking status "]
[]
[]
[null,null,"N/A indicates either that no usable data has been returned or that calculation of a proportion is impossible"]

{"sheet":"Full Explanatory Notes","index":1,"n_rows":65,"n_cols":2,"rows_kept":65,"cut":false,"hidden":false,"merged":[[5,0,6,1],[51,0,54,0],[8,0,15,0],[16,0,19,0],[28,0,32,0],[33,0,40,0],[41,0,49,0],[20,0,22,0],[24,0,27,0],[77,0,78,0],[68,1,71,1],[70,2,73,2],[57,0,60,0],[61,0,64,0],[65,0,68,0],[69,0,72,0],[73,0,76,0]]}
[]
[]
[]
[]
[]
[]
[]
["Worksheet","Description of column contents"]
["General Health","Patients aged 16 and over on the GP register"]
[null,"Patients aged 16 and over on the GP register, with a BMI recorded in the last 12 months"]
[null,"Patients aged 16 and over on the GP register, with a BMI ≥30 & <35"]
[null,"Patients aged 16 and over on the GP register, with a BMI ≥ 35 & <40"]
[null,"Patients aged 16 and over on the GP register, with a BMI ≥ 40"]
[null,"Patients aged 16 and over on the GP register with smoking status recorded in the last 12 months"]
[null,"Patients aged 16 and over on the GP register with smoking status recorded in the last 12 months, recorded as being a smoker."]
[]
["Hypertension","Patients on the Hypertension register."]
[null,"Patients on the Hypertension register with BP recorded in the last 12 months."]
[null,"Patients on the Hypertension register with BP  < 140/90 (Patients aged under 80)  < 150/90 ( Aged 80 and over) (last 12m)"]
[]
["CHD","Patients on the CHD register"]
[null,"Patients on the CHD register with cholesterol recorded in the last 12 months."]
[null,"Patients on the CHD register with last measured cholesterol < 5mmol in the last 12 months"]
[]
["Stroke/TIA","Patients on the Stroke/TIA register"]
[null,"Patients on the Stroke/TIA register with a BP recorded in last 12 months"]
[null,"Patients on the Stroke/TIA register with BP recorded in the last 12 months with BP < 140/90"]
[]
["CVD Risk","Patients eligible for a CVD risk score  (aged 25 - 84 excluding CVD)"]
[null,"Patients with a QRISK or Framingham risk score done."]
[null,"Patients with a Q Risk score of 20% or higher"]
[null,"Patients with a Q Risk score of 20% or higher and an annual review or proxy annual review"]
[]
["Diabetes","Patients on the diabetes register"]
[null,"Patients on the diabetes register with BP recorded in the last 12 months"]
[null,"Patients on the diabetes register with latest BP < 145/85 in the last 12 months "]
[null,"Patients on the diabetes register with last measured cholesterol, measured within the last 15 months < 5mmol/l"]
[null,"Patients on the diabetes register with last HbA1c < 59in the last 12 months"]
[null,"Patients on the diabetes register with a Flu Jab within the last 12 months."]
[]
[]
["Mental Health","Patients on the Mental Health register"]
[null,"Patients on the Mental Health register with a review recorded within the last 12 months."]
[null,"Patients on the Mental Health register with smoking status recorded within the last 12 months"]
[null,"Patients on the Mental Health register with smoking status recorded within the last 12 months recorded as a smoker"]
[null,"Patients on the Mental Health register with smoking status recorded within the last 12 months referred to the stop smoking clinic"]
[null,"Patients on the Mental Health register with smoking status recorded within the last 12 months who are recorded as quitters"]
[null," Patients with Mental Health with blood pressure recorded in the last 12m"]
[null," Patients with Mental Health with QRISK recorded in the last 12m"]
[null," Patients with Mental Health with QRISK 20% or higher in the last 12m"]
[]
["CKD","Patients on the CKD register"]
[null,"Patients on the CKD register with blood pressure recorded"]
[null,"Patients on the CKD register with blood pressure < 140/90"]
[null,"Patients on the CKD register with new diagnosis of CKD in the last 6 months"]
[]
[]
["COPD","Patients on COPD register"]
[null,"No of patients with severe or very severe COPD (FEV1<50)"]
[null,"No. of COPD Patients with smoking status recorded (last 12m) or never smoked"]
[null,"No. of COPD patients recorded as a Smoker"]
[null,"No. of COPD Patients who are current smokers & referred to the Stop Smoking Clinic (12m)"]
[null,"No of COPD with flu  vaccination (12m)"]
[null,"No of COPD with pneumococcal vaccination ever"]
[null,"No of COPD patients referred to pulmonary rehab ever"]

{"sheet":"2018-19 Changes","index":2,"n_rows":141,"n_cols":5,"rows_kept":141,"cut":false,"hidden":true,"merged":[]}
["OLD (2017-2018)",null,"NEW (2018-2019)",null,"NEW (2019-20)"]
["List Size",null,"List Size",null,"List Size"]
["Age 16+",null,"Age 16+",null,"Age 16+"]
["% list size",null,"% list size",null,"% list size"]
["16+ and BMI (last 15m)",null,"16+ and BMI (last 12m)",null,"16+ and BMI (last 12m)"]
["% 16+",null,"% 16+",null,"% 16+"]
["BMI 25 to 29 ",null,"BMI ≥30 & <35",null,"BMI ≥30 & <35"]
["% 16+ ",null,"% 16+ ",null,"% 16+ "]
[" BMI ≥ 30",null," BMI ≥ 35 & <40",null," BMI ≥ 35 & <40"]
["%16+ ",null,"%16+ ",null,"%16+ "]
["BMI ≥ 40",null,"BMI ≥ 40",null,"BMI ≥ 40"]
["%16+ ",null,"%16+ ",null,"%16+ "]
["Smoking status (last 15m) incl. never smoked",null,"Smoking status (last 12m) incl. never smoked",null,"Smoking status (last 12m) incl. never smoked"]
["% 16+ ",null,"% 16+ ",null,"% 16+ "]
["Age 16+ and current smoker (last 15m)",null,"Age 16+ and current smoker (last 12m)",null,"Age 16+ and current smoker (last 12m)"]
["% 16+",null,"% 16+",null,"% 16+"]
[]
["Hypertension Register",null,"Hypertension Register",null,"Hypertension Register"]
["% list size",null,"% list size",null,"% list size"]
["Hypertension and BP (last 9m)",null,"Hypertension and BP (last 12m)",null,"Hypertension and BP (last 12m)"]
["% Hypertension Register",null,"% Hypertension Register",null,"% Hypertension Register"]
["Hypertension and BP ≤ 150/90 (last 9m)",null,"Hypertension and BP  < 140/90 (Patients aged under 80)  < 150/90 ( Aged 80 and over) (last 12m)",null,"Hypertension and BP  < 140/90 (Patients aged under 80)  < 150/90 ( Aged 80 and over) (last 12m)"]
["% Hypertension Register",null,"% Hypertension Register",null,"% Hypertension Register"]
[]
["CHD register",null,"CHD register",null,"CHD register"]
["% list size",null,"% list size",null,"% list size"]
["Cholesterol (last 15m)",null,"Cholesterol (last 12m)",null,"Cholesterol (last 12m)"]
["% CHD register",null,"% CHD register",null,"% CHD register"]
["Cholesterol ≤ 5 (last 15m)",null,"Cholesterol < 5 (last 12m)",null,"Cholesterol < 5 (last 12m)"]
["% CHD register",null,"% CHD register",null,"% CHD register"]
["BP (last 9m)",null,"BP ≤ 150/90 (last 9m)",null,"BP ≤ 150/90 (last 9m)"]
["% CHD register",null,"% CHD register",null,"% CHD register"]
["BP ≤ 150/90 (last 9m)"]
["% CHD register",null,null,null,"Stroke/TIA register"]
["CHD annual review or proxy review",null,null,null,"% list size"]
["% CHD register",null,null,null,"BP Recorded"]
["CHD diagnosed in last 6 months",null,null,null,"% Stroke/TIA register"]
["% CHD register",null,null,null,"BP <140/90 (last 12m)"]
[null,null,null,null,"% Stroke/TIA register"]
[]
["Aged 35 to 74 (exc CVD) ",null,"Aged 25 to 84 (exc CVD) ",null,"Aged 25 to 84 (exc CVD) "]
["CVD (QRISK or Framingham) risk score done",null,"QRISK recorded (5 years)",null,"QRISK recorded (5 years)"]
["% of patients aged 35 to 74 (exc CVD)",null,"% of patients aged 25 to 84 (exc CVD)",null,"% of patients aged 25 to 84 (exc CVD)"]
["QRISK ≥ 20% ",null,"QRISK ≥ 20% ",null,"QRISK ≥ 20% "]
["% QRISK Score recorded",null,"% QRISK Score recorded",null,"% QRISK Score recorded"]
["QRISK ≥ 20% and proxy review (BP and Chol last 15m)",null,"QRISK ≥ 20% and proxy review (BP and Chol last 12m)",null,"QRISK ≥ 20% and proxy review (BP and Chol last 12m)"]
["% Patients with QRISK ≥ 20%",null,"% Patients with QRISK ≥ 20%",null,"% Patients with QRISK ≥ 20%"]
[]
["Diabetes register",null,"Diabetes register",null,"Diabetes register"]
["% List size",null,"% List size",null,"% List size"]
["BP (last 15m)",null,"BP (last 12m)",null,"BP (last 12m)"]
["% Diabetes Register",null,"% Diabetes Register",null,"% Diabetes Register"]
["BP ≤  145/85  (last 15m)",null,"BP <  145/85  (last 12m)",null,"BP <  145/85  (last 12m)"]
["% Diabetes Register",null,"% Diabetes Register",null,"% Diabetes Register"]
["Cholesterol < 5mmols (last 15m)",null,"Cholesterol < 5mmols (last 12m)",null,"Cholesterol < 5mmols (last 12m)"]
["% Diabetes Register",null,"% Diabetes Register",null,"% Diabetes Register"]
["HbA1c ≤ 59(last 15m)",null,"HbA1c < 59 (last 12m)",null,"HbA1c < 59 (last 12m)"]
["% Diabetes register",null,"% Diabetes register",null,"% Diabetes register"]
["Flu jab (last 15m)",null,"Flu jab (last 12m)",null,"Flu jab (From August 2019)"]
["% Diabetes Register",null,"% Diabetes Register",null,"% Diabetes Register"]
["Annual review/ called or proxy (last 15m)"]
["% Diabetes register"]
["Cholesterol (last 15m)"]
["% Diabetes Register"]
["HbA1c ≤ 86 (last 15m)"]
["% Diabetes Register"]
["Diabetes retinal screening (last 15m)"]
["% Diabetes register"]
["Retinal screening (last 15m)"]
["% Diabetes register"]
["Neuropathy testing (last 15m)"]
["% Diabetes Register"]
["Microalbuminuria (last 15m)"]
["% Diabetes Register"]
["Type 1 Diabetes"]
["% Diabetes Register"]
["Type 2 Diabetes"]
["% Diabetes Register"]
["No Type Recorded"]
["% Diabetes Register"]
["Type 2 diabetes excluding insulin prescriptions  (last 15 m)"]
["% Type 2 Diabetes"]
["Newly Diagnosed Diabetes (Last 1m)"]
["Newly Diagnosed Diabetes - Type 1"]
["Newly Diagnosed Diabetes - Type 2"]
["Newly Diagnosed Diabetes - Type Not Recorded"]
["Diabetics under 18 years old"]
["Diabetics Under 18 with HbA1c ≤ 59 (last 15m)"]
["% of Diabetics under 18"]
["No. of patients with diabetes diagnosed with CKD in the last 15m"]
["% Diabetes Register"]
["No. of patients with diabetes diagnosed with CHD and/or Stroke/TIA in the last 12 months"]
["% Diabetes Register"]
["No. of patients with diabetes diagnosed with Depression in the last 12 months"]
["%Diabetes Register"]
["No. of patients who have ever had gestational diabetes "]
["No. of patients who have ever had gestational diabetes who are also on diabetes register"]
["% of patients with gestational diabetes"]
[]
["SMI register (QOF)",null,"Mental Health register",null,"Mental Health register"]
["% list size",null,"% list size",null,"% list size"]
["No. of SMI Patients with smoking status recorded (last 12m) or never smoked",null,"No. of Mental Health Patients with smoking status recorded (last 12m) or never smoked",null,"No. of Mental Health Patients with smoking status recorded (last 12m) or never smoked"]
["% SMI Register",null,"% Mental Health Register",null,"% Mental Health Register"]
["No. of SMI patients recorded as a Smoker",null,"No. of Mental Health patients recorded as a Smoker",null,"No. of Mental Health patients recorded as a Smoker"]
["% SMI Register",null,"% Mental Health Register",null,"% Mental Health Register"]
["No. of SMI Patients who are current smokers & referred to the Stop Smoking Clinic",null,"No. of Mental Health Patients who are current smokers & referred to the Stop Smoking Clinic",null,"No. of Mental Health Patients who are current smokers & referred to the Stop Smoking Clinic"]
["% SMI Register",null,"% Mental Health Register",null,"% Mental Health Register"]
["No. Of SMI Patients who are recorded as quitters",null,"No. Of Mental Health Patients who are recorded as quitters",null,"No. Of Mental Health Patients who are recorded as quitters"]
["% SMI Register",null,"% Mental Health Register",null,"% Mental Health Register"]
[" Patients with SMI with QRISK recorded in the last 12m",null," Patients with Mental Health with QRISK recorded in the last 12m",null," Patients with Mental Health with QRISK recorded in the last 12m"]
["% SMI Register",null,"% Mental Health Register",null,"% Mental Health Register"]
[" Patients with SMI with QRISK 20% or higher in the last 12m",null," Patients with Mental Health with QRISK 20% or higher in the last 12m",null," Patients with Mental Health with QRISK 20% or higher in the last 12m"]
["% patients with QRISK recorded 20% or higher",null,"% patients with QRISK recorded",null,"% patients with QRISK recorded"]
["Patients with SMI with BP & QRisk  on the same day in the last 12m",null,"Patients with Mental Health with BP & QRisk  on the same day in the last 12m",null,"Patients with Mental Health with BP & QRisk  on the same day in the last 12m"]
["% Patients with SMI with BP & QRisk  on the same day in the last 12m",null,"% Mental Health Register",null,"% Mental Health Register"]
[]
["No. of patients on CKD register (QOF definition)",null,"No. of patients on CKD register ",null,"No. of patients on CKD register"]
["% List Size",null,"% List Size",null,"% List Size"]
["BP Recorded (last 15m)",null,"BP Recorded (last 12m)",null,"BP Recorded (last 12m)"]
["% CKD register",null,"% CKD register",null,"% CKD register"]
["BP ≤ 140/90",null,"BP < 140/90",null,"BP < 140/90"]
["% CKD register",null,"% CKD register",null,"% CKD register"]
["No of patients with new diagnosis of CKD (last 6m)",null,"No of patients with new diagnosis of CKD (last 6m)",null,"No of patients with new diagnosis of CKD (last 6m)"]
["% CKD register",null,"% CKD register",null,"% CKD register"]
[]
[null,null,"No. of patients on COPD register",null,"No. of patients on COPD register"]
[null,null,"% List Size",null,"% List Size"]
[null,null,"No of patients with severe or very severe COPD (FEV1<50)",null,"No of patients with severe or very severe COPD (FEV1<50)"]
[null,null,"% COPD register",null,"% COPD register"]
[null,null,"No. of COPD Patients with smoking status recorded (last 12m) or never smoked",null,"No. of COPD Patients with smoking status recorded (last 12m) or never smoked"]
[null,null,"% COPD",null,"% COPD"]
[null,null,"No. of COPD patients recorded as a Smoker",null,"No. of COPD patients recorded as a Smoker"]
[null,null,"% COPD",null,"% COPD"]
[null,null,"No. of COPD Patients who are current smokers & referred to the Stop Smoking Clinic",null,"No. of COPD Patients who are current smokers & referred to the Stop Smoking Clinic"]
[null,null,"% of current COPD smokers",null,"% of current COPD smokers"]
[null,null,"No of COPD with flu  vaccination (12m)",null,"No of COPD with flu  vaccination (From August 2019)"]
[null,null,"% of COPD register",null,"% of COPD register"]
[null,null,"No of COPD with pneumococcal vaccination ever",null,"No of COPD with pneumococcal vaccination ever"]
[null,null,"% of COPD register",null,"% of COPD register"]
[null,null,"No of COPD patients referred to pulmonary rehab ever",null,"No of COPD patients referred to pulmonary rehab ever"]
[null,null,"% of COPD register",null,"% of COPD register"]

{"sheet":"Data","index":3,"n_rows":39,"n_cols":59,"rows_kept":39,"cut":false,"hidden":true,"merged":[]}
["2019-04-01",null,"01 LDP",null,"Last Run:",null,"Population Count",1173529,null,null,"Search","01. Listsize","LDP.04.11: Diabetes and BP in last 12 months","LDP.05: CVD 25-84yrs (excl CVD)","LDP.08.02 CKD Diagnosed (Last 6m)","LDP.08.03 CKD and BP Recorded (last 12 m)","CSPMH. 01.03 QRisk Recorded (12m)","CSPMH. 01.03.01 BP recorded on same day as QRisk (12m)","CSPMH. 01.03.02 Qrisk>=20 (12m)","LDP.08.01 CKD and BP less than 140/90 (last 12 m)","LDP.08 CKD Register","LDP.05.01: CVD QRISK greater than or equal 20%","LDP.05.01.01: CVD Proxy Annual Review (last 12m)","LDP.05.02: Cardiovascular Risk Score Done (5y)","LDP.04.09: Diabetes BP less than 145/85 (last 12m)","LDP.04.08: Diabetes Chol less than 5mmol (last 12m)","LDP.01.01.01: Obesity BMI more than or equal to 35 less than 40 (last 12m)","LDP.01.01.02: Obesity BMI between 30-35 (last 12m)","LDP.01.01.03: Obesity BMI equal to or over 40 (last 12m)","LDP.01.02: Smoking Status (last 12m) or Never Smoked (25yrs+)","LDP.01.03: Current Smoker (last 12m)","LDP.01.01: Obesity BMI recorded (last 12m)","LDP.01: Aged 16yrs+","CSPMH.01 SMI Register","CSPMH.01.02 Smoking Status Recorded (12m)","CSPMH.01.02.01 Current Smoker (12m)","CSPMH 01.02.01.01 Ref to clinic 12m","CSPMH.01.02.02 Ex-smoker Recorded (latest 12m)","LDP.02: Hypertension Register","LDP.02.01: Hypertension and BP < 140/90 (age under 80) < 150/90 (Age 80+)","LDP.04.07: Diabetes Influenza Vaccinations (From August 2018)","LDP.04.01: Diabetes HbA1c <7.5% OR <59mmol (last 12m)","LDP.02.02: Hypertension BP recorded (last 12m)","LDP.03: CHD Register","LDP.03.01: CHD Chol less than 5mmol (last 12m)","LDP.03.04: CHD Cholesterol recorded (last 12m)","LDP.04: Diabetes Register","LDP.09 COPD Register","LDP.09.01 Patients with severe or very severe COPD (FEV1<50)","LDP.09.02 Patients with smoking status recorded (last 12m) or never smoked","LDP.09.03 COPD patients recorded as a Smoker","LDP.09.04 COPD Patients who are current smokers & referred to the Stop Smoking C","LDP.09.05 No of COPD with flu vaccination (From August 2018)","LDP.09.06 No of COPD with pneumococcal vaccination ever","LDP.09.07 No of COPD patients referred to pulmonary rehab ever","LDP.03.02: CHD BP less than or equal 150/90 (last 9m)","LDP.10 Stroke or TIA register","LDP.10.01: Stroke/TIA BP recorded (last 12m)","LDP.10.02 Patients on Stroke/TIA register with BP <140/90 (12m)"]
["2019-04-01",null,null,null,"2019-05-13T09:43:00",null,"Males",586875,null,"Organisation Code"]
["2019-04-01",null,null,null,"Relative Date:",null,"Females",586654,null,"F84676",null,4401,267,2905,11,133,34,32,5,119,137,192,156,1484,255,215,70,209,44,2300,382,1280,3536,55,47,26,2,6,295,233,206,174,282,51,43,48,281,68,14,68,36,4,49,52,60,42,22,20,19]
["2019-04-01",null,null,null,"2019-05-01",null,null,null,null,"F86001",null,7940,451,5371,54,262,44,20,6,178,294,202,131,2252,372,281,126,273,60,4375,458,1542,6435,98,79,24,0,22,919,533,312,246,823,156,84,107,493,107,16,98,30,0,65,67,9,125,71,62,44]
["2019-04-01",null,null,null,null,null,null,null,null,"F86005",null,8200,287,5462,7,298,9,5,1,196,345,171,139,2455,248,202,109,287,67,4486,512,2002,6354,52,35,20,0,2,792,446,206,197,718,87,62,73,295,110,16,97,35,1,87,75,14,70,60,54,35]
["2019-04-01",null,null,null,null,null,null,null,null,"F86006",null,6199,379,4128,13,150,4,4,0,72,170,73,45,1003,269,281,91,185,54,3315,371,1033,4931,51,28,15,1,6,794,365,226,207,703,101,61,70,414,53,21,51,22,1,28,24,3,81,55,51,29]
["2019-04-01",null,null,null,null,null,null,null,null,"F86011",null,9264,681,3876,11,228,35,23,3,171,256,238,150,1930,586,450,149,354,92,5532,689,1846,7562,153,123,54,6,25,1202,735,493,376,1070,236,130,166,727,102,23,99,28,1,76,78,9,194,152,147,116]
["2019-04-01",null,null,null,null,null,null,null,null,"F86030",null,8091,497,5254,12,165,12,7,3,122,172,384,293,4072,432,415,98,298,44,4422,341,1530,6356,54,35,12,1,4,733,468,426,319,667,169,130,145,531,44,5,41,12,0,33,31,1,125,53,47,30]
["2019-04-01",null,null,null,null,null,null,null,null,"F86036",null,15798,734,11041,28,325,39,22,6,254,360,206,135,2713,667,555,234,623,134,9485,927,3630,12744,235,176,74,3,38,1460,834,569,486,1221,243,157,185,817,117,30,103,50,1,86,91,31,193,119,105,69]
["2019-04-01",null,null,null,null,null,null,null,null,"F86038",null,10989,727,6586,130,231,25,18,5,172,246,438,314,4398,541,485,166,408,89,5684,460,1709,8262,133,78,25,0,5,1097,623,519,396,988,255,165,196,782,38,3,35,10,0,27,18,4,189,107,98,63]
["2019-04-01",null,null,null,null,null,null,null,null,"F86044",null,8955,333,6380,8,141,26,23,6,90,168,242,142,1288,258,205,88,225,74,5260,682,1310,7426,108,79,34,0,5,766,388,229,192,656,88,50,58,373,34,10,28,17,0,24,21,8,65,48,43,25]
["2019-04-01",null,null,null,null,null,null,null,null,"F86045",null,1912,129,1383,4,60,11,2,3,19,60,85,68,624,116,110,50,125,24,1198,150,599,1638,32,29,9,0,5,260,92,102,85,229,55,42,51,134,26,2,23,6,0,20,18,2,45,24,22,7]
["2019-04-01",null,null,null,null,null,null,null,null,"F86058",null,15129,689,9852,10,338,113,14,11,268,363,463,314,3962,587,479,269,724,153,7957,1083,3804,11684,187,127,67,0,27,1461,918,511,362,1261,218,138,162,714,103,17,89,31,1,80,80,7,195,110,101,78]
["2019-04-01",null,null,null,null,null,null,null,null,"F86062",null,7084,415,4893,6,151,12,12,3,111,168,274,187,1450,315,281,124,354,72,4419,622,2315,5789,97,83,31,1,16,844,459,319,218,749,147,83,97,460,68,17,62,20,3,48,46,3,112,71,66,40]
["2019-04-01",null,null,null,null,null,null,null,null,"F86078",null,7360,336,4982,11,113,4,0,0,68,135,396,244,2008,237,213,93,236,44,4242,399,1201,6193,57,33,13,0,7,1198,641,238,203,961,184,91,112,367,95,10,77,27,0,70,58,5,128,109,90,57]
["2019-04-01",null,null,null,null,null,null,null,null,"F86086",null,5885,260,3675,40,88,6,5,1,59,95,134,88,875,215,157,115,288,65,3141,416,1484,4443,75,66,31,0,12,488,260,174,145,413,93,42,58,274,33,4,30,9,0,24,19,2,77,29,26,17]
["2019-04-01",null,null,null,null,null,null,null,null,"F86088",null,4746,304,3293,31,146,5,4,0,106,167,84,57,852,242,221,67,185,42,2532,224,973,3973,42,27,6,0,4,663,375,224,187,539,101,59,66,338,43,10,36,10,0,35,36,7,64,34,27,22]
["2019-04-01",null,null,null,null,null,null,null,null,"F86607",null,14154,605,9302,25,165,50,30,7,120,175,468,310,4027,452,392,178,478,93,7625,841,3296,10810,184,148,64,3,23,1207,676,437,300,1104,197,105,128,625,94,17,87,42,4,74,72,21,150,105,100,80]
["2019-04-01",null,null,null,null,null,null,null,null,"F86616",null,6670,276,4369,16,240,7,1,1,191,259,277,176,1728,232,198,104,281,66,3664,408,1551,5238,42,26,15,0,2,782,512,210,170,725,185,108,124,287,57,12,51,16,0,45,39,3,146,72,69,59]
["2019-04-01",null,null,null,null,null,null,null,null,"F86621",null,5674,306,4100,3,144,4,3,0,108,164,54,38,541,275,238,54,177,26,3349,302,1170,4794,73,52,18,0,13,615,422,293,210,551,102,65,72,313,29,3,27,10,0,21,27,23,84,47,47,38]
["2019-04-01",null,null,null,null,null,null,null,null,"F86625",null,6111,382,4056,95,155,13,3,4,101,177,141,112,1006,269,272,81,232,65,3137,335,1225,4908,97,70,32,2,15,719,382,267,233,634,134,72,94,404,62,9,58,17,2,44,38,3,97,57,52,34]
["2019-04-01",null,null,null,null,null,null,null,null,"F86626",null,5305,199,3598,3,76,7,6,1,52,81,148,111,718,151,138,64,163,35,2744,232,913,4185,35,26,10,0,2,434,273,124,125,401,68,47,54,205,21,6,20,4,0,14,12,1,56,26,24,18]
["2019-04-01",null,null,null,null,null,null,null,null,"F86627",null,13888,788,8938,21,606,36,27,9,328,670,629,417,2808,539,484,256,626,149,8109,978,2883,11332,207,150,71,12,25,1869,939,516,446,1717,409,234,282,819,241,49,217,72,6,171,163,41,300,255,234,137]
["2019-04-01",null,null,null,null,null,null,null,null,"F86644",null,10868,506,6982,144,241,36,29,8,164,272,274,177,1843,325,319,123,325,72,5699,638,1717,8450,153,118,55,0,23,1238,634,344,299,1038,205,116,145,567,112,19,97,37,2,76,80,13,156,80,68,46]
["2019-04-01",null,null,null,null,null,null,null,null,"F86650",null,8203,437,5522,32,141,11,8,2,88,169,205,113,1410,327,288,120,329,87,4417,530,2016,6589,112,54,27,0,14,732,328,248,249,633,117,65,76,483,62,13,45,15,1,42,37,10,90,71,64,37]
["2019-04-01",null,null,null,null,null,null,null,null,"F86664",null,8332,330,5288,25,140,18,16,5,115,169,174,82,1345,290,211,131,299,73,4478,421,1624,6567,91,60,36,0,6,885,487,355,177,683,180,74,88,394,104,22,92,32,0,98,69,15,135,86,73,55]
["2019-04-01",null,null,null,null,null,null,null,null,"F86666",null,14133,748,9594,37,322,109,94,21,215,366,615,415,4349,604,525,259,578,141,7501,912,3327,11406,222,182,84,0,23,1650,904,568,451,1426,197,121,139,828,99,28,89,41,0,67,76,5,157,108,92,71]
["2019-04-01",null,null,null,null,null,null,null,null,"F86679",null,5757,240,3628,22,77,10,9,1,50,80,118,88,1049,207,162,86,213,49,3071,385,1387,4317,34,29,13,1,4,469,309,140,145,430,56,32,39,250,41,11,37,12,0,25,16,8,47,40,37,30]
["2019-04-01",null,null,null,null,null,null,null,null,"F86689",null,4059,119,2835,13,82,6,2,1,59,83,42,29,512,82,82,35,115,33,2277,131,785,3147,27,17,6,0,5,287,150,103,76,261,54,35,41,124,33,1,29,9,0,24,19,4,40,21,21,13]
["2019-04-01",null,null,null,null,null,null,null,null,"F86696",null,5139,294,3449,16,161,5,2,0,82,186,102,74,823,233,205,83,177,33,1641,266,1118,4130,47,29,14,0,7,553,278,251,167,487,96,67,83,333,32,7,29,5,0,22,13,2,81,40,36,20]
["2019-04-01",null,null,null,null,null,null,null,null,"F86700",null,3772,204,2461,23,246,6,6,0,189,274,163,109,592,187,152,58,166,29,2041,185,866,3054,50,35,12,2,6,772,508,175,141,684,135,70,82,216,121,20,110,38,2,104,92,30,101,89,78,61]
["2019-04-01",null,null,null,null,null,null,null,null,"F86701",null,3282,222,2284,5,114,28,20,3,93,126,152,117,966,194,171,52,175,24,1834,232,945,2693,75,58,32,0,11,425,288,193,137,386,59,41,47,232,19,4,19,8,0,19,19,2,48,30,27,19]
["2019-04-01",null,null,null,null,null,null,null,null,"F86705",null,3029,168,2100,24,49,4,4,2,32,54,115,88,1089,121,114,52,156,28,1698,205,826,2463,24,16,7,0,2,288,160,148,100,249,51,30,34,176,29,4,22,11,0,28,16,3,39,20,19,12]
["2019-04-01",null,null,null,null,null,null,null,null,"F86708",null,2776,176,1676,28,67,13,11,4,44,69,123,81,907,133,105,63,156,45,1526,122,656,2164,29,25,7,0,5,377,182,125,89,344,61,34,42,194,14,3,14,5,0,10,8,4,42,33,29,15]
["2019-04-01",null,null,null,null,null,null,null,null,"F86712",null,3085,196,2200,4,77,3,3,0,48,82,31,22,411,161,154,54,126,31,1850,177,806,2605,21,16,7,0,2,350,196,165,129,323,50,27,32,210,12,5,11,1,1,10,11,0,40,13,13,9]
["2019-04-01",null,null,null,null,null,null,null,null,"Y01291",null,8792,415,5647,39,433,10,3,0,292,516,374,209,2215,391,329,137,416,80,4624,440,2216,7033,81,64,30,0,13,1172,724,279,249,1041,201,123,145,434,114,31,108,26,0,79,72,17,172,123,112,79]
["2019-04-01",null,null,null,null,null,null,null,null,"Y01839",null,6549,361,4330,57,123,27,17,4,97,135,188,142,1131,310,241,95,222,84,3672,486,1148,5221,97,67,29,0,11,743,441,209,209,630,119,71,87,400,93,5,80,39,0,67,73,4,93,52,47,31]
["2019-04-01",null,null,null,null,null,null,null,null,"Y02585",null,8112,168,5815,1,29,15,14,1,18,31,92,66,2503,119,91,70,219,52,4032,624,1365,6607,79,53,24,0,11,310,154,106,87,277,39,28,33,176,30,4,28,18,1,20,10,1,32,28,23,19]
["2019-04-01",null,null,null,null,null,null,null,null,"Total",null,269643,13629,177255,1009,6517,797,499,127,4491,7274,8067,5439,63339,10942,9421,4004,10403,2353,147337,16566,58098,215039,3209,2340,1034,34,407,28849,16317,10010,7982,25304,4899,2902,3461,14670,2460,471,2207,801,31,1812,1676,375,3811,2460,2224,1534]

{"sheet":"Data 17-18","index":4,"n_rows":38,"n_cols":58,"rows_kept":38,"cut":false,"hidden":true,"merged":[]}
["2019-03-01",null,"01 LDP",null,"Last Run:",null,"Population Count",1154235,null,null,"Search","01. Listsize","LDP.04.15.01 Diabetes HbA1C <=7.5% OR <=59mmol (15m) *REMOVE*","LDP.04.11: Diabetes and BP in last 12 months","LDP.05: CVD 25-84yrs (excl CVD)","LDP.08.02 CKD Diagnosed (Last 6m)","LDP.08.03 CKD and BP Recorded (last 12 m)","CSPMH. 01.03 QRisk Recorded (12m)","CSPMH. 01.03.01 BP recorded on same day as QRisk (12m)","CSPMH. 01.03.02 Qrisk>=20 (12m)","LDP.08.01 CKD and BP less than 140/90 (last 12 m)","LDP.08 CKD Register","LDP.05.01: CVD QRISK greater than or equal 20%","LDP.05.01.01: CVD Proxy Annual Review (last 12m)","LDP.05.02: Cardiovascular Risk Score Done (5y)","LDP.04.09: Diabetes BP less than 145/85 (last 12m)","LDP.04.08: Diabetes Chol less than 5mmol (last 12m)","LDP.01.01.01: Obesity BMI more than or equal to 35 less than 40 (last 12m)","LDP.01.01.02: Obesity BMI between 30-35 (last 12m)","LDP.01.01.03: Obesity BMI equal to or over 40 (last 12m)","LDP.01.02: Smoking Status (last 12m) or Never Smoked (25yrs+)","LDP.01.03: Current Smoker (last 12m)","LDP.01.01: Obesity BMI recorded (last 12m)","LDP.01: Aged 16yrs+","CSPMH.01 SMI Register","CSPMH.01.02 Smoking Status Recorded (12m)","CSPMH.01.02.01 Current Smoker (15m)","CSPMH 01.02.01.01 Ref to clinic 15m","CSPMH.01.02.02 Ex-smoker Recorded (latest 15m)","LDP.02: Hypertension Register","LDP.02.01: Hypertension and BP < 140/90 (age under 80) < 150/90 (Age 80+)","LDP.04.03: Diabetes Digital retinal screening or Seen by retinal screener *REMOV","LDP.04.07: Diabetes Influenza Vaccinations (last 12m)","LDP.04.01: Diabetes HbA1c <7.5% OR <59mmol (last 12m)","LDP.02.02: Hypertension BP recorded (last 12m)","LDP.03: CHD Register","LDP.03.01: CHD Chol less than 5mmol (last 12m)","LDP.03.04: CHD Cholesterol recorded (last 12m)","LDP.04: Diabetes Register","LDP.09 COPD Register","LDP.09.01 Patients with severe or very severe COPD (FEV1<50)","LDP.09.02 Patients with smoking status recorded (last 12m) or never smoked","LDP.09.03 COPD patients recorded as a Smoker","LDP.09.04 COPD Patients who are current smokers & referred to the Stop Smoking C","LDP.09.05 No of COPD with flu vaccination (12m)","LDP.09.06 No of COPD with pneumococcal vaccination ever","LDP.09.07 No of COPD patients referred to pulmonary rehab ever","LDP.03.02: CHD BP less than or equal 150/90 (last 9m)"]
["2019-03-01",null,null,null,"2019-04-02T09:19:00",null,"Males",576127,null,"Organisation Code"]
["2019-03-01",null,null,null,"Relative Date:",null,"Females",578108,null,"F86001",null,7954,1,458,5387,64,256,40,18,5,175,290,207,137,2221,400,276,118,263,58,4395,459,1505,6443,99,81,24,0,21,909,537,2,310,247,821,148,82,105,493,103,16,95,30,0,64,65,9,123]
["2019-03-01",null,null,null,"2019-04-01",null,null,null,null,"F86005",null,8251,2,285,5511,6,307,9,4,2,206,353,174,145,2442,248,201,114,283,71,4510,525,2042,6400,58,39,20,0,3,813,460,2,208,202,742,87,62,71,296,109,15,98,39,1,87,75,15,75]
["2019-03-01",null,null,null,null,null,null,null,null,"F86006",null,6190,1,382,4118,18,148,4,4,0,72,168,72,43,986,275,280,86,173,52,3293,367,979,4909,56,26,16,1,4,784,358,0,228,210,694,102,61,72,417,53,21,52,23,1,28,24,3,79]
["2019-03-01",null,null,null,null,null,null,null,null,"F86011",null,9262,0,667,3854,11,233,36,24,4,176,257,239,154,1919,591,454,143,360,93,5549,697,1839,7552,158,127,56,6,26,1208,764,1,487,374,1086,234,135,170,709,101,25,100,29,1,74,78,9,201]
["2019-03-01",null,null,null,null,null,null,null,null,"F86030",null,8112,0,512,5265,12,164,14,8,3,124,170,386,311,4094,451,440,97,298,41,4452,351,1555,6373,55,36,13,1,6,743,484,405,433,350,688,166,136,151,535,43,5,42,12,0,32,30,1,132]
["2019-03-01",null,null,null,null,null,null,null,null,"F86036",null,15820,0,787,11059,35,344,43,24,6,268,363,208,140,2685,733,610,243,657,138,9516,936,3677,12766,234,184,78,3,40,1473,898,562,582,521,1287,236,156,182,833,120,29,105,50,1,88,94,30,186]
["2019-03-01",null,null,null,null,null,null,null,null,"F86038",null,10948,0,743,6562,135,227,24,15,6,172,242,438,323,4395,554,498,173,411,85,5675,456,1728,8224,131,76,26,1,5,1088,635,14,522,400,988,251,169,195,788,30,3,28,9,0,21,16,4,190]
["2019-03-01",null,null,null,null,null,null,null,null,"F86044",null,8916,0,350,6356,8,146,28,24,6,93,168,244,154,1286,283,228,94,225,72,5280,706,1323,7392,113,85,35,0,6,778,421,114,241,214,668,87,49,60,391,34,11,29,18,0,25,22,8,69]
["2019-03-01",null,null,null,null,null,null,null,null,"F86045",null,1901,0,127,1377,6,60,10,2,3,19,60,85,70,605,119,109,51,115,22,1187,151,581,1628,30,29,10,0,5,257,91,0,101,84,225,54,42,49,134,26,2,23,6,0,20,18,2,49]
["2019-03-01",null,null,null,null,null,null,null,null,"F86058",null,15520,2,710,10121,10,357,118,14,12,294,387,470,325,4030,626,493,280,724,157,8172,1104,3865,11987,204,136,72,0,27,1498,979,6,520,378,1311,221,139,163,738,104,17,94,34,1,83,80,9,205]
["2019-03-01",null,null,null,null,null,null,null,null,"F86062",null,7020,0,422,4847,5,174,15,14,4,118,187,268,196,1401,350,291,127,386,65,4415,632,2437,5741,100,90,34,2,18,842,472,122,325,235,741,145,89,101,468,66,17,61,20,3,47,45,3,115]
["2019-03-01",null,null,null,null,null,null,null,null,"F86078",null,7372,1,347,4986,13,114,7,1,0,68,136,398,253,1996,250,218,100,227,46,4233,397,1179,6203,74,41,15,0,8,1199,646,2,244,201,973,186,93,113,377,94,10,78,28,0,70,56,3,134]
["2019-03-01",null,null,null,null,null,null,null,null,"F86086",null,5859,0,264,3659,41,87,8,7,2,60,93,135,91,878,217,160,119,288,65,3165,439,1494,4427,73,65,30,0,13,492,261,2,176,152,425,90,40,58,275,33,4,33,8,0,24,19,2,76]
["2019-03-01",null,null,null,null,null,null,null,null,"F86088",null,4727,0,308,3287,29,154,6,4,0,117,173,83,57,856,257,232,70,191,42,2578,240,1016,3965,44,31,8,0,4,657,408,2,224,187,567,98,62,71,336,43,10,38,10,0,35,36,7,69]
["2019-03-01",null,null,null,null,null,null,null,null,"F86607",null,14186,2,613,9338,23,162,49,31,7,116,176,467,305,4010,447,397,190,477,90,7701,870,3296,10843,187,153,64,4,27,1227,662,423,440,314,1120,195,104,127,635,93,16,89,40,3,73,71,20,145]
["2019-03-01",null,null,null,null,null,null,null,null,"F86616",null,6598,0,288,4320,22,251,9,1,1,198,260,278,183,1702,249,207,102,280,73,3673,415,1540,5187,48,34,17,0,5,785,532,3,219,182,738,186,110,126,300,54,11,49,14,0,43,38,3,152]
["2019-03-01",null,null,null,null,null,null,null,null,"F86621",null,5661,0,299,4088,3,147,3,3,1,111,164,51,39,507,274,240,52,178,26,3318,304,1124,4775,78,52,19,0,13,612,424,8,290,214,548,99,68,75,306,29,4,26,10,0,22,27,23,86]
["2019-03-01",null,null,null,null,null,null,null,null,"F86625",null,6122,2,385,4063,93,176,14,4,4,112,192,140,115,985,270,292,88,233,69,3167,345,1241,4910,101,76,36,1,16,718,410,9,271,246,654,134,75,98,405,63,9,61,18,1,44,39,3,96]
["2019-03-01",null,null,null,null,null,null,null,null,"F86626",null,5296,0,207,3585,4,78,6,5,1,63,82,148,112,691,171,140,62,162,33,2746,236,884,4175,37,27,12,1,2,435,297,117,124,130,401,69,48,55,209,21,6,21,5,0,14,12,1,60]
["2019-03-01",null,null,null,null,null,null,null,null,"F86627",null,13930,2,802,8962,23,610,35,27,9,339,674,620,421,2758,548,508,253,629,144,8177,988,2875,11361,216,160,74,11,26,1889,951,14,534,465,1734,410,239,288,840,239,48,221,74,5,170,162,39,304]
["2019-03-01",null,null,null,null,null,null,null,null,"F86644",null,10982,1,519,7041,160,247,36,27,5,166,277,270,171,1786,329,330,125,329,83,5746,640,1746,8523,165,124,53,0,28,1259,642,144,355,306,1059,210,117,145,592,112,18,98,39,0,77,80,12,157]
["2019-03-01",null,null,null,null,null,null,null,null,"F86650",null,8246,1,452,5548,31,141,10,8,2,91,168,205,114,1404,361,299,111,328,89,4444,534,1995,6622,111,54,26,0,14,742,352,1,258,258,653,121,67,78,497,63,13,51,16,1,43,37,10,98]
["2019-03-01",null,null,null,null,null,null,null,null,"F86664",null,8266,0,342,5244,25,146,12,10,1,121,169,147,63,1244,294,217,115,276,73,4442,403,1508,6525,98,65,39,0,9,880,501,3,355,182,692,179,68,83,396,104,21,93,32,0,98,68,14,130]
["2019-03-01",null,null,null,null,null,null,null,null,"F86666",null,14096,3,756,9555,34,401,116,100,24,268,448,606,421,4340,630,544,279,599,144,7525,942,3459,11363,219,184,87,0,25,1637,928,244,566,475,1445,195,124,147,818,100,28,92,44,0,67,76,5,156]
["2019-03-01",null,null,null,null,null,null,null,null,"F86679",null,5735,0,242,3625,26,78,10,9,1,52,81,116,92,1046,209,168,83,219,50,3075,378,1381,4303,38,34,13,1,6,470,313,57,141,149,427,55,34,41,249,40,12,37,13,0,25,17,8,49]
["2019-03-01",null,null,null,null,null,null,null,null,"F86689",null,4013,1,118,2803,9,78,6,2,1,58,79,38,25,489,85,81,32,106,29,2252,127,732,3111,27,17,6,0,4,285,155,1,102,75,258,54,35,41,123,32,1,29,10,0,24,19,4,42]
["2019-03-01",null,null,null,null,null,null,null,null,"F86696",null,5094,0,296,3402,13,159,6,2,1,85,182,95,70,799,236,206,81,177,33,1635,277,1135,4088,52,30,14,0,9,548,274,1,252,168,488,95,68,82,334,30,8,28,5,0,22,14,1,86]
["2019-03-01",null,null,null,null,null,null,null,null,"F86700",null,3766,1,217,2459,15,242,6,6,0,190,272,163,102,580,204,167,57,163,31,2063,190,911,3052,52,37,12,2,7,775,530,2,187,154,694,135,72,82,230,123,21,117,40,1,106,94,28,105]
["2019-03-01",null,null,null,null,null,null,null,null,"F86701",null,3270,0,226,2280,6,107,27,18,3,88,116,149,122,946,204,174,50,176,25,1841,237,961,2681,74,57,32,0,12,423,297,170,194,142,387,58,40,46,232,19,4,19,8,0,19,19,2,50]
["2019-03-01",null,null,null,null,null,null,null,null,"F86705",null,2995,0,168,2071,23,50,5,5,2,32,53,115,84,1070,121,111,57,156,28,1685,206,810,2432,29,20,10,0,2,287,162,2,152,104,256,51,31,35,182,28,4,24,11,0,27,15,3,41]
["2019-03-01",null,null,null,null,null,null,null,null,"F86708",null,2784,1,173,1684,29,65,11,9,3,43,67,127,86,912,132,109,66,155,50,1528,123,667,2167,28,23,7,0,4,376,182,81,127,90,343,56,33,40,197,14,3,14,5,0,10,8,4,41]
["2019-03-01",null,null,null,null,null,null,null,null,"F86712",null,3066,0,209,2185,4,82,3,3,0,56,85,30,21,401,179,158,53,126,31,1858,180,817,2592,20,17,6,1,5,354,211,0,167,135,338,49,27,32,215,12,5,12,2,1,10,11,0,40]
["2019-03-01",null,null,null,null,null,null,null,null,"Y01291",null,8804,0,421,5663,37,431,12,4,0,295,520,374,205,2200,397,325,137,415,74,4650,451,2200,7053,83,65,31,0,13,1189,718,1,288,253,1051,203,115,136,447,112,31,104,26,0,78,69,15,170]
["2019-03-01",null,null,null,null,null,null,null,null,"Y01839",null,6537,0,364,4325,51,114,28,17,4,91,125,186,145,1118,316,243,92,222,85,3665,499,1129,5218,100,74,32,0,12,746,460,2,209,205,639,121,66,82,399,93,6,83,42,0,67,73,4,93]
["2019-03-01",null,null,null,null,null,null,null,null,"Y02585",null,8137,2,170,5853,1,27,15,14,2,17,30,89,64,2488,116,97,75,223,49,4080,637,1388,6642,82,53,26,0,10,325,162,1,105,90,290,43,30,35,179,28,3,27,16,1,19,10,1,35]
["2019-03-01",null,null,null,null,null,null,null,null,"Total",null,265436,23,13629,174483,1025,6563,781,468,125,4554,7267,7821,5359,61270,11126,9503,3975,10230,2316,145691,16442,57019,211633,3274,2402,1053,35,435,28703,16577,2518,9937,8092,25431,4823,2886,3435,14575,2368,457,2171,786,21,1756,1617,305,3839]

{"sheet":"Control Panel","index":5,"n_rows":148,"n_cols":22,"rows_kept":148,"cut":false,"hidden":true,"merged":[]}
[null,"Control Panel","2018-06-30",null,null,null,"Select Dates"]
[null,"General Health",null,null,null,null,"April 2021",null,null,null,null,null,null,null,"OrgID",4,{"$f":"$P$6&ADDRESS(1,P2)&\":\"&ADDRESS($P$7,P2)","v":"'WF LDP TABLE'!$D$1:$D$10000"},null,null,"OrgID_A",10,{"$f":"$U$6&ADDRESS(1,U2)&\":\"&ADDRESS($U$7,U2)","v":"'Data 17-18'!$J$1:$J$1000"}]
["List Size","01. Listsize","List Size",null,null,null,"May 2021",null,null,null,null,null,null,null,"REL_D",2,{"$f":"$P$6&ADDRESS(1,P3)&\":\"&ADDRESS($P$7,P3)","v":"'WF LDP TABLE'!$B$1:$B$10000"},null,null,"REL_DA",1,{"$f":"$U$6&ADDRESS(1,U3)&\":\"&ADDRESS($U$7,U3)","v":"'Data 17-18'!$A$1:$A$1000"}]
["Age 16+","LDP.01: Aged 16yrs+","Age 16+","Age 16+","Age 16+",null,"June 2021",null,null,null,null,null,null,null,"IND"," -",{"$f":"$P$6&ADDRESS(P11,1)&\":\"&ADDRESS(P11,P8)","v":"'WF LDP TABLE'!$A$1:$BU$1"},null,null,"IND_A"," -",{"$f":"$U$6&ADDRESS(U11,1)&\":\"&ADDRESS(U11,U8)","v":"'Data 17-18'!$A$1:$BU$1"}]
["% list size",{"$f":"\"%\"&B4","v":"%LDP.01: Aged 16yrs+"},"% list size","% list size","% list size",null,"July 2021",null,null,null,null,null,null,null,"NwID",2,{"$f":"$P$6&ADDRESS(1,P5)&\":\"&ADDRESS($P$7,P5)","v":"'WF LDP TABLE'!$B$1:$B$10000"},null,null,"NwID_A",2,{"$f":"$U$6&ADDRESS(1,U5)&\":\"&ADDRESS($U$7,U5)","v":"'Data 17-18'!$B$1:$B$1000"}]
["16+ and BMI (last 12m)","LDP.01.01: Obesity BMI recorded (last 12m)","16+ and BMI (last 12m)","16+ and BMI (last 12m)","16+ and BMI (last 12m)",null,"August 2021",null,null,null,null,null,null,null,"Data",{"$f":"IF(P9=\"N\",\"BLANK!\",\"'\"&P10&\"'!\")","v":"'WF LDP TABLE'!"},null,null,null,"Data",{"$f":"IF(U9=\"N\",\"BLANK!\",\"'\"&U10&\"'!\")","v":"'Data 17-18'!"}]
["% 16+",{"$f":"\"%\"&B6","v":"%LDP.01.01: Obesity BMI recorded (last 12m)"},"% 16+","% 16+","% 16+",null,"September 2021",null,null,null,null,null,null,null,"Rows",10000,null,null,null,"Rows",1000]
["BMI 25 to 29 ","LDP.01.01.02: Obesity BMI between 30-35 (last 12m)","BMI 25 to 29 ","BMI ≥30 & <35","BMI ≥30 & <35",null,"October 2021",null,null,null,null,null,null,null,"Columns",73,null,null,null,"Columns",73]
["% 16+ ",{"$f":"\"%\"&B8","v":"%LDP.01.01.02: Obesity BMI between 30-35 (last 12m)"},"% 16+ ","% 16+ ","% 16+ ",null,"November 2021",null,null,null,null,null,null,null,"Data (Y/N)","Y",null,null,null,"Data (Y/N)","Y"]
[" BMI ≥ 30","LDP.01.01.01: Obesity BMI more than or equal to 35 less than 40 (last 12m)"," BMI ≥ 30"," BMI ≥ 35 & <40"," BMI ≥ 35 & <40",null,"December 2021",null,null,null,null,null,null,null,"Q Work Sheet","WF LDP TABLE",{"$f":"$P$6&ADDRESS(1,1)&\":\"&ADDRESS(P7,P8)","v":"'WF LDP TABLE'!$A$1:$BU$10000"},null,null,"Q Work Sheet","Data 17-18",{"$f":"$U$6&ADDRESS(1,1)&\":\"&ADDRESS(U7,U8)","v":"'Data 17-18'!$A$1:$BU$1000"}]
["%16+ ",{"$f":"\"%\"&B10","v":"%LDP.01.01.01: Obesity BMI more than or equal to 35 less than 40 (last 12m)"},"%16+ ","%16+ ","%16+ ",null,"January 2022",null,null,null,null,null,null,null,"Header Row",1,null,null,null,"Header Row",1]
["BMI ≥ 40","LDP.01.01.03: Obesity BMI equal to or over 40 (last 12m)","BMI ≥ 40","BMI ≥ 40","BMI ≥ 40",null,"February 2022",null,null,null,null,null,null,null,"Header Row 2",3,null,null,null,"Header Row 2",3]
["%16+ ",{"$f":"\"%\"&B12","v":"%LDP.01.01.03: Obesity BMI equal to or over 40 (last 12m)"},"%16+ ","%16+ ","%16+ ",null,"March 2022"]
["Smoking status (last 12m) incl. never smoked","LDP.01.02: Smoking Status (last 12m) or Never Smoked (25yrs+)","Smoking status (last 12m) incl. never smoked","Smoking status (last 12m) incl. never smoked","Smoking status (last 12m) incl. never smoked",null,null,null,"April 2021","2021-05-01"]
["% 16+ ",{"$f":"\"%\"&B14","v":"%LDP.01.02: Smoking Status (last 12m) or Never Smoked (25yrs+)"},"% 16+ ","% 16+ ","% 16+ ",null,null,null,"May 2021","2021-06-01"]
["Age 16+ and current smoker (last 12m)","LDP.01.03: Current Smoker (last 12m)","Age 16+ and current smoker (last 12m)","Age 16+ and current smoker (last 12m)","Age 16+ and current smoker (last 12m)",null,null,null,"June 2021","2021-07-01"]
["% 16+",{"$f":"\"%\"&B16","v":"%LDP.01.03: Current Smoker (last 12m)"},"% 16+","% 16+","% 16+",null,null,null,"July 2021","2021-08-01"]
[null,"Hypertension",null,null,null,null,null,null,"August 2021","2021-09-01"]
["Hypertension Register","LDP.02: Hypertension Register","Hypertension Register","Hypertension Register","Hypertension Register",null,null,null,"September 2021","2021-10-01"]
["% list size",{"$f":"\"%\"&B19","v":"%LDP.02: Hypertension Register"},"% list size","% list size","% list size",null,null,null,"October 2021","2021-11-01"]
["Hypertension and BP (last 9m)","LDP.02.02: Hypertension BP recorded (last 12m)","Hypertension and BP (last 9m)","Hypertension and BP (last 12m)","Hypertension and BP (last 12m)",null,null,null,"November 2021","2021-12-01"]
["% Hypertension Register",{"$f":"\"%\"&B21","v":"%LDP.02.02: Hypertension BP recorded (last 12m)"},"% Hypertension Register","% Hypertension Register","% Hypertension Register",null,null,null,"December 2021","2022-01-01"]
["Hypertension and BP ≤ 150/90 (last 9m)","LDP.02.01: Hypertension and BP < 140/90 (age under 80) < 150/90 (Age 80+)","Hypertension and BP ≤ 150/90 (last 9m)","Hypertension and BP  < 140/90 (Patients aged under 80)  < 150/90 ( Aged 80 and over) (last 12m)","Hypertension and BP  < 140/90 (Patients aged under 80)  < 150/90 ( Aged 80 and over) (last 12m)",null,null,null,"January 2022","2022-02-01"]
["% Hypertension Register",{"$f":"\"%\"&B23","v":"%LDP.02.01: Hypertension and BP < 140/90 (age under 80) < 150/90 (Age 80+)"},"% Hypertension Register","% Hypertension Register","% Hypertension Register",null,null,null,"February 2022","2022-03-01"]
[null,"CHD",null,null,null,null,null,null,"March 2022","2022-04-01"]
["CHD register","LDP.03: CHD Register","CHD register","CHD register","CHD register"]
["% list size",{"$f":"\"%\"&B26","v":"%LDP.03: CHD Register"},"% list size","% list size","% list size"]
["Cholesterol (last 12m)","LDP.03.04: CHD Cholesterol recorded (last 12m)","Cholesterol (last 12m)","Cholesterol (last 12m)","Cholesterol (last 12m)"]
["% CHD register",{"$f":"\"%\"&B28","v":"%LDP.03.04: CHD Cholesterol recorded (last 12m)"},"% CHD register","% CHD register","% CHD register"]
["Cholesterol ≤ 5 (last 12m)","LDP.03.01: CHD Chol less than 5mmol (last 12m)","Cholesterol ≤ 5 (last 12m)","Cholesterol < 5 (last 12m)","Cholesterol < 5 (last 12m)"]
["% CHD register",{"$f":"\"%\"&B30","v":"%LDP.03.01: CHD Chol less than 5mmol (last 12m)"},"% CHD register","% CHD register","% CHD register"]
["BP (last 9m)","LDP.03.02: CHD BP less than or equal 150/90 (last 9m)","BP (last 9m)","BP ≤ 150/90 (last 9m)","BP ≤ 150/90 (last 9m)"]
["% CHD register",{"$f":"\"%\"&B32","v":"%LDP.03.02: CHD BP less than or equal 150/90 (last 9m)"},"% CHD register","% CHD register","% CHD register"]
["BP ≤ 150/90 (last 9m)","LDP.03.05: CHD BP recorded (last 9m)","BP ≤ 150/90 (last 9m)"]
["% CHD register",{"$f":"\"%\"&B34","v":"%LDP.03.05: CHD BP recorded (last 9m)"},"% CHD register"]
["CHD annual review or proxy review","LDP.03.03: CHD Annual Review & Proxy (last 12m)","CHD annual review or proxy review"]
["% CHD register",{"$f":"\"%\"&B36","v":"%LDP.03.03: CHD Annual Review & Proxy (last 12m)"},"% CHD register"]
["CHD diagnosed in last 6 months","LDP.03.06: CHD Diagnosed (Last 6 months)","CHD diagnosed in last 6 months"]
["% CHD register",{"$f":"\"%\"&B38","v":"%LDP.03.06: CHD Diagnosed (Last 6 months)"},"% CHD register"]
[null,"Stroke/TIA"]
[null,"LDP.10 Stroke or TIA register",null,null,"Stroke/TIA register"]
[null,"%LDP.10 Stroke or TIA register",null,null,"% list size"]
[null,"LDP.10.01: Stroke/TIA BP recorded (last 12m)",null,null,"Patients on Stroke/TIA register with BP recorded"]
[null,"%LDP.10.01: Stroke/TIA BP recorded (last 12m)",null,null,"% of stroke register"]
[null,"LDP.10.02 Patients on Stroke/TIA register with BP <140/90 (12m)",null,null,"Patients on Stroke/TIA register with BP <140/90 (12m)"]
[null,"%LDP.10.02 Patients on Stroke/TIA register with BP <140/90 (12m)",null,null,"% of stroke register"]
[null,"CVD Risk"]
["Aged 35 to 74 (exc CVD) ","LDP.05: CVD 25-84yrs (excl CVD)","Aged 35 to 74 (exc CVD) ","Aged 25 to 84 (exc CVD) ","Aged 25 to 84 (exc CVD) "]
["CVD (QRISK or Framingham) risk score done","LDP.05.02: Cardiovascular Risk Score Done (5y)","CVD (QRISK or Framingham) risk score done","QRISK recorded (5 years)","QRISK recorded (5 years)"]
["% of patients aged 35 to 74 (exc CVD)",{"$f":"\"%\"&B49","v":"%LDP.05.02: Cardiovascular Risk Score Done (5y)"},"% of patients aged 35 to 74 (exc CVD)","% of patients aged 25 to 84 (exc CVD)","% of patients aged 25 to 84 (exc CVD)"]
["QRISK ≥ 20% ","LDP.05.01: CVD QRISK greater than or equal 20%","QRISK ≥ 20% ","QRISK ≥ 20% ","QRISK ≥ 20% "]
["% QRISK Score recorded",{"$f":"\"%\"&B51","v":"%LDP.05.01: CVD QRISK greater than or equal 20%"},"% QRISK Score recorded","% QRISK Score recorded","% QRISK Score recorded"]
["QRISK ≥ 20% and proxy review (BP and Chol last 12m)","LDP.05.01.01: CVD Proxy Annual Review (last 12m)","QRISK ≥ 20% and proxy review (BP and Chol last 12m)","QRISK ≥ 20% and proxy review (BP and Chol last 12m)","QRISK ≥ 20% and proxy review (BP and Chol last 12m)"]
["% Patients with QRISK ≥ 20%",{"$f":"\"%\"&B53","v":"%LDP.05.01.01: CVD Proxy Annual Review (last 12m)"},"% Patients with QRISK ≥ 20%","% Patients with QRISK ≥ 20%","% Patients with QRISK ≥ 20%"]
[null,"Diabetes"]
["Diabetes register","LDP.04: Diabetes Register","Diabetes register","Diabetes register","Diabetes register"]
["% List size",{"$f":"\"%\"&B56","v":"%LDP.04: Diabetes Register"},"% List size","% List size","% List size"]
["Annual review/ called or proxy (last 12m)","LDP.04.02: Diabetes Called & Annual Review or Proxy (last 12m)","Annual review/ called or proxy (last 12m)","BP (last 12m)","BP (last 12m)"]
["% Diabetes register",{"$f":"\"%\"&B58","v":"%LDP.04.02: Diabetes Called & Annual Review or Proxy (last 12m)"},"% Diabetes register","% Diabetes Register","% Diabetes Register"]
["BP (last 12m)","LDP.04.11: Diabetes and BP in last 12 months","BP (last 12m)","BP <  145/85  (last 12m)","BP <  145/85  (last 12m)"]
["% Diabetes Register",{"$f":"\"%\"&B60","v":"%LDP.04.11: Diabetes and BP in last 12 months"},"% Diabetes Register","% Diabetes Register","% Diabetes Register",null,"Practices"]
["BP ≤  145/85  (last 12m)","LDP.04.09: Diabetes BP less than 145/85 (last 12m)","BP ≤  145/85  (last 12m)","Cholesterol < 5mmols (last 12m)","Cholesterol < 5mmols (last 12m)",null,null,"The Firs Medical Centre","F86001"]
["% Diabetes Register",{"$f":"\"%\"&B62","v":"%LDP.04.09: Diabetes BP less than 145/85 (last 12m)"},"% Diabetes Register","% Diabetes Register","% Diabetes Register",null,null,"Penryhn Surgery","F86005"]
["Cholesterol (last 12m)","LDP.04.12: Diabetes and cholesterol in last 15 mths","Cholesterol (last 12m)","HbA1c < 59 (last 12m)","HbA1c < 59 (last 12m)",null,null,"Seymour Medical Centre","F86006"]
["% Diabetes Register",{"$f":"\"%\"&B64","v":"%LDP.04.12: Diabetes and cholesterol in last 15 mths"},"% Diabetes Register","% Diabetes register","% Diabetes register",null,null,"The Manor Practice ","F86011"]
["Cholesterol < 5mmols (last 12m)","LDP.04.08: Diabetes Chol less than 5mmol (last 12m)","Cholesterol < 5mmols (last 12m)","Flu jab (last 12m)","Flu jab (From August 2021)",null,null,"Queens Road Medical Centre","F86030"]
["% Diabetes Register",{"$f":"\"%\"&B66","v":"%LDP.04.08: Diabetes Chol less than 5mmol (last 12m)"},"% Diabetes Register","% Diabetes Register","% Diabetes Register",null,null,"The Allum Medical Centre","F86036"]
["HbA1c ≤ 59(last 12m)","LDP.04.01: Diabetes HbA1c <7.5% OR <59mmol (last 12m)","HbA1c ≤ 59(last 12m)",null,null,null,null,"SMA Medical Centre","F86038"]
["% Diabetes register",{"$f":"\"%\"&B68","v":"%LDP.04.01: Diabetes HbA1c <7.5% OR <59mmol (last 12m)"},"% Diabetes register",null,null,null,null,"Crawley Road Medical Centre","F86044"]
["HbA1c ≤ 86 (last 12m)","LDP.04.10: Diabetes HbA1c <=10% OR <=86mmol (last 12m)","HbA1c ≤ 86 (last 12m)",null,null,null,null,"High Road Surgery ","F86045"]
["% Diabetes Register",{"$f":"\"%\"&B70","v":"%LDP.04.10: Diabetes HbA1c <=10% OR <=86mmol (last 12m)"},"% Diabetes Register",null,null,null,null,"St James Medical Practice Ltd","F86058"]
["Diabetes retinal screening (last 12m)","LDP.04.03: Diabetes Digital retinal screening or Seen by retinal screener","Diabetes retinal screening (last 12m)",null,null,null,null,"The Grove Road Medical Centre","F86062"]
["% Diabetes register",{"$f":"\"%\"&B72","v":"%LDP.04.03: Diabetes Digital retinal screening or Seen by retinal screener"},"% Diabetes register",null,null,null,null,"The Ridgeway Surgery","F86078"]
["Retinal screening (last 12m)","LDP.04.04: Diabetes Retinal Screening (QoF) (last 12m)","Retinal screening (last 12m)",null,null,null,null,"Dr Dhital Practice","F86086"]
["% Diabetes register",{"$f":"\"%\"&B74","v":"%LDP.04.04: Diabetes Retinal Screening (QoF) (last 12m)"},"% Diabetes register",null,null,null,null,"The Lyndhurst Surgery","F86088"]
["Neuropathy testing (last 12m)","LDP.04.05: Diabetes Neuropathy Test (last 12m)","Neuropathy testing (last 12m)",null,null,null,null,"Addison Road Medical Practice","F86607"]
["% Diabetes Register",{"$f":"\"%\"&B76","v":"%LDP.04.05: Diabetes Neuropathy Test (last 12m)"},"% Diabetes Register",null,null,null,null,"The Old Church Surgery","F86616"]
["Microalbuminuria (last 12m)","LDP.04.06: Diabetes Microalbuminuria Test (latest last 12m)","Microalbuminuria (last 12m)",null,null,null,null,"Green Man Medical Centre","F86621"]
["% Diabetes Register",{"$f":"\"%\"&B78","v":"%LDP.04.06: Diabetes Microalbuminuria Test (latest last 12m)"},"% Diabetes Register",null,null,null,null,"L.L. Medical Care Ltd (Agarwal & Agrawal Practice)","F86625"]
["Flu jab (last 12m)","LDP.04.07: Diabetes Influenza Vaccinations (From August 2018)","Flu jab (last 12m)",null,null,null,null,"Dr Shantir's Practice - Forest Road Medical Centre","F86626"]
["% Diabetes Register",{"$f":"\"%\"&B80","v":"%LDP.04.07: Diabetes Influenza Vaccinations (From August 2018)"},"% Diabetes Register",null,null,null,null,"Churchill Medical Centre","F86627"]
["Type 1 Diabetes","LDP.04.13. Type 1 Diabetes","Type 1 Diabetes",null,null,null,null,"Waltham Forest Community And FHS Ltd","F86644"]
["% Diabetes Register",{"$f":"\"%\"&B82","v":"%LDP.04.13. Type 1 Diabetes"},"% Diabetes Register",null,null,null,null,"Lime Tree Surgery","F86650"]
["Type 2 Diabetes","LDP.04.14. Type 2 Diabetes","Type 2 Diabetes",null,null,null,null,"Larkshall Medical Centre ","F86664"]
["% Diabetes Register",{"$f":"\"%\"&B84","v":"%LDP.04.14. Type 2 Diabetes"},"% Diabetes Register",null,null,null,null,"The Harrow Rd GP Surgery ","F86666"]
["No Type Recorded","No Type Recorded","No Type Recorded",null,null,null,null,"Higham Hill Medical Centre","F86679"]
["% Diabetes Register",{"$f":"\"%\"&B86","v":"%No Type Recorded"},"% Diabetes Register",null,null,null,null,"The Bailey Practice ","F86689"]
["Type 2 diabetes excluding insulin prescriptions  (last 15 m)","LDP 04.14.01 Excl Insulin Prescription (12m)","Type 2 diabetes excluding insulin prescriptions  (last 15 m)",null,null,null,null,"Francis Road Medical Centre","F86696"]
["% Type 2 Diabetes",{"$f":"\"%\"&B88","v":"%LDP 04.14.01 Excl Insulin Prescription (12m)"},"% Type 2 Diabetes",null,null,null,null,"Kingshead Medical Practice","F86700"]
["Newly Diagnosed Diabetes (Last 1m)","LDP.04.19 Newly Diagnosed Diabetes (last 1m)","Newly Diagnosed Diabetes (Last 1m)",null,null,null,null,"Kiyani Medical Practice","F86701"]
["Newly Diagnosed Diabetes - Type 1","LDP.04.19.01 Newly Diagnosed Type 1","Newly Diagnosed Diabetes - Type 1",null,null,null,null,"Langthorne Sharma Family Practice","F86705"]
["Newly Diagnosed Diabetes - Type 2","LDP.04.19.02 Newly Diagnosed Type 2","Newly Diagnosed Diabetes - Type 2",null,null,null,null,"Claremont Medical Centre","F86708"]
["Newly Diagnosed Diabetes - Type Not Recorded",{"$f":"\"%\"&B92","v":"%LDP.04.19.02 Newly Diagnosed Type 2"},"Newly Diagnosed Diabetes - Type Not Recorded",null,null,null,null,"Hampton Medical Centre","F86712"]
["Diabetics under 18 years old","LDP.04.15 Diabetes (under 18)","Diabetics under 18 years old",null,null,null,null,"Chingford Medical Practice","Y01291"]
["Diabetics Under 18 with HbA1c ≤ 59 (last 12m)","LDP.04.15.01 Diabetes HbA1C <=7.5% OR <=59mmol (12m)","Diabetics Under 18 with HbA1c ≤ 59 (last 12m)",null,null,null,null,"Lime Tree and Sinnott Healthcare Ltd","Y01839"]
["% of Diabetics under 18",{"$f":"\"%\"&B95","v":"%LDP.04.15.01 Diabetes HbA1C <=7.5% OR <=59mmol (12m)"},"% of Diabetics under 18",null,null,null,null,"Waltham Forest","Total"]
["No. of patients with diabetes diagnosed with CKD in the last 12m","LDP.04.16 Diabetes and CKD Diagnosed (12m)","No. of patients with diabetes diagnosed with CKD in the last 12m"]
["% Diabetes Register",{"$f":"\"%\"&B97","v":"%LDP.04.16 Diabetes and CKD Diagnosed (12m)"},"% Diabetes Register"]
["No. of patients with diabetes diagnosed with CHD and/or Stroke/TIA in the last 12 months","LDP.04.17 Diabetes and Stroke or CHD Diagnosed (12m)","No. of patients with diabetes diagnosed with CHD and/or Stroke/TIA in the last 12 months"]
["% Diabetes Register",{"$f":"\"%\"&B99","v":"%LDP.04.17 Diabetes and Stroke or CHD Diagnosed (12m)"},"% Diabetes Register"]
["No. of patients with diabetes diagnosed with Depression in the last 12 months","LDP.04.18 Diabetes and Depression (last 12m)","No. of patients with diabetes diagnosed with Depression in the last 12 months"]
["%Diabetes Register",{"$f":"\"%\"&B101","v":"%LDP.04.18 Diabetes and Depression (last 12m)"},"%Diabetes Register"]
["No. of patients who have ever had gestational diabetes ","LDP.07 Gestational Diabetes","No. of patients who have ever had gestational diabetes "]
["No. of patients who have ever had gestational diabetes who are also on diabetes register","LDP.07.01 Diabetes dx after Gestational Diabetes","No. of patients who have ever had gestational diabetes who are also on diabetes register"]
["% of patients with gestational diabetes",{"$f":"\"%\"&B104","v":"%LDP.07.01 Diabetes dx after Gestational Diabetes"},"% of patients with gestational diabetes"]
[null,"Mental Health"]
["SMI register (QOF)","CSPMH.01 SMI Register","SMI register (QOF)","Mental Health register","Mental Health register"]
["% list size",{"$f":"\"%\"&B107","v":"%CSPMH.01 SMI Register"},"% list size","% list size","% list size"]
["No. of SMI Patients with smoking status recorded (last 12m) or never smoked","CSPMH.01.02 Smoking Status Recorded (12m)","No. of SMI Patients with smoking status recorded (last 12m) or never smoked","No. of Mental Health Patients with smoking status recorded (last 12m) or never smoked","No. of Mental Health Patients with smoking status recorded (last 12m) or never smoked"]
["% SMI Register",{"$f":"\"%\"&B109","v":"%CSPMH.01.02 Smoking Status Recorded (12m)"},"% SMI Register","% Mental Health Register","% Mental Health Register"]
["No. of SMI patients recorded as a Smoker","CSPMH.01.02.01 Current Smoker (12m)","No. of SMI patients recorded as a Smoker","No. of Mental Health patients recorded as a Smoker","No. of Mental Health patients recorded as a Smoker"]
["% SMI Register",{"$f":"\"%\"&B111","v":"%CSPMH.01.02.01 Current Smoker (12m)"},"% SMI Register","% Mental Health Register","% Mental Health Register"]
["No. of SMI Patients who are current smokers & referred to the Stop Smoking Clinic","CSPMH 01.02.01.01 Ref to clinic 12m","No. of SMI Patients who are current smokers & referred to the Stop Smoking Clinic","No. of Mental Health Patients who are current smokers & referred to the Stop Smoking Clinic","No. of Mental Health Patients who are current smokers & referred to the Stop Smoking Clinic"]
["% SMI Register",{"$f":"\"%\"&B113","v":"%CSPMH 01.02.01.01 Ref to clinic 12m"},"% SMI Register","% Mental Health Register","% Mental Health Register"]
["No. Of SMI Patients who are recorded as quitters","CSPMH.01.02.02 Ex-smoker Recorded (latest 12m)","No. Of SMI Patients who are recorded as quitters","No. Of Mental Health Patients who are recorded as quitters","No. Of Mental Health Patients who are recorded as quitters"]
["% SMI Register",{"$f":"\"%\"&B115","v":"%CSPMH.01.02.02 Ex-smoker Recorded (latest 12m)"},"% SMI Register","% Mental Health Register","% Mental Health Register"]
[" Patients with SMI with QRISK recorded in the last 12m","CSPMH. 01.03 QRisk Recorded (12m)"," Patients with SMI with QRISK recorded in the last 12m"," Patients with Mental Health with QRISK recorded in the last 12m"," Patients with Mental Health with QRISK recorded in the last 12m"]
["% SMI Register",{"$f":"\"%\"&B117","v":"%CSPMH. 01.03 QRisk Recorded (12m)"},"% SMI Register","% Mental Health Register","% Mental Health Register"]
[" Patients with SMI with QRISK 20% or higher in the last 12m","CSPMH. 01.03.02 Qrisk>=20 (12m)"," Patients with SMI with QRISK 20% or higher in the last 12m"," Patients with Mental Health with QRISK 20% or higher in the last 12m"," Patients with Mental Health with QRISK 20% or higher in the last 12m"]
["% patients with QRISK recorded 20% or higher",{"$f":"\"%\"&B119","v":"%CSPMH. 01.03.02 Qrisk>=20 (12m)"},"% patients with QRISK recorded 20% or higher","% patients with QRISK recorded","% patients with QRISK recorded"]
["Patients with SMI with BP & QRisk  on the same day in the last 12m","CSPMH. 01.03.01 BP recorded on same day as QRisk (12m)","Patients with SMI with BP & QRisk  on the same day in the last 12m","Patients with Mental Health with BP & QRisk  on the same day in the last 12m","Patients with Mental Health with BP & QRisk  on the same day in the last 12m"]
["% Patients with SMI with BP & QRisk  on the same day in the last 12m",{"$f":"\"%\"&B121","v":"%CSPMH. 01.03.01 BP recorded on same day as QRisk (12m)"},"% Patients with SMI with BP & QRisk  on the same day in the last 12m","% Mental Health Register","% Mental Health Register"]
[null,"CKD"]
["No. of patients on CKD register (QOF definition)","LDP.08 CKD Register","No. of patients on CKD register","No. of patients on CKD register","No. of patients on CKD register"]
["% List Size",{"$f":"\"%\"&B124","v":"%LDP.08 CKD Register"},"% List Size","% List Size","% List Size"]
["BP Recorded (last 12m)","LDP.08.03 CKD and BP Recorded (last 12 m)","BP Recorded (last 12m)","BP Recorded (last 12m)","BP Recorded (last 12m)"]
["% CKD register",{"$f":"\"%\"&B126","v":"%LDP.08.03 CKD and BP Recorded (last 12 m)"},"% CKD register","% CKD register","% CKD register"]
["BP ≤ 140/90","LDP.08.01 CKD and BP less than 140/90 (last 12 m)","BP ≤ 140/90","BP < 140/90","BP < 140/90"]
["% CKD register",{"$f":"\"%\"&B128","v":"%LDP.08.01 CKD and BP less than 140/90 (last 12 m)"},"% CKD register","% CKD register","% CKD register"]
["No of patients with new diagnosis of CKD (last 6m)","LDP.08.02 CKD Diagnosed (Last 6m)","No of patients with new diagnosis of CKD (last 6m)","No of patients with new diagnosis of CKD (last 6m)","No of patients with new diagnosis of CKD (last 6m)"]
["% CKD register",{"$f":"\"%\"&B130","v":"%LDP.08.02 CKD Diagnosed (Last 6m)"},"% CKD register","% CKD register","% CKD register"]
[null,"COPD"]
[null,"LDP.09 COPD Register","No. of patients on COPD register"]
[null,{"$f":"\"%\"&B133","v":"%LDP.09 COPD Register"},"% List Size"]
[null,"LDP.09.01 Patients with severe or very severe COPD (FEV1<50)","No of patients with severe or very severe COPD (FEV1<50)"]
[null,{"$f":"\"%\"&B135","v":"%LDP.09.01 Patients with severe or very severe COPD (FEV1<50)"},"% COPD register"]
[null,"LDP.09.02 Patients with smoking status recorded (last 12m) or never smoked","No. of COPD Patients with smoking status recorded (last 12m) or never smoked"]
[null,{"$f":"\"%\"&B137","v":"%LDP.09.02 Patients with smoking status recorded (last 12m) or never smoked"},"% COPD"]
[null,"LDP.09.03 COPD patients recorded as a Smoker","No. of COPD patients recorded as a Smoker"]
[null,{"$f":"\"%\"&B139","v":"%LDP.09.03 COPD patients recorded as a Smoker"},"% COPD"]
[null,"LDP.09.04 COPD Patients who are current smokers & referred to the Stop Smoking C","No. of COPD Patients who are current smokers & referred to the Stop Smoking Clinic (12m)"]
[null,{"$f":"\"%\"&B141","v":"%LDP.09.04 COPD Patients who are current smokers & referred to the Stop Smoking C"},"% of current COPD smokers"]
[null,"LDP.09.05 No of COPD with flu vaccination (From August 2018)","No of COPD with flu  vaccination (From August 2021)"]
[null,{"$f":"\"%\"&B143","v":"%LDP.09.05 No of COPD with flu vaccination (From August 2018)"},"% of COPD register"]
[null,"LDP.09.06 No of COPD with pneumococcal vaccination ever","No of COPD with pneumococcal vaccination ever"]
[null,{"$f":"\"%\"&B145","v":"%LDP.09.06 No of COPD with pneumococcal vaccination ever"},"% of COPD register"]
[null,"LDP.09.07 No of COPD patients referred to pulmonary rehab ever","No of COPD patients referred to pulmonary rehab ever"]
[null,{"$f":"\"%\"&B147","v":"%LDP.09.07 No of COPD patients referred to pulmonary rehab ever"},"% of COPD register"]

{"sheet":"Month by month","index":6,"n_rows":108,"n_cols":17,"rows_kept":108,"cut":false,"hidden":false,"merged":[]}
[]
[null,null,"Waltham Forest",null,null,null,null,"Practice Clinical Trends (LDP) Report Summary 2021 / 2022"]
[null,null,null,"2020-04-01","2021-04-01","2021-05-01","2021-06-01","2021-07-01","2021-08-01","2021-09-01","2021-10-01","2021-11-01","2021-12-01","2022-01-01","2022-02-01","2022-03-01","2022-04-01"]
[null,null,{"$f":"VLOOKUP(C2,'Control Panel'!H61:I112,2,FALSE)","v":"Total"},"2020-03-01","2021-03-01","2021-04-01","2021-05-01","2021-06-01","2021-07-01","2021-08-01","2021-09-01","2021-10-01","2021-11-01","2021-12-01","2022-01-01","2022-02-01","2022-03-01"]
[]
[null,null,{"$f":"'Control Panel'!B2","v":"General Health"}]
[{"$f":"'Control Panel'!B3","v":"01. Listsize"},"01. Listsize",{"$f":"'Control Panel'!C3","v":"List Size"},{"$f":"SUMIFS(OFFSET(REL_D,,MATCH($A7,IND,0)-2),REL_D,D$3,OrgID,$C$4)","v":266163},267248,281413,267785,268154,268418,268730,268596,269393,269037,269368,269495,269561,269929]
[{"$f":"'Control Panel'!B4","v":"LDP.01: Aged 16yrs+"},"LDP.01: Aged 16yrs+",{"$f":"'Control Panel'!D4","v":"Age 16+"},213103,214483,226132,215139,215568,215850,216195,216107,216809,216576,216987,217147,217206,217516]
[{"$f":"'Control Panel'!B5","v":"%LDP.01: Aged 16yrs+"},"%LDP.01: Aged 16yrs+",{"$f":"'Control Panel'!D5","v":"% list size"},{"$f":"IFERROR(D8/D7,\"N/A\")","v":0.80100000000000005},0.80300000000000005,{"$f":"IFERROR(F8/F7,\"N/A\")","v":0.80400000000000005},{"$f":"IFERROR(G8/G7,\"N/A\")","v":0.80300000000000005},0.80400000000000005,0.80400000000000005,0.80500000000000005,0.80500000000000005,0.80500000000000005,0.80500000000000005,0.80600000000000005,0.80600000000000005,0.80600000000000005,0.80600000000000005]
[{"$f":"'Control Panel'!B6","v":"LDP.01.01: Obesity BMI recorded (last 12m)"},"LDP.01.01: Obesity BMI recorded (last 12m)",{"$f":"'Control Panel'!D6","v":"16+ and BMI (last 12m)"},{"$f":"SUMIFS(OFFSET(REL_D,,MATCH($A10,IND,0)-2),REL_D,D$3,OrgID,$C$4)","v":56953},32095,36186,37128,39159,40830,42054,43647,45018,46494,47462,48634,49874,50850]
[{"$f":"'Control Panel'!B7","v":"%LDP.01.01: Obesity BMI recorded (last 12m)"},"%LDP.01.01: Obesity BMI recorded (last 12m)",{"$f":"'Control Panel'!D7","v":"% 16+"},{"$f":"IFERROR(D10/D8,\"N/A\")","v":0.26700000000000002},0.15,{"$f":"IFERROR(F10/F8,\"N/A\")","v":0.16},{"$f":"IFERROR(G10/G8,\"N/A\")","v":0.17299999999999999},0.182,0.189,0.19500000000000001,0.20200000000000001,0.20799999999999999,0.215,0.219,0.224,0.23,0.23400000000000001]
["LDP.01.01.02: Obesity BMI between 30-35 (last 12m)","LDP.01.01.02: Obesity BMI between 30-35 (last 12m)",{"$f":"'Control Panel'!D8","v":"BMI ≥30 & <35"},{"$f":"SUMIFS(OFFSET(REL_D,,MATCH($A12,IND,0)-2),REL_D,D$3,OrgID,$C$4)","v":10419},5907,6569,6750,7126,7459,7738,8039,8283,8572,8724,8985,9319,9584]
[{"$f":"'Control Panel'!B9","v":"%LDP.01.01.02: Obesity BMI between 30-35 (last 12m)"},"%LDP.01.01.02: Obesity BMI between 30-35 (last 12m)",{"$f":"'Control Panel'!D9","v":"% 16+ "},{"$f":"IFERROR(D12/D8,\"N/A\")","v":4.9000000000000002E-2},2.8000000000000001E-2,{"$f":"IFERROR(F12/F8,\"N/A\")","v":2.9000000000000001E-2},{"$f":"IFERROR(G12/G8,\"N/A\")","v":3.1E-2},3.3000000000000002E-2,3.5000000000000003E-2,3.5999999999999997E-2,3.6999999999999998E-2,3.7999999999999999E-2,0.04,0.04,4.1000000000000002E-2,4.2999999999999997E-2,4.3999999999999997E-2]
["LDP.01.01.01: Obesity BMI more than or equal to 35 less than 40 (last 12m)","LDP.01.01.01: Obesity BMI more than or equal to 35 less than 40 (last 12m)",{"$f":"'Control Panel'!D10","v":" BMI ≥ 35 & <40"},{"$f":"SUMIFS(OFFSET(REL_D,,MATCH($A14,IND,0)-2),REL_D,D$3,OrgID,$C$4)","v":4230},2319,2654,2726,2865,3001,3136,3301,3431,3543,3638,3750,3825,3934]
[{"$f":"'Control Panel'!B11","v":"%LDP.01.01.01: Obesity BMI more than or equal to 35 less than 40 (last 12m)"},"%LDP.01.01.01: Obesity BMI more than or equal to 35 less than 40 (last 12m)",{"$f":"'Control Panel'!D11","v":"%16+ "},{"$f":"IFERROR(D14/D8,\"N/A\")","v":0.02},1.0999999999999999E-2,{"$f":"IFERROR(F14/F8,\"N/A\")","v":1.2E-2},{"$f":"IFERROR(G14/G8,\"N/A\")","v":1.2999999999999999E-2},1.2999999999999999E-2,1.4E-2,1.4999999999999999E-2,1.4999999999999999E-2,1.6E-2,1.6E-2,1.7000000000000001E-2,1.7000000000000001E-2,1.7999999999999999E-2,1.7999999999999999E-2]
[{"$f":"'Control Panel'!B12","v":"LDP.01.01.03: Obesity BMI equal to or over 40 (last 12m)"},"LDP.01.01.03: Obesity BMI equal to or over 40 (last 12m)",{"$f":"'Control Panel'!D12","v":"BMI ≥ 40"},{"$f":"SUMIFS(OFFSET(REL_D,,MATCH($A16,IND,0)-2),REL_D,D$3,OrgID,$C$4)","v":2468},1496,1688,1760,1854,1926,2006,2109,2146,2218,2253,2290,2369,2445]
[{"$f":"'Control Panel'!B13","v":"%LDP.01.01.03: Obesity BMI equal to or over 40 (last 12m)"},"%LDP.01.01.03: Obesity BMI equal to or over 40 (last 12m)",{"$f":"'Control Panel'!D13","v":"%16+ "},{"$f":"IFERROR(D16/D8,\"N/A\")","v":1.2E-2},7.0000000000000001E-3,{"$f":"IFERROR(F16/F8,\"N/A\")","v":7.0000000000000001E-3},{"$f":"IFERROR(G16/G8,\"N/A\")","v":8.0000000000000002E-3},8.9999999999999993E-3,8.9999999999999993E-3,8.9999999999999993E-3,0.01,0.01,0.01,0.01,1.0999999999999999E-2,1.0999999999999999E-2,1.0999999999999999E-2]
[{"$f":"'Control Panel'!B14","v":"LDP.01.02: Smoking Status (last 12m) or Never Smoked (25yrs+)"},"LDP.01.02: Smoking Status (last 12m) or Never Smoked (25yrs+)",{"$f":"'Control Panel'!D14","v":"Smoking status (last 12m) incl. never smoked"},{"$f":"SUMIFS(OFFSET(REL_D,,MATCH($A18,IND,0)-2),REL_D,D$3,OrgID,$C$4)","v":146219},130452,138689,132033,132685,133179,134269,135111,136165,137009,137700,138403,139007,139372]
[{"$f":"'Control Panel'!B15","v":"%LDP.01.02: Smoking Status (last 12m) or Never Smoked (25yrs+)"},"%LDP.01.02: Smoking Status (last 12m) or Never Smoked (25yrs+)",{"$f":"'Control Panel'!D15","v":"% 16+ "},{"$f":"IFERROR(D18/D8,\"N/A\")","v":0.68600000000000005},0.60799999999999998,{"$f":"IFERROR(F18/F8,\"N/A\")","v":0.61299999999999999},{"$f":"IFERROR(G18/G8,\"N/A\")","v":0.61399999999999999},0.61599999999999999,0.61699999999999999,0.621,0.625,0.628,0.63300000000000001,0.63500000000000001,0.63700000000000001,0.64,0.64100000000000001]
[{"$f":"'Control Panel'!B16","v":"LDP.01.03: Current Smoker (last 12m)"},"LDP.01.03: Current Smoker (last 12m)",{"$f":"'Control Panel'!D16","v":"Age 16+ and current smoker (last 12m)"},{"$f":"SUMIFS(OFFSET(REL_D,,MATCH($A20,IND,0)-2),REL_D,D$3,OrgID,$C$4)","v":15312},8597,9655,9366,9661,9895,10270,10641,10962,11247,11431,11651,11928,11914]
[{"$f":"'Control Panel'!B17","v":"%LDP.01.03: Current Smoker (last 12m)"},"%LDP.01.03: Current Smoker (last 12m)",{"$f":"'Control Panel'!D17","v":"% 16+"},{"$f":"IFERROR(D20/D8,\"N/A\")","v":7.1999999999999995E-2},0.04,{"$f":"IFERROR(F20/F8,\"N/A\")","v":4.2999999999999997E-2},{"$f":"IFERROR(G20/G8,\"N/A\")","v":4.3999999999999997E-2},4.4999999999999998E-2,4.5999999999999999E-2,4.8000000000000001E-2,4.9000000000000002E-2,5.0999999999999997E-2,5.1999999999999998E-2,5.2999999999999999E-2,5.3999999999999999E-2,5.5E-2,5.5E-2]
[{"$f":"'Control Panel'!B18","v":"Hypertension"},"Hypertension",{"$f":"'Control Panel'!B18","v":"Hypertension"}]
[{"$f":"'Control Panel'!B19","v":"LDP.02: Hypertension Register"},"LDP.02: Hypertension Register",{"$f":"'Control Panel'!D19","v":"Hypertension Register"},{"$f":"SUMIFS(OFFSET(REL_D,,MATCH($A23,IND,0)-2),REL_D,D$3,OrgID,$C$4)","v":28734},28246,29867,28242,28203,28181,28167,28142,28187,28315,28294,28326,28304,28424]
[{"$f":"'Control Panel'!B20","v":"%LDP.02: Hypertension Register"},"%LDP.02: Hypertension Register",{"$f":"'Control Panel'!D20","v":"% list size"},{"$f":"IFERROR(D23/D7,\"N/A\")","v":0.108},0.106,{"$f":"IFERROR(F23/F7,\"N/A\")","v":0.106},{"$f":"IFERROR(G23/G7,\"N/A\")","v":0.105},0.105,0.105,0.105,0.105,0.105,0.105,0.105,0.105,0.105,0.105]
[{"$f":"'Control Panel'!B21","v":"LDP.02.02: Hypertension BP recorded (last 12m)"},"LDP.02.02: Hypertension BP recorded (last 12m)",{"$f":"'Control Panel'!D21","v":"Hypertension and BP (last 12m)"},{"$f":"SUMIFS(OFFSET(REL_D,,MATCH($A25,IND,0)-2),REL_D,D$3,OrgID,$C$4)","v":24893},16677,18331,17819,18245,18808,19409,19565,20036,20724,21043,21354,21534,22014]
[{"$f":"'Control Panel'!B22","v":"%LDP.02.02: Hypertension BP recorded (last 12m)"},"%LDP.02.02: Hypertension BP recorded (last 12m)",{"$f":"'Control Panel'!D22","v":"% Hypertension Register"},{"$f":"IFERROR(D25/D23,\"N/A\")","v":0.86599999999999999},0.59,{"$f":"IFERROR(F25/F23,\"N/A\")","v":0.61399999999999999},{"$f":"IFERROR(G25/G23,\"N/A\")","v":0.63100000000000001},0.64700000000000002,0.66700000000000004,0.68899999999999995,0.69499999999999995,0.71099999999999997,0.73199999999999998,0.74399999999999999,0.754,0.76100000000000001,0.77400000000000002]
["LDP.02.01: Hypertension and BP < 140/90 (age under 80) < 150/90 (Age 80+)","LDP.02.01: Hypertension and BP < 140/90 (age under 80) < 150/90 (Age 80+)",{"$f":"'Control Panel'!D23","v":"Hypertension and BP  < 140/90 (Patients aged under 80)  < 150/90 ( Aged 80 and over) (last 12m)"},{"$f":"SUMIFS(OFFSET(REL_D,,MATCH($A27,IND,0)-2),REL_D,D$3,OrgID,$C$4)","v":17010},11415,12473,12148,12445,12893,13328,13453,13743,14091,14345,14481,14633,14988]
["%LDP.02.01: Hypertension and BP < 140/90 (age under 80) < 150/90 (Age 80+)","%LDP.02.01: Hypertension and BP < 140/90 (age under 80) < 150/90 (Age 80+)",{"$f":"'Control Panel'!D24","v":"% Hypertension Register"},{"$f":"IFERROR(D27/D23,\"N/A\")","v":0.59199999999999997},0.40400000000000003,{"$f":"IFERROR(F27/F23,\"N/A\")","v":0.41799999999999998},{"$f":"IFERROR(G27/G23,\"N/A\")","v":0.43},0.441,0.45800000000000002,0.47299999999999998,0.47799999999999998,0.48799999999999999,0.498,0.50700000000000001,0.51100000000000001,0.51700000000000002,0.52700000000000002]
[{"$f":"'Control Panel'!B25","v":"CHD"},"CHD",{"$f":"'Control Panel'!B25","v":"CHD"}]
[{"$f":"'Control Panel'!B26","v":"LDP.03: CHD Register"},"LDP.03: CHD Register",{"$f":"'Control Panel'!D26","v":"CHD register"},{"$f":"SUMIFS(OFFSET(REL_D,,MATCH($A30,IND,0)-2),REL_D,D$3,OrgID,$C$4)","v":4806},4681,4917,4679,4688,4671,4669,4665,4672,4674,4680,4662,4645,4648]
[{"$f":"'Control Panel'!B27","v":"%LDP.03: CHD Register"},"%LDP.03: CHD Register",{"$f":"'Control Panel'!D27","v":"% list size"},{"$f":"IFERROR(D30/D7,\"N/A\")","v":1.7999999999999999E-2},1.7999999999999999E-2,{"$f":"IFERROR(F30/F7,\"N/A\")","v":1.7000000000000001E-2},{"$f":"IFERROR(G30/G7,\"N/A\")","v":1.7000000000000001E-2},1.7000000000000001E-2,1.7000000000000001E-2,1.7000000000000001E-2,1.7000000000000001E-2,1.7000000000000001E-2,1.7000000000000001E-2,1.7000000000000001E-2,1.7000000000000001E-2,1.7000000000000001E-2,1.7000000000000001E-2]
[{"$f":"'Control Panel'!B28","v":"LDP.03.04: CHD Cholesterol recorded (last 12m)"},"LDP.03.04: CHD Cholesterol recorded (last 12m)",{"$f":"'Control Panel'!D28","v":"Cholesterol (last 12m)"},{"$f":"SUMIFS(OFFSET(REL_D,,MATCH($A32,IND,0)-2),REL_D,D$3,OrgID,$C$4)","v":3293},2713,2994,2904,2937,2953,2979,2895,2899,2906,2930,2960,2961,2981]
[{"$f":"'Control Panel'!B29","v":"%LDP.03.04: CHD Cholesterol recorded (last 12m)"},"%LDP.03.04: CHD Cholesterol recorded (last 12m)",{"$f":"'Control Panel'!D29","v":"% CHD register"},{"$f":"IFERROR(D32/D30,\"N/A\")","v":0.68500000000000005},0.57999999999999996,{"$f":"IFERROR(F32/F30,\"N/A\")","v":0.60899999999999999},{"$f":"IFERROR(G32/G30,\"N/A\")","v":0.621},0.626,0.63200000000000001,0.63800000000000001,0.621,0.621,0.622,0.626,0.63500000000000001,0.63700000000000001,0.64100000000000001]
["LDP.03.01: CHD Chol less than 5mmol (last 12m)","LDP.03.01: CHD Chol less than 5mmol (last 12m)",{"$f":"'Control Panel'!D30","v":"Cholesterol < 5 (last 12m)"},{"$f":"SUMIFS(OFFSET(REL_D,,MATCH($A34,IND,0)-2),REL_D,D$3,OrgID,$C$4)","v":2790},2328,2569,2486,2507,2513,2546,2460,2461,2468,2468,2485,2485,2515]
[{"$f":"'Control Panel'!B31","v":"%LDP.03.01: CHD Chol less than 5mmol (last 12m)"},"%LDP.03.01: CHD Chol less than 5mmol (last 12m)",{"$f":"'Control Panel'!D31","v":"% CHD register"},{"$f":"IFERROR(D34/D30,\"N/A\")","v":0.58099999999999996},0.497,{"$f":"IFERROR(F34/F30,\"N/A\")","v":0.52200000000000002},{"$f":"IFERROR(G34/G30,\"N/A\")","v":0.53100000000000003},0.53500000000000003,0.53800000000000003,0.54500000000000004,0.52700000000000002,0.52700000000000002,0.52800000000000002,0.52700000000000002,0.53300000000000003,0.53500000000000003,0.54100000000000004]
[{"$f":"'Control Panel'!B32","v":"LDP.03.02: CHD BP less than or equal 150/90 (last 9m)"},"LDP.03.02: CHD BP less than or equal 150/90 (last 9m)",{"$f":"'Control Panel'!D32","v":"BP ≤ 150/90 (last 9m)"},{"$f":"SUMIFS(OFFSET(REL_D,,MATCH($A36,IND,0)-2),REL_D,D$3,OrgID,$C$4)","v":3643},2143,2313,2241,2295,2353,2423,2448,2512,2603,2668,2671,2700,2761]
[{"$f":"'Control Panel'!B33","v":"%LDP.03.02: CHD BP less than or equal 150/90 (last 9m)"},"%LDP.03.02: CHD BP less than or equal 150/90 (last 9m)",{"$f":"'Control Panel'!D33","v":"% CHD register"},{"$f":"IFERROR(D36/D30,\"N/A\")","v":0.75800000000000001},0.45800000000000002,{"$f":"IFERROR(F36/F30,\"N/A\")","v":0.47},{"$f":"IFERROR(G36/G30,\"N/A\")","v":0.47899999999999998},0.49,0.504,0.51900000000000002,0.52500000000000002,0.53800000000000003,0.55700000000000005,0.56999999999999995,0.57299999999999995,0.58099999999999996,0.59399999999999997]
[null,null,{"$f":"'Control Panel'!B40","v":"Stroke/TIA"}]
["LDP.10 Stroke or TIA register",null,"Stroke/TIA register",{"$f":"SUMIFS(OFFSET(REL_D,,MATCH($A39,IND,0)-2),REL_D,D$3,OrgID,$C$4)","v":2468},2470,2622,2490,2491,2488,2489,2488,2496,2507,2506,2512,2521,2522]
["%LDP.10 Stroke or TIA register",null,"% list size",{"$f":"IFERROR(D39/D23,\"N/A\")","v":8.5999999999999993E-2},8.6999999999999994E-2,{"$f":"IFERROR(F39/F23,\"N/A\")","v":8.7999999999999995E-2},{"$f":"IFERROR(G39/G23,\"N/A\")","v":8.7999999999999995E-2},8.7999999999999995E-2,8.7999999999999995E-2,8.7999999999999995E-2,8.7999999999999995E-2,8.8999999999999996E-2,8.8999999999999996E-2,8.8999999999999996E-2,8.8999999999999996E-2,8.8999999999999996E-2,8.8999999999999996E-2]
["LDP.10.01: Stroke/TIA BP recorded (last 12m)",null,"Patients on Stroke/TIA register with BP recorded",{"$f":"SUMIFS(OFFSET(REL_D,,MATCH($A41,IND,0)-2),REL_D,D$3,OrgID,$C$4)","v":2202},1586,1738,1677,1681,1720,1770,1791,1846,1903,1938,1959,1993,2027]
["%LDP.10.01: Stroke/TIA BP recorded (last 12m)",null,"% of stroke register",{"$f":"IFERROR(D41/D39,\"N/A\")","v":0.89200000000000002},0.64200000000000002,{"$f":"IFERROR(F41/F39,\"N/A\")","v":0.66300000000000003},{"$f":"IFERROR(G41/G39,\"N/A\")","v":0.67300000000000004},0.67500000000000004,0.69099999999999995,0.71099999999999997,0.72,0.74,0.75900000000000001,0.77300000000000002,0.78,0.79100000000000004,0.80400000000000005]
["LDP.10.02 Patients on Stroke/TIA register with BP <140/90 (12m)",null,"Patients on Stroke/TIA register with BP <140/90 (12m)",{"$f":"SUMIFS(OFFSET(REL_D,,MATCH($A43,IND,0)-2),REL_D,D$3,OrgID,$C$4)","v":1580},1164,1277,1227,1225,1259,1296,1315,1350,1391,1409,1420,1422,1466]
["%LDP.10.02 Patients on Stroke/TIA register with BP <140/90 (12m)",null,"% of stroke register",{"$f":"IFERROR(D43/D39,\"N/A\")","v":0.64},0.47099999999999997,{"$f":"IFERROR(F43/F39,\"N/A\")","v":0.48699999999999999},{"$f":"IFERROR(G43/G39,\"N/A\")","v":0.49299999999999999},0.49199999999999999,0.50600000000000001,0.52100000000000002,0.52900000000000003,0.54100000000000004,0.55500000000000005,0.56200000000000006,0.56499999999999995,0.56399999999999995,0.58099999999999996]
[{"$f":"'Control Panel'!B47","v":"CVD Risk"},"CVD Risk",{"$f":"'Control Panel'!B47","v":"CVD Risk"}]
[{"$f":"'Control Panel'!B48","v":"LDP.05: CVD 25-84yrs (excl CVD)"},"LDP.05: CVD 25-84yrs (excl CVD)",{"$f":"'Control Panel'!D48","v":"Aged 25 to 84 (exc CVD) "},{"$f":"SUMIFS(OFFSET(REL_D,,MATCH($A46,IND,0)-2),REL_D,D$3,OrgID,$C$4)","v":175944},179497,189294,180065,180349,180557,180819,180776,181372,181244,181587,181676,181679,181906]
[{"$f":"'Control Panel'!B49","v":"LDP.05.02: Cardiovascular Risk Score Done (5y)"},"LDP.05.02: Cardiovascular Risk Score Done (5y)",{"$f":"'Control Panel'!D49","v":"QRISK recorded (5 years)"},64792,63427,66237,63607,63620,63610,63711,61825,61929,62041,62212,62329,62623,63078]
[{"$f":"'Control Panel'!B50","v":"%LDP.05.02: Cardiovascular Risk Score Done (5y)"},"%LDP.05.02: Cardiovascular Risk Score Done (5y)",{"$f":"'Control Panel'!D50","v":"% of patients aged 25 to 84 (exc CVD)"},{"$f":"IFERROR(D46/D7,\"N/A\")","v":0.66100000000000003},0.67200000000000004,{"$f":"IFERROR(F46/F7,\"N/A\")","v":0.67300000000000004},{"$f":"IFERROR(G46/G7,\"N/A\")","v":0.67200000000000004},0.67300000000000004,0.67300000000000004,0.67300000000000004,0.67300000000000004,0.67300000000000004,0.67400000000000004,0.67400000000000004,0.67400000000000004,0.67400000000000004,0.67400000000000004]
[{"$f":"'Control Panel'!B51","v":"LDP.05.01: CVD QRISK greater than or equal 20%"},"LDP.05.01: CVD QRISK greater than or equal 20%",{"$f":"'Control Panel'!D51","v":"QRISK ≥ 20% "},{"$f":"SUMIFS(OFFSET(REL_D,,MATCH($A49,IND,0)-2),REL_D,D$3,OrgID,$C$4)","v":8894},8809,9220,8893,8921,8979,9047,9065,9097,9135,9175,9197,9281,9378]
[{"$f":"'Control Panel'!B52","v":"%LDP.05.01: CVD QRISK greater than or equal 20%"},"%LDP.05.01: CVD QRISK greater than or equal 20%",{"$f":"'Control Panel'!D52","v":"% QRISK Score recorded"},{"$f":"IFERROR(D49/D47,\"N/A\")","v":0.13700000000000001},0.13900000000000001,{"$f":"IFERROR(F49/F47,\"N/A\")","v":0.13900000000000001},{"$f":"IFERROR(G49/G47,\"N/A\")","v":0.14000000000000001},0.14000000000000001,0.14099999999999999,0.14199999999999999,0.14699999999999999,0.14699999999999999,0.14699999999999999,0.14699999999999999,0.14799999999999999,0.14799999999999999,0.14899999999999999]
[{"$f":"'Control Panel'!B53","v":"LDP.05.01.01: CVD Proxy Annual Review (last 12m)"},"LDP.05.01.01: CVD Proxy Annual Review (last 12m)",{"$f":"'Control Panel'!D53","v":"QRISK ≥ 20% and proxy review (BP and Chol last 12m)"},{"$f":"SUMIFS(OFFSET(REL_D,,MATCH($A51,IND,0)-2),REL_D,D$3,OrgID,$C$4)","v":5958},3748,4166,4209,4408,4571,4718,4658,4738,4926,5079,5215,5358,5459]
[{"$f":"'Control Panel'!B54","v":"%LDP.05.01.01: CVD Proxy Annual Review (last 12m)"},"%LDP.05.01.01: CVD Proxy Annual Review (last 12m)",{"$f":"'Control Panel'!D54","v":"% Patients with QRISK ≥ 20%"},{"$f":"IFERROR(D51/D47,\"N/A\")","v":9.1999999999999998E-2},5.8999999999999997E-2,{"$f":"IFERROR(F51/F47,\"N/A\")","v":6.3E-2},{"$f":"IFERROR(G51/G47,\"N/A\")","v":6.6000000000000003E-2},6.9000000000000006E-2,7.1999999999999995E-2,7.3999999999999996E-2,7.4999999999999997E-2,7.6999999999999999E-2,7.9000000000000001E-2,8.2000000000000003E-2,8.4000000000000005E-2,8.5999999999999993E-2,8.6999999999999994E-2]
[{"$f":"'Control Panel'!B55","v":"Diabetes"},"Diabetes",{"$f":"'Control Panel'!B55","v":"Diabetes"}]
[{"$f":"'Control Panel'!B56","v":"LDP.04: Diabetes Register"},"LDP.04: Diabetes Register",{"$f":"'Control Panel'!D56","v":"Diabetes register"},{"$f":"SUMIFS(OFFSET(REL_D,,MATCH($A54,IND,0)-2),REL_D,D$3,OrgID,$C$4)","v":14532},14587,15485,14670,14744,14799,14872,14923,14979,15007,15032,15045,15067,15139]
[{"$f":"'Control Panel'!B57","v":"%LDP.04: Diabetes Register"},"%LDP.04: Diabetes Register",{"$f":"'Control Panel'!D57","v":"% List size"},{"$f":"IFERROR(D54/D7,\"N/A\")","v":5.5E-2},5.5E-2,{"$f":"IFERROR(F54/F7,\"N/A\")","v":5.5E-2},{"$f":"IFERROR(G54/G7,\"N/A\")","v":5.5E-2},5.5E-2,5.5E-2,5.5E-2,5.6000000000000001E-2,5.6000000000000001E-2,5.6000000000000001E-2,5.6000000000000001E-2,5.6000000000000001E-2,5.6000000000000001E-2,5.6000000000000001E-2]
[{"$f":"'Control Panel'!B60","v":"LDP.04.11: Diabetes and BP in last 12 months"},"LDP.04.11: Diabetes and BP in last 12 months",{"$f":"'Control Panel'!D58","v":"BP (last 12m)"},{"$f":"SUMIFS(OFFSET(REL_D,,MATCH($A56,IND,0)-2),REL_D,D$3,OrgID,$C$4)","v":13496},9639,10618,10344,10690,10988,11255,11412,11498,11783,11929,12049,12182,12456]
[{"$f":"'Control Panel'!B61","v":"%LDP.04.11: Diabetes and BP in last 12 months"},"%LDP.04.11: Diabetes and BP in last 12 months",{"$f":"'Control Panel'!D59","v":"% Diabetes Register"},{"$f":"IFERROR(D56/D54,\"N/A\")","v":0.92900000000000005},0.66100000000000003,{"$f":"IFERROR(F56/F54,\"N/A\")","v":0.68600000000000005},{"$f":"IFERROR(G56/G54,\"N/A\")","v":0.70499999999999996},0.72499999999999998,0.74199999999999999,0.75700000000000001,0.76500000000000001,0.76800000000000002,0.78500000000000003,0.79400000000000004,0.80100000000000005,0.80900000000000005,0.82299999999999995]
["LDP.04.09: Diabetes BP less than 145/85 (last 12m)","LDP.04.09: Diabetes BP less than 145/85 (last 12m)",{"$f":"'Control Panel'!D60","v":"BP <  145/85  (last 12m)"},{"$f":"SUMIFS(OFFSET(REL_D,,MATCH($A58,IND,0)-2),REL_D,D$3,OrgID,$C$4)","v":10973},7678,8413,8185,8484,8762,8964,9071,9154,9325,9434,9522,9602,9858]
[{"$f":"'Control Panel'!B63","v":"%LDP.04.09: Diabetes BP less than 145/85 (last 12m)"},"%LDP.04.09: Diabetes BP less than 145/85 (last 12m)",{"$f":"'Control Panel'!D61","v":"% Diabetes Register"},{"$f":"IFERROR(D58/D54,\"N/A\")","v":0.755},0.52600000000000002,{"$f":"IFERROR(F58/F54,\"N/A\")","v":0.54300000000000004},{"$f":"IFERROR(G58/G54,\"N/A\")","v":0.55800000000000005},0.57499999999999996,0.59199999999999997,0.60299999999999998,0.60799999999999998,0.61099999999999999,0.621,0.628,0.63300000000000001,0.63700000000000001,0.65100000000000002]
["LDP.04.08: Diabetes Chol less than 5mmol (last 12m)","LDP.04.08: Diabetes Chol less than 5mmol (last 12m)",{"$f":"'Control Panel'!D62","v":"Cholesterol < 5mmols (last 12m)"},{"$f":"SUMIFS(OFFSET(REL_D,,MATCH($A60,IND,0)-2),REL_D,D$3,OrgID,$C$4)","v":9428},7726,8549,8132,8152,8150,8222,8102,8074,8092,8214,8258,8281,8365]
[{"$f":"'Control Panel'!B67","v":"%LDP.04.08: Diabetes Chol less than 5mmol (last 12m)"},"%LDP.04.08: Diabetes Chol less than 5mmol (last 12m)",{"$f":"'Control Panel'!D63","v":"% Diabetes Register"},{"$f":"IFERROR(D60/D54,\"N/A\")","v":0.64900000000000002},0.53,{"$f":"IFERROR(F60/F54,\"N/A\")","v":0.55200000000000005},{"$f":"IFERROR(G60/G54,\"N/A\")","v":0.55400000000000005},0.55300000000000005,0.55100000000000005,0.55300000000000005,0.54300000000000004,0.53900000000000003,0.53900000000000003,0.54600000000000004,0.54900000000000004,0.55000000000000004,0.55300000000000005]
["LDP.04.01: Diabetes HbA1c <7.5% OR <59mmol (last 12m)","LDP.04.01: Diabetes HbA1c <7.5% OR <59mmol (last 12m)",{"$f":"'Control Panel'!D64","v":"HbA1c < 59 (last 12m)"},{"$f":"SUMIFS(OFFSET(REL_D,,MATCH($A62,IND,0)-2),REL_D,D$3,OrgID,$C$4)","v":7871},6506,7040,6633,6590,6538,6605,6546,6614,6761,6906,7057,7126,7255]
[{"$f":"'Control Panel'!B69","v":"%LDP.04.01: Diabetes HbA1c <7.5% OR <59mmol (last 12m)"},"%LDP.04.01: Diabetes HbA1c <7.5% OR <59mmol (last 12m)",{"$f":"'Control Panel'!D65","v":"% Diabetes register"},{"$f":"IFERROR(D62/D54,\"N/A\")","v":0.54200000000000004},0.44600000000000001,{"$f":"IFERROR(F62/F54,\"N/A\")","v":0.45500000000000002},{"$f":"IFERROR(G62/G54,\"N/A\")","v":0.45200000000000001},0.44700000000000001,0.442,0.44400000000000001,0.439,0.442,0.45100000000000001,0.45900000000000002,0.46899999999999997,0.47299999999999998,0.47899999999999998]
[{"$f":"'Control Panel'!B80","v":"LDP.04.07: Diabetes Influenza Vaccinations (From August 2018)"},"LDP.04.07: Diabetes Influenza Vaccinations (last 12m)",{"$f":"'Control Panel'!E66","v":"Flu jab (From August 2021)"},{"$f":"SUMIFS(OFFSET(REL_D,,MATCH($A64,IND,0)-2),REL_D,D$3,OrgID,$C$4)","v":9687},9562,0,0,0,0,0,2271,6400,7928,8493,8747,8888,8978]
[{"$f":"'Control Panel'!B81","v":"%LDP.04.07: Diabetes Influenza Vaccinations (From August 2018)"},"%LDP.04.07: Diabetes Influenza Vaccinations (last 12m)",{"$f":"'Control Panel'!D67","v":"% Diabetes Register"},{"$f":"IFERROR(D64/D54,\"N/A\")","v":0.66700000000000004},0.65600000000000003,{"$f":"IFERROR(F64/F54,\"N/A\")","v":0},{"$f":"IFERROR(G64/G54,\"N/A\")","v":0},0,0,0,0.152,0.42699999999999999,0.52800000000000002,0.56499999999999995,0.58099999999999996,0.59,0.59299999999999997]
[null,null,{"$f":"'Control Panel'!B106","v":"Mental Health"}]
[{"$f":"'Control Panel'!B107","v":"CSPMH.01 SMI Register"},"CSPMH.01 SMI Register",{"$f":"'Control Panel'!D107","v":"Mental Health register"},{"$f":"SUMIFS(OFFSET(REL_D,,MATCH($A67,IND,0)-2),REL_D,D$3,OrgID,$C$4)","v":3228},3166,3313,3163,3169,3171,3184,3169,3167,3186,3201,3185,3192,3204]
[{"$f":"'Control Panel'!B108","v":"%CSPMH.01 SMI Register"},"%CSPMH.01 SMI Register",{"$f":"'Control Panel'!D108","v":"% list size"},{"$f":"IFERROR(D67/D7,\"N/A\")","v":1.2E-2},1.2E-2,{"$f":"IFERROR(F67/F7,\"N/A\")","v":1.2E-2},{"$f":"IFERROR(G67/G7,\"N/A\")","v":1.2E-2},1.2E-2,1.2E-2,1.2E-2,1.2E-2,1.2E-2,1.2E-2,1.2E-2,1.2E-2,1.2E-2,1.2E-2]
[{"$f":"'Control Panel'!B109","v":"CSPMH.01.02 Smoking Status Recorded (12m)"},"CSPMH.01.02 Smoking Status Recorded (12m)",{"$f":"'Control Panel'!D109","v":"No. of Mental Health Patients with smoking status recorded (last 12m) or never smoked"},{"$f":"SUMIFS(OFFSET(REL_D,,MATCH($A69,IND,0)-2),REL_D,D$3,OrgID,$C$4)","v":2352},2511,2648,2519,2523,2529,2543,2549,2579,2622,2648,2655,2686,2709]
[{"$f":"'Control Panel'!B110","v":"%CSPMH.01.02 Smoking Status Recorded (12m)"},"%CSPMH.01.02 Smoking Status Recorded (12m)",{"$f":"'Control Panel'!D110","v":"% Mental Health Register"},{"$f":"IFERROR(D69/D67,\"N/A\")","v":0.72899999999999998},0.79300000000000004,{"$f":"IFERROR(F69/F67,\"N/A\")","v":0.79900000000000004},{"$f":"IFERROR(G69/G67,\"N/A\")","v":0.79600000000000004},0.79600000000000004,0.79800000000000004,0.79900000000000004,0.80400000000000005,0.81399999999999995,0.82299999999999995,0.82699999999999996,0.83399999999999996,0.84099999999999997,0.84599999999999997]
[{"$f":"'Control Panel'!B111","v":"CSPMH.01.02.01 Current Smoker (12m)"},"CSPMH.01.02.01 Current Smoker (15m)",{"$f":"'Control Panel'!D111","v":"No. of Mental Health patients recorded as a Smoker"},{"$f":"SUMIFS(OFFSET(REL_D,,MATCH($A71,IND,0)-2),REL_D,D$3,OrgID,$C$4)","v":988},705,749,716,711,710,719,734,775,818,830,850,884,901]
[{"$f":"'Control Panel'!B112","v":"%CSPMH.01.02.01 Current Smoker (12m)"},"%CSPMH.01.02.01 Current Smoker (15m)",{"$f":"'Control Panel'!D112","v":"% Mental Health Register"},{"$f":"IFERROR(D71/D67,\"N/A\")","v":0.30599999999999999},0.223,{"$f":"IFERROR(F71/F67,\"N/A\")","v":0.22600000000000001},{"$f":"IFERROR(G71/G67,\"N/A\")","v":0.22600000000000001},0.224,0.224,0.22600000000000001,0.23200000000000001,0.245,0.25700000000000001,0.25900000000000001,0.26700000000000002,0.27700000000000002,0.28100000000000003]
[{"$f":"'Control Panel'!B113","v":"CSPMH 01.02.01.01 Ref to clinic 12m"},"CSPMH 01.02.01.01 Ref to clinic 15m",{"$f":"'Control Panel'!D113","v":"No. of Mental Health Patients who are current smokers & referred to the Stop Smoking Clinic"},{"$f":"SUMIFS(OFFSET(REL_D,,MATCH($A73,IND,0)-2),REL_D,D$3,OrgID,$C$4)","v":19},21,25,22,20,22,22,19,22,19,18,17,19,20]
[{"$f":"'Control Panel'!B114","v":"%CSPMH 01.02.01.01 Ref to clinic 12m"},"%CSPMH 01.02.01.01 Ref to clinic 15m",{"$f":"'Control Panel'!D114","v":"% Mental Health Register"},{"$f":"IFERROR(D73/D67,\"N/A\")","v":6.0000000000000001E-3},7.0000000000000001E-3,{"$f":"IFERROR(F73/F67,\"N/A\")","v":8.0000000000000002E-3},{"$f":"IFERROR(G73/G67,\"N/A\")","v":7.0000000000000001E-3},6.0000000000000001E-3,7.0000000000000001E-3,7.0000000000000001E-3,6.0000000000000001E-3,7.0000000000000001E-3,6.0000000000000001E-3,6.0000000000000001E-3,5.0000000000000001E-3,6.0000000000000001E-3,6.0000000000000001E-3]
[{"$f":"'Control Panel'!B115","v":"CSPMH.01.02.02 Ex-smoker Recorded (latest 12m)"},"CSPMH.01.02.02 Ex-smoker Recorded (latest 15m)",{"$f":"'Control Panel'!D115","v":"No. Of Mental Health Patients who are recorded as quitters"},{"$f":"SUMIFS(OFFSET(REL_D,,MATCH($A75,IND,0)-2),REL_D,D$3,OrgID,$C$4)","v":454},154,184,167,169,176,189,189,187,204,213,208,215,222]
[{"$f":"'Control Panel'!B116","v":"%CSPMH.01.02.02 Ex-smoker Recorded (latest 12m)"},"%CSPMH.01.02.02 Ex-smoker Recorded (latest 15m)",{"$f":"'Control Panel'!D116","v":"% Mental Health Register"},{"$f":"IFERROR(D75/D67,\"N/A\")","v":0.14099999999999999},4.9000000000000002E-2,{"$f":"IFERROR(F75/F67,\"N/A\")","v":5.6000000000000001E-2},{"$f":"IFERROR(G75/G67,\"N/A\")","v":5.2999999999999999E-2},5.2999999999999999E-2,5.6000000000000001E-2,5.8999999999999997E-2,0.06,5.8999999999999997E-2,6.4000000000000001E-2,6.7000000000000004E-2,6.5000000000000002E-2,6.7000000000000004E-2,6.9000000000000006E-2]
[{"$f":"'Control Panel'!B117","v":"CSPMH. 01.03 QRisk Recorded (12m)"},"CSPMH. 01.03 QRisk Recorded (12m)",{"$f":"'Control Panel'!D117","v":" Patients with Mental Health with QRISK recorded in the last 12m"},{"$f":"SUMIFS(OFFSET(REL_D,,MATCH($A77,IND,0)-2),REL_D,D$3,OrgID,$C$4)","v":1017},615,661,663,685,731,787,833,880,909,921,920,962,1014]
[{"$f":"'Control Panel'!B118","v":"%CSPMH. 01.03 QRisk Recorded (12m)"},"%CSPMH. 01.03 QRisk Recorded (12m)",{"$f":"'Control Panel'!D118","v":"% Mental Health Register"},{"$f":"IFERROR(D77/D67,\"N/A\")","v":0.315},0.19400000000000001,{"$f":"IFERROR(F77/F67,\"N/A\")","v":0.2},{"$f":"IFERROR(G77/G67,\"N/A\")","v":0.21},0.216,0.23100000000000001,0.247,0.26300000000000001,0.27800000000000002,0.28499999999999998,0.28799999999999998,0.28899999999999998,0.30099999999999999,0.316]
[{"$f":"'Control Panel'!B119","v":"CSPMH. 01.03.02 Qrisk>=20 (12m)"},"CSPMH. 01.03.02 Qrisk>=20 (12m)",{"$f":"'Control Panel'!D119","v":" Patients with Mental Health with QRISK 20% or higher in the last 12m"},{"$f":"SUMIFS(OFFSET(REL_D,,MATCH($A79,IND,0)-2),REL_D,D$3,OrgID,$C$4)","v":189},106,116,118,118,128,135,136,147,149,158,156,165,182]
[{"$f":"'Control Panel'!B120","v":"%CSPMH. 01.03.02 Qrisk>=20 (12m)"},"%CSPMH. 01.03.02 Qrisk>=20 (12m)",{"$f":"'Control Panel'!D120","v":"% patients with QRISK recorded"},{"$f":"IFERROR(D79/D67,\"N/A\")","v":5.8999999999999997E-2},3.3000000000000002E-2,{"$f":"IFERROR(F79/F67,\"N/A\")","v":3.5000000000000003E-2},{"$f":"IFERROR(G79/G67,\"N/A\")","v":3.6999999999999998E-2},3.6999999999999998E-2,0.04,4.2000000000000003E-2,4.2999999999999997E-2,4.5999999999999999E-2,4.7E-2,4.9000000000000002E-2,4.9000000000000002E-2,5.1999999999999998E-2,5.7000000000000002E-2]
[{"$f":"'Control Panel'!B121","v":"CSPMH. 01.03.01 BP recorded on same day as QRisk (12m)"},"CSPMH. 01.03.01 BP recorded on same day as QRisk (12m)",{"$f":"'Control Panel'!D121","v":"Patients with Mental Health with BP & QRisk  on the same day in the last 12m"},{"$f":"SUMIFS(OFFSET(REL_D,,MATCH($A81,IND,0)-2),REL_D,D$3,OrgID,$C$4)","v":582},308,336,350,379,417,462,518,557,565,563,553,551,568]
[{"$f":"'Control Panel'!B122","v":"%CSPMH. 01.03.01 BP recorded on same day as QRisk (12m)"},"%CSPMH. 01.03.01 BP recorded on same day as QRisk (12m)",{"$f":"'Control Panel'!D122","v":"% Mental Health Register"},{"$f":"IFERROR(D81/D67,\"N/A\")","v":0.18},9.7000000000000003E-2,{"$f":"IFERROR(F81/F67,\"N/A\")","v":0.10100000000000001},{"$f":"IFERROR(G81/G67,\"N/A\")","v":0.111},0.12,0.13200000000000001,0.14499999999999999,0.16300000000000001,0.17599999999999999,0.17699999999999999,0.17599999999999999,0.17399999999999999,0.17299999999999999,0.17699999999999999]
[{"$f":"VLOOKUP(C83,'Control Panel'!A122:B248,2,FALSE)","v":{"$error":"#N/A"}},{"$error":"#N/A"},{"$f":"'Control Panel'!B123","v":"CKD"}]
["LDP.08 CKD Register","LDP.08 CKD Register",{"$f":"'Control Panel'!C124","v":"No. of patients on CKD register"},{"$f":"SUMIFS(OFFSET(REL_D,,MATCH($A84,IND,0)-2),REL_D,D$3,OrgID,$C$4)","v":7882},8162,8471,8127,8129,8123,8144,8185,8236,8237,8190,8183,8225,8232]
[{"$f":"VLOOKUP(C85,'Control Panel'!A124:B250,2,FALSE)","v":"%LDP.08 CKD Register"},"%LDP.08 CKD Register",{"$f":"'Control Panel'!C125","v":"% List Size"},{"$f":"IFERROR(D84/D7,\"N/A\")","v":0.03},3.1E-2,{"$f":"IFERROR(F84/F7,\"N/A\")","v":0.03},{"$f":"IFERROR(G84/G7,\"N/A\")","v":0.03},0.03,0.03,0.03,0.03,3.1E-2,3.1E-2,0.03,0.03,3.1E-2,0.03]
[{"$f":"VLOOKUP(C86,'Control Panel'!A125:B251,2,FALSE)","v":"LDP.08.03 CKD and BP Recorded (last 12 m)"},"LDP.08.03 CKD and BP Recorded (last 12 m)",{"$f":"'Control Panel'!C126","v":"BP Recorded (last 12m)"},{"$f":"SUMIFS(OFFSET(REL_D,,MATCH($A86,IND,0)-2),REL_D,D$3,OrgID,$C$4)","v":6937},5134,5495,5376,5511,5592,5740,5702,5803,5983,6028,6116,6217,6312]
[{"$f":"VLOOKUP(C87,'Control Panel'!A126:B252,2,FALSE)","v":"%LDP.08.03 CKD and BP Recorded (last 12 m)"},"%LDP.08.03 CKD and BP Recorded (last 12 m)",{"$f":"'Control Panel'!C127","v":"% CKD register"},{"$f":"IFERROR(D86/D84,\"N/A\")","v":0.88},0.629,{"$f":"IFERROR(F86/F84,\"N/A\")","v":0.64900000000000002},{"$f":"IFERROR(G86/G84,\"N/A\")","v":0.66100000000000003},0.67800000000000005,0.68799999999999994,0.70499999999999996,0.69699999999999995,0.70499999999999996,0.72599999999999998,0.73599999999999999,0.747,0.75600000000000001,0.76700000000000002]
["LDP.08.01 CKD and BP less than 140/90 (last 12 m)","LDP.08.01 CKD and BP less than 140/90 (last 12 m)",{"$f":"'Control Panel'!C128","v":"BP ≤ 140/90"},{"$f":"SUMIFS(OFFSET(REL_D,,MATCH($A88,IND,0)-2),REL_D,D$3,OrgID,$C$4)","v":4925},3679,3895,3803,3914,3993,4082,4028,4080,4210,4261,4319,4359,4428]
[{"$f":"VLOOKUP(C89,'Control Panel'!A128:B254,2,FALSE)","v":"%LDP.08.01 CKD and BP less than 140/90 (last 12 m)"},"%LDP.08.01 CKD and BP less than 140/90 (last 12 m)",{"$f":"'Control Panel'!C129","v":"% CKD register"},{"$f":"IFERROR(D88/D84,\"N/A\")","v":0.625},0.45100000000000001,{"$f":"IFERROR(F88/F84,\"N/A\")","v":0.46},{"$f":"IFERROR(G88/G84,\"N/A\")","v":0.46800000000000003},0.48099999999999998,0.49199999999999999,0.501,0.49199999999999999,0.495,0.51100000000000001,0.52,0.52800000000000002,0.53,0.53800000000000003]
[{"$f":"VLOOKUP(C90,'Control Panel'!A129:B255,2,FALSE)","v":"LDP.08.02 CKD Diagnosed (Last 6m)"},"LDP.08.02 CKD Diagnosed (Last 6m)",{"$f":"'Control Panel'!C130","v":"No of patients with new diagnosis of CKD (last 6m)"},{"$f":"SUMIFS(OFFSET(REL_D,,MATCH($A90,IND,0)-2),REL_D,D$3,OrgID,$C$4)","v":687},470,433,387,365,365,376,323,379,393,374,353,410,352]
[{"$f":"VLOOKUP(C91,'Control Panel'!A130:B256,2,FALSE)","v":"%LDP.08.02 CKD Diagnosed (Last 6m)"},"%LDP.08.02 CKD Diagnosed (Last 6m)",{"$f":"'Control Panel'!C131","v":"% CKD register"},{"$f":"IFERROR(D90/D84,\"N/A\")","v":8.6999999999999994E-2},5.8000000000000003E-2,{"$f":"IFERROR(F90/F84,\"N/A\")","v":5.0999999999999997E-2},{"$f":"IFERROR(G90/G84,\"N/A\")","v":4.8000000000000001E-2},4.4999999999999998E-2,4.4999999999999998E-2,4.5999999999999999E-2,3.9E-2,4.5999999999999999E-2,4.8000000000000001E-2,4.5999999999999999E-2,4.2999999999999997E-2,0.05,4.2999999999999997E-2]
[null,null,{"$f":"'Control Panel'!B132","v":"COPD"}]
["LDP.09 COPD Register","LDP.09 COPD Register",{"$f":"'Control Panel'!C133","v":"No. of patients on COPD register"},{"$f":"SUMIFS(OFFSET(REL_D,,MATCH($A93,IND,0)-2),REL_D,D$3,OrgID,$C$4)","v":2353},2297,2416,2274,2270,2253,2247,2232,2225,2229,2221,2209,2203,2214]
[{"$f":"\"%\"&A93","v":"%LDP.09 COPD Register"},"%LDP.09 COPD Register",{"$f":"'Control Panel'!C134","v":"% List Size"},{"$f":"IFERROR(D93/D7,\"N/A\")","v":8.9999999999999993E-3},8.9999999999999993E-3,{"$f":"IFERROR(F93/F7,\"N/A\")","v":8.9999999999999993E-3},{"$f":"IFERROR(G93/G7,\"N/A\")","v":8.0000000000000002E-3},8.0000000000000002E-3,8.0000000000000002E-3,8.0000000000000002E-3,8.0000000000000002E-3,8.0000000000000002E-3,8.0000000000000002E-3,8.0000000000000002E-3,8.0000000000000002E-3,8.0000000000000002E-3,8.0000000000000002E-3]
["LDP.09.01 Patients with severe or very severe COPD (FEV1<50)","LDP.09.01 Patients with severe or very severe COPD (FEV1<50)",{"$f":"'Control Panel'!C135","v":"No of patients with severe or very severe COPD (FEV1<50)"},{"$f":"SUMIFS(OFFSET(REL_D,,MATCH($A95,IND,0)-2),REL_D,D$3,OrgID,$C$4)","v":452},406,444,398,399,397,390,387,381,377,373,366,361,360]
[{"$f":"\"%\"&A95","v":"%LDP.09.01 Patients with severe or very severe COPD (FEV1<50)"},"%LDP.09.01 Patients with severe or very severe COPD (FEV1<50)",{"$f":"'Control Panel'!C136","v":"% COPD register"},{"$f":"IFERROR(D95/D93,\"N/A\")","v":0.192},0.17699999999999999,{"$f":"IFERROR(F95/F93,\"N/A\")","v":0.184},{"$f":"IFERROR(G95/G93,\"N/A\")","v":0.17499999999999999},0.17599999999999999,0.17599999999999999,0.17399999999999999,0.17299999999999999,0.17100000000000001,0.16900000000000001,0.16800000000000001,0.16600000000000001,0.16400000000000001,0.16300000000000001]
["LDP.09.02 Patients with smoking status recorded (last 12m) or never smoked","LDP.09.02 Patients with smoking status recorded (last 12m) or never smoked",{"$f":"'Control Panel'!C137","v":"No. of COPD Patients with smoking status recorded (last 12m) or never smoked"},{"$f":"SUMIFS(OFFSET(REL_D,,MATCH($A97,IND,0)-2),REL_D,D$3,OrgID,$C$4)","v":2084},1805,1874,1716,1667,1651,1732,1771,1816,1852,1870,1880,1879,1895]
[{"$f":"\"%\"&A97","v":"%LDP.09.02 Patients with smoking status recorded (last 12m) or never smoked"},"%LDP.09.02 Patients with smoking status recorded (last 12m) or never smoked",{"$f":"'Control Panel'!C138","v":"% COPD"},{"$f":"IFERROR(D97/D93,\"N/A\")","v":0.88600000000000001},0.78600000000000003,{"$f":"IFERROR(F97/F93,\"N/A\")","v":0.77600000000000002},{"$f":"IFERROR(G97/G93,\"N/A\")","v":0.755},0.73399999999999999,0.73299999999999998,0.77100000000000002,0.79300000000000004,0.81599999999999995,0.83099999999999996,0.84199999999999997,0.85099999999999998,0.85299999999999998,0.85599999999999998]
["LDP.09.03 COPD patients recorded as a Smoker","LDP.09.03 COPD patients recorded as a Smoker",{"$f":"'Control Panel'!C139","v":"No. of COPD patients recorded as a Smoker"},{"$f":"SUMIFS(OFFSET(REL_D,,MATCH($A99,IND,0)-2),REL_D,D$3,OrgID,$C$4)","v":745},640,663,600,586,581,609,615,630,650,651,657,646,659]
[{"$f":"\"%\"&A99","v":"%LDP.09.03 COPD patients recorded as a Smoker"},"%LDP.09.03 COPD patients recorded as a Smoker",{"$f":"'Control Panel'!C140","v":"% COPD"},{"$f":"IFERROR(D99/D93,\"N/A\")","v":0.317},0.27900000000000003,{"$f":"IFERROR(F99/F93,\"N/A\")","v":0.27400000000000002},{"$f":"IFERROR(G99/G93,\"N/A\")","v":0.26400000000000001},0.25800000000000001,0.25800000000000001,0.27100000000000002,0.27600000000000002,0.28299999999999997,0.29199999999999998,0.29299999999999998,0.29699999999999999,0.29299999999999998,0.29799999999999999]
["LDP.09.04 COPD Patients who are current smokers & referred to the Stop Smoking C","LDP.09.04 COPD Patients who are current smokers & referred to the Stop Smoking C",{"$f":"'Control Panel'!C141","v":"No. of COPD Patients who are current smokers & referred to the Stop Smoking Clinic (12m)"},{"$f":"SUMIFS(OFFSET(REL_D,,MATCH($A101,IND,0)-2),REL_D,D$3,OrgID,$C$4)","v":34},24,27,22,21,22,25,28,29,27,28,26,24,22]
[{"$f":"\"%\"&A101","v":"%LDP.09.04 COPD Patients who are current smokers & referred to the Stop Smoking C"},"%LDP.09.04 COPD Patients who are current smokers & referred to the Stop Smoking C",{"$f":"'Control Panel'!C142","v":"% of current COPD smokers"},{"$f":"IFERROR(D101/D99,\"N/A\")","v":4.5999999999999999E-2},3.7999999999999999E-2,{"$f":"IFERROR(F101/F99,\"N/A\")","v":4.1000000000000002E-2},{"$f":"IFERROR(G101/G99,\"N/A\")","v":3.6999999999999998E-2},3.5999999999999997E-2,3.7999999999999999E-2,4.1000000000000002E-2,4.5999999999999999E-2,4.5999999999999999E-2,4.2000000000000003E-2,4.2999999999999997E-2,0.04,3.6999999999999998E-2,3.3000000000000002E-2]
["LDP.09.05 No of COPD with flu vaccination (From August 2018)","LDP.09.05 No of COPD with flu vaccination (12m)",{"$f":"'Control Panel'!C143","v":"No of COPD with flu  vaccination (From August 2021)"},{"$f":"SUMIFS(OFFSET(REL_D,,MATCH($A103,IND,0)-2),REL_D,D$3,OrgID,$C$4)","v":1703},1678,0,0,0,0,0,363,1170,1389,1472,1504,1525,1539]
[{"$f":"\"%\"&A103","v":"%LDP.09.05 No of COPD with flu vaccination (From August 2018)"},"%LDP.09.05 No of COPD with flu vaccination (12m)",{"$f":"'Control Panel'!C144","v":"% of COPD register"},{"$f":"IFERROR(D103/D93,\"N/A\")","v":0.72399999999999998},0.73099999999999998,{"$f":"IFERROR(F103/F93,\"N/A\")","v":0},{"$f":"IFERROR(G103/G93,\"N/A\")","v":0},0,0,0,0.16300000000000001,0.52600000000000002,0.623,0.66300000000000003,0.68100000000000005,0.69199999999999995,0.69499999999999995]
["LDP.09.06 No of COPD with pneumococcal vaccination ever","LDP.09.06 No of COPD with pneumococcal vaccination ever",{"$f":"'Control Panel'!C145","v":"No of COPD with pneumococcal vaccination ever"},{"$f":"SUMIFS(OFFSET(REL_D,,MATCH($A105,IND,0)-2),REL_D,D$3,OrgID,$C$4)","v":1652},1654,1725,1644,1646,1638,1635,1636,1644,1657,1653,1635,1645,1654]
[{"$f":"\"%\"&A105","v":"%LDP.09.06 No of COPD with pneumococcal vaccination ever"},"%LDP.09.06 No of COPD with pneumococcal vaccination ever",{"$f":"'Control Panel'!C146","v":"% of COPD register"},{"$f":"IFERROR(D105/D93,\"N/A\")","v":0.70199999999999996},0.72,{"$f":"IFERROR(F105/F93,\"N/A\")","v":0.71399999999999997},{"$f":"IFERROR(G105/G93,\"N/A\")","v":0.72299999999999998},0.72499999999999998,0.72699999999999998,0.72799999999999998,0.73299999999999998,0.73899999999999999,0.74299999999999999,0.74399999999999999,0.74,0.747,0.747]
["LDP.09.07 No of COPD patients referred to pulmonary rehab ever","LDP.09.07 No of COPD patients referred to pulmonary rehab ever",{"$f":"'Control Panel'!C147","v":"No of COPD patients referred to pulmonary rehab ever"},{"$f":"SUMIFS(OFFSET(REL_D,,MATCH($A107,IND,0)-2),REL_D,D$3,OrgID,$C$4)","v":789},944,1018,959,977,983,1000,1037,1062,1086,1102,1114,1115,1131]
[{"$f":"\"%\"&A107","v":"%LDP.09.07 No of COPD patients referred to pulmonary rehab ever"},"%LDP.09.07 No of COPD patients referred to pulmonary rehab ever",{"$f":"'Control Panel'!C148","v":"% of COPD register"},{"$f":"IFERROR(D107/D93,\"N/A\")","v":0.33500000000000002},0.41099999999999998,{"$f":"IFERROR(F107/F93,\"N/A\")","v":0.42099999999999999},{"$f":"IFERROR(G107/G93,\"N/A\")","v":0.42199999999999999},0.43,0.436,0.44500000000000001,0.46500000000000002,0.47699999999999998,0.48699999999999999,0.496,0.504,0.50600000000000001,0.51100000000000001]

{"sheet":"General Health","index":7,"n_rows":40,"n_cols":17,"rows_kept":40,"cut":false,"hidden":false,"merged":[]}
[null,null,"01. Listsize",{"$f":"INDEX('Control Panel'!$B$3:$B$17,COLUMN(D1)-COLUMN($C$1)+1)","v":"LDP.01: Aged 16yrs+"},{"$f":"INDEX('Control Panel'!$B$3:$B$17,COLUMN(E1)-COLUMN($C$1)+1)","v":"%LDP.01: Aged 16yrs+"},{"$f":"INDEX('Control Panel'!$B$3:$B$17,COLUMN(F1)-COLUMN($C$1)+1)","v":"LDP.01.01: Obesity BMI recorded (last 12m)"},{"$f":"INDEX('Control Panel'!$B$3:$B$17,COLUMN(G1)-COLUMN($C$1)+1)","v":"%LDP.01.01: Obesity BMI recorded (last 12m)"},{"$f":"INDEX('Control Panel'!$B$3:$B$17,COLUMN(H1)-COLUMN($C$1)+1)","v":"LDP.01.01.02: Obesity BMI between 30-35 (last 12m)"},{"$f":"INDEX('Control Panel'!$B$3:$B$17,COLUMN(I1)-COLUMN($C$1)+1)","v":"%LDP.01.01.02: Obesity BMI between 30-35 (last 12m)"},{"$f":"INDEX('Control Panel'!$B$3:$B$17,COLUMN(J1)-COLUMN($C$1)+1)","v":"LDP.01.01.01: Obesity BMI more than or equal to 35 less than 40 (last 12m)"},{"$f":"INDEX('Control Panel'!$B$3:$B$17,COLUMN(K1)-COLUMN($C$1)+1)","v":"%LDP.01.01.01: Obesity BMI more than or equal to 35 less than 40 (last 12m)"},{"$f":"INDEX('Control Panel'!$B$3:$B$17,COLUMN(L1)-COLUMN($C$1)+1)","v":"LDP.01.01.03: Obesity BMI equal to or over 40 (last 12m)"},{"$f":"INDEX('Control Panel'!$B$3:$B$17,COLUMN(M1)-COLUMN($C$1)+1)","v":"%LDP.01.01.03: Obesity BMI equal to or over 40 (last 12m)"},{"$f":"INDEX('Control Panel'!$B$3:$B$17,COLUMN(N1)-COLUMN($C$1)+1)","v":"LDP.01.02: Smoking Status (last 12m) or Never Smoked (25yrs+)"},{"$f":"INDEX('Control Panel'!$B$3:$B$17,COLUMN(O1)-COLUMN($C$1)+1)","v":"%LDP.01.02: Smoking Status (last 12m) or Never Smoked (25yrs+)"},{"$f":"INDEX('Control Panel'!$B$3:$B$17,COLUMN(P1)-COLUMN($C$1)+1)","v":"LDP.01.03: Current Smoker (last 12m)"},{"$f":"INDEX('Control Panel'!$B$3:$B$17,COLUMN(Q1)-COLUMN($C$1)+1)","v":"%LDP.01.03: Current Smoker (last 12m)"}]
[null,null,"Waltham Forest - Practice Clinical Trends (LDP) Report"]
[null,{"$f":"VLOOKUP(C3,'Control Panel'!I14:J25,2,FALSE)","v":"2022-04-01"},"March 2022",{"$f":"VLOOKUP(C3,'Control Panel'!I14:J25,2,FALSE)","v":44652}]
[null,"2020-02-01",{"$f":"'Control Panel'!B2","v":"General Health"}]
["Home",null,{"$f":"VLOOKUP(C1,'Control Panel'!$B$3:$C$131,2,FALSE)","v":"List Size"},{"$f":"VLOOKUP(D1,'Control Panel'!$B$3:$D$131,3,FALSE)","v":"Age 16+"},{"$f":"VLOOKUP(E1,'Control Panel'!$B$3:$D$131,3,FALSE)","v":"% list size"},{"$f":"VLOOKUP(F1,'Control Panel'!$B$3:$D$131,3,FALSE)","v":"16+ and BMI (last 12m)"},{"$f":"VLOOKUP(G1,'Control Panel'!$B$3:$D$131,3,FALSE)","v":"% 16+"},{"$f":"VLOOKUP(H1,'Control Panel'!$B$3:$D$131,3,FALSE)","v":"BMI ≥30 & <35"},{"$f":"VLOOKUP(I1,'Control Panel'!$B$3:$D$131,3,FALSE)","v":"% 16+ "},{"$f":"VLOOKUP(J1,'Control Panel'!$B$3:$D$131,3,FALSE)","v":" BMI ≥ 35 & <40"},{"$f":"VLOOKUP(K1,'Control Panel'!$B$3:$D$131,3,FALSE)","v":"%16+ "},{"$f":"VLOOKUP(L1,'Control Panel'!$B$3:$D$131,3,FALSE)","v":"BMI ≥ 40"},{"$f":"VLOOKUP(M1,'Control Panel'!$B$3:$D$131,3,FALSE)","v":"%16+ "},{"$f":"VLOOKUP(N1,'Control Panel'!$B$3:$D$131,3,FALSE)","v":"Smoking status (last 12m) incl. never smoked"},{"$f":"VLOOKUP(O1,'Control Panel'!$B$3:$D$131,3,FALSE)","v":"% 16+ "},{"$f":"VLOOKUP(P1,'Control Panel'!$B$3:$D$131,3,FALSE)","v":"Age 16+ and current smoker (last 12m)"},{"$f":"VLOOKUP(Q1,'Control Panel'!$B$3:$D$131,3,FALSE)","v":"% 16+"}]
["Practice Name","Total",{"$f":"SUM(C7:C40)","v":269929},{"$f":"SUM(D7:D40)","v":217516},{"$f":"IFERROR(D6/C6,\"N/A\")","v":0.80600000000000005},{"$f":"SUM(F7:F40)","v":50850},{"$f":"IFERROR(F6/$D$6,\"N/A\")","v":0.23400000000000001},{"$f":"SUM(H7:H40)","v":9584},{"$f":"IFERROR(H6/$D$6,\"N/A\")","v":4.3999999999999997E-2},{"$f":"SUM(J7:J40)","v":3934},{"$f":"IFERROR(J6/$D$6,\"N/A\")","v":1.7999999999999999E-2},{"$f":"SUM(L7:L40)","v":2445},{"$f":"IFERROR(L6/$D$6,\"N/A\")","v":1.0999999999999999E-2},{"$f":"SUM(N7:N40)","v":139372},{"$f":"IFERROR(N6/$D$6,\"N/A\")","v":0.64100000000000001},{"$f":"SUM(P7:P40)","v":11914},{"$f":"IFERROR(P6/$D$6,\"N/A\")","v":5.5E-2}]
[{"$f":"'Control Panel'!H62","v":"The Firs Medical Centre"},{"$f":"'Control Panel'!I62","v":"F86001"},{"$f":"SUMIFS(OFFSET(REL_D,,MATCH(C$1,IND,0)-2),REL_D,$D$3,OrgID,$B7)","v":7729},6363,{"$f":"IFERROR(D7/$C7,\"N/A\")","v":0.82299999999999995},{"$f":"SUMIFS(OFFSET(REL_D,,MATCH(F$1,IND,0)-2),REL_D,$D$3,OrgID,$B7)","v":1445},{"$f":"IFERROR(F7/$D7,\"N/A\")","v":0.22700000000000001},{"$f":"SUMIFS(OFFSET(REL_D,,MATCH(H$1,IND,0)-2),REL_D,$D$3,OrgID,$B7)","v":266},{"$f":"IFERROR(H7/$D7,\"N/A\")","v":4.2000000000000003E-2},{"$f":"SUMIFS(OFFSET(REL_D,,MATCH(J$1,IND,0)-2),REL_D,$D$3,OrgID,$B7)","v":126},{"$f":"IFERROR(J7/$D7,\"N/A\")","v":0.02},{"$f":"SUMIFS(OFFSET(REL_D,,MATCH(L$1,IND,0)-2),REL_D,$D$3,OrgID,$B7)","v":74},{"$f":"IFERROR(L7/$D7,\"N/A\")","v":1.2E-2},{"$f":"SUMIFS(OFFSET(REL_D,,MATCH(N$1,IND,0)-2),REL_D,$D$3,OrgID,$B7)","v":4014},{"$f":"IFERROR(N7/$D7,\"N/A\")","v":0.63100000000000001},{"$f":"SUMIFS(OFFSET(REL_D,,MATCH(P$1,IND,0)-2),REL_D,$D$3,OrgID,$B7)","v":271},{"$f":"IFERROR(P7/$D7,\"N/A\")","v":4.2999999999999997E-2}]
[{"$f":"'Control Panel'!H63","v":"Penryhn Surgery"},{"$f":"'Control Panel'!I63","v":"F86005"},9510,7491,0.78800000000000003,2001,0.26700000000000002,331,4.3999999999999997E-2,124,1.7000000000000001E-2,86,1.0999999999999999E-2,4499,0.60099999999999998,452,0.06]
[{"$f":"'Control Panel'!H64","v":"Seymour Medical Centre"},{"$f":"'Control Panel'!I64","v":"F86006"},6825,5530,0.81,567,0.10299999999999999,130,2.4E-2,60,1.0999999999999999E-2,63,1.0999999999999999E-2,3073,0.55600000000000005,195,3.5000000000000003E-2]
[{"$f":"'Control Panel'!H65","v":"The Manor Practice "},{"$f":"'Control Panel'!I65","v":"F86011"},9698,8066,0.83199999999999996,1673,0.20699999999999999,351,4.3999999999999997E-2,144,1.7999999999999999E-2,92,1.0999999999999999E-2,5163,0.64,502,6.2E-2]
[{"$f":"'Control Panel'!H66","v":"Queens Road Medical Centre"},{"$f":"'Control Panel'!I66","v":"F86030"},8161,6518,0.79900000000000004,1090,0.16700000000000001,198,0.03,76,1.2E-2,37,6.0000000000000001E-3,4496,0.69,232,3.5999999999999997E-2]
[{"$f":"'Control Panel'!H67","v":"The Allum Medical Centre"},{"$f":"'Control Panel'!I67","v":"F86036"},14732,11844,0.80400000000000005,2782,0.23499999999999999,500,4.2000000000000003E-2,182,1.4999999999999999E-2,121,0.01,7846,0.66200000000000003,539,4.5999999999999999E-2]
[{"$f":"'Control Panel'!H68","v":"SMA Medical Centre"},{"$f":"'Control Panel'!I68","v":"F86038"},11105,8534,0.76800000000000002,2508,0.29399999999999998,590,6.9000000000000006E-2,270,3.2000000000000001E-2,145,1.7000000000000001E-2,5319,0.623,401,4.7E-2]
[{"$f":"'Control Panel'!H69","v":"Crawley Road Medical Centre"},{"$f":"'Control Panel'!I69","v":"F86044"},10802,8879,0.82199999999999995,1567,0.17599999999999999,248,2.8000000000000001E-2,99,1.0999999999999999E-2,72,8.0000000000000002E-3,4877,0.54900000000000004,397,4.4999999999999998E-2]
[{"$f":"'Control Panel'!H70","v":"High Road Surgery "},{"$f":"'Control Panel'!I70","v":"F86045"},2026,1742,0.86,577,0.33100000000000002,126,7.1999999999999995E-2,52,0.03,19,1.0999999999999999E-2,1127,0.64700000000000002,125,7.1999999999999995E-2]
[{"$f":"'Control Panel'!H71","v":"St James Medical Practice Ltd"},{"$f":"'Control Panel'!I71","v":"F86058"},16561,13173,0.79500000000000004,3490,0.26500000000000001,555,4.2000000000000003E-2,224,1.7000000000000001E-2,155,1.2E-2,8558,0.65,857,6.5000000000000002E-2]
[{"$f":"'Control Panel'!H72","v":"The Grove Road Medical Centre"},{"$f":"'Control Panel'!I72","v":"F86062"},7155,5831,0.81499999999999995,1760,0.30199999999999999,250,4.2999999999999997E-2,106,1.7999999999999999E-2,58,0.01,4109,0.70499999999999996,462,7.9000000000000001E-2]
[{"$f":"'Control Panel'!H73","v":"The Ridgeway Surgery"},{"$f":"'Control Panel'!I73","v":"F86078"},6869,5847,0.85099999999999998,745,0.127,143,2.4E-2,69,1.2E-2,36,6.0000000000000001E-3,3585,0.61299999999999999,171,2.9000000000000001E-2]
[{"$f":"'Control Panel'!H74","v":"Dr Dhital Practice"},{"$f":"'Control Panel'!I74","v":"F86086"},6265,4757,0.75900000000000001,785,0.16500000000000001,171,3.5999999999999997E-2,66,1.4E-2,38,8.0000000000000002E-3,2847,0.59799999999999998,197,4.1000000000000002E-2]
[{"$f":"'Control Panel'!H75","v":"The Lyndhurst Surgery"},{"$f":"'Control Panel'!I75","v":"F86088"},5027,4278,0.85099999999999998,649,0.152,137,3.2000000000000001E-2,48,1.0999999999999999E-2,35,8.0000000000000002E-3,2487,0.58099999999999996,161,3.7999999999999999E-2]
[{"$f":"'Control Panel'!H76","v":"Addison Road Medical Practice"},{"$f":"'Control Panel'!I76","v":"F86607"},15547,12163,0.78200000000000003,2711,0.223,458,3.7999999999999999E-2,196,1.6E-2,111,8.9999999999999993E-3,8894,0.73099999999999998,803,6.6000000000000003E-2]
[{"$f":"'Control Panel'!H77","v":"The Old Church Surgery"},{"$f":"'Control Panel'!I77","v":"F86616"},7996,6212,0.77700000000000002,1698,0.27300000000000002,342,5.5E-2,134,2.1999999999999999E-2,64,0.01,4118,0.66300000000000003,311,0.05]
[{"$f":"'Control Panel'!H78","v":"Green Man Medical Centre"},{"$f":"'Control Panel'!I78","v":"F86621"},6445,5429,0.84199999999999997,1121,0.20599999999999999,186,3.4000000000000002E-2,52,0.01,45,8.0000000000000002E-3,3527,0.65,272,0.05]
[{"$f":"'Control Panel'!H79","v":"L.L. Medical Care Ltd (Agarwal & Agrawal Practice)"},{"$f":"'Control Panel'!I79","v":"F86625"},5882,4827,0.82099999999999995,1087,0.22500000000000001,204,4.2000000000000003E-2,114,2.4E-2,81,1.7000000000000001E-2,2770,0.57399999999999995,218,4.4999999999999998E-2]
[{"$f":"'Control Panel'!H80","v":"Dr Shantir's Practice - Forest Road Medical Centre"},{"$f":"'Control Panel'!I80","v":"F86626"},7021,5602,0.79800000000000004,1104,0.19700000000000001,177,3.2000000000000001E-2,79,1.4E-2,42,7.0000000000000001E-3,3425,0.61099999999999999,261,4.7E-2]
[{"$f":"'Control Panel'!H81","v":"Churchill Medical Centre"},{"$f":"'Control Panel'!I81","v":"F86627"},13283,10885,0.81899999999999995,3015,0.27700000000000002,709,6.5000000000000002E-2,286,2.5999999999999999E-2,173,1.6E-2,6748,0.62,714,6.6000000000000003E-2]
[{"$f":"'Control Panel'!H82","v":"Waltham Forest Community And FHS Ltd"},{"$f":"'Control Panel'!I82","v":"F86644"},{"$f":"SUMIFS(OFFSET(REL_D,,MATCH(C$1,IND,0)-2),REL_D,$D$3,OrgID,$B27)","v":9254},7352,0.79400000000000004,1232,0.16800000000000001,228,3.1E-2,121,1.6E-2,80,1.0999999999999999E-2,4521,0.61499999999999999,345,4.7E-2]
[{"$f":"'Control Panel'!H83","v":"Lime Tree Surgery"},{"$f":"'Control Panel'!I83","v":"F86650"},8080,6547,0.81,1959,0.29899999999999999,359,5.5E-2,133,0.02,79,1.2E-2,4229,0.64600000000000002,396,0.06]
[{"$f":"'Control Panel'!H84","v":"Larkshall Medical Centre "},{"$f":"'Control Panel'!I84","v":"F86664"},8471,6798,0.80300000000000005,1746,0.25700000000000001,361,5.2999999999999999E-2,137,0.02,65,0.01,4696,0.69099999999999995,389,5.7000000000000002E-2]
[{"$f":"'Control Panel'!H85","v":"The Harrow Rd GP Surgery "},{"$f":"'Control Panel'!I85","v":"F86666"},14983,12213,0.81499999999999995,3240,0.26500000000000001,629,5.1999999999999998E-2,274,2.1999999999999999E-2,172,1.4E-2,7964,0.65200000000000002,827,6.8000000000000005E-2]
[{"$f":"'Control Panel'!H86","v":"Higham Hill Medical Centre"},{"$f":"'Control Panel'!I86","v":"F86679"},6372,4882,0.76600000000000001,1338,0.27400000000000002,225,4.5999999999999999E-2,87,1.7999999999999999E-2,61,1.2E-2,3326,0.68100000000000005,316,6.5000000000000002E-2]
[{"$f":"'Control Panel'!H87","v":"The Bailey Practice "},{"$f":"'Control Panel'!I87","v":"F86689"},4395,3309,0.753,684,0.20699999999999999,78,2.4E-2,51,1.4999999999999999E-2,30,8.9999999999999993E-3,2669,0.80700000000000005,281,8.5000000000000006E-2]
[{"$f":"'Control Panel'!H88","v":"Francis Road Medical Centre"},{"$f":"'Control Panel'!I88","v":"F86696"},6883,5690,0.82699999999999996,786,0.13800000000000001,128,2.1999999999999999E-2,57,0.01,35,6.0000000000000001E-3,3324,0.58399999999999996,265,4.7E-2]
[{"$f":"'Control Panel'!H89","v":"Kingshead Medical Practice"},{"$f":"'Control Panel'!I89","v":"F86700"},3901,3176,0.81399999999999995,746,0.23499999999999999,149,4.7E-2,50,1.6E-2,31,0.01,1961,0.61699999999999999,152,4.8000000000000001E-2]
[{"$f":"'Control Panel'!H90","v":"Kiyani Medical Practice"},{"$f":"'Control Panel'!I90","v":"F86701"},3853,3145,0.81599999999999995,1006,0.32,197,6.3E-2,70,2.1999999999999999E-2,49,1.6E-2,2029,0.64500000000000002,252,0.08]
[{"$f":"'Control Panel'!H91","v":"Langthorne Sharma Family Practice"},{"$f":"'Control Panel'!I91","v":"F86705"},3512,2958,0.84199999999999997,939,0.317,169,5.7000000000000002E-2,66,2.1999999999999999E-2,30,0.01,2010,0.68,187,6.3E-2]
[{"$f":"'Control Panel'!H92","v":"Claremont Medical Centre"},{"$f":"'Control Panel'!I92","v":"F86708"},2782,2250,{"$f":"IFERROR(D37/$C37,\"N/A\")","v":0.80900000000000005},633,{"$f":"IFERROR(F37/$D37,\"N/A\")","v":0.28100000000000003},141,{"$f":"IFERROR(H37/$D37,\"N/A\")","v":6.3E-2},49,{"$f":"IFERROR(J37/$D37,\"N/A\")","v":2.1999999999999999E-2},34,{"$f":"IFERROR(L37/$D37,\"N/A\")","v":1.4999999999999999E-2},1471,{"$f":"IFERROR(N37/$D37,\"N/A\")","v":0.65400000000000003},104,{"$f":"IFERROR(P37/$D37,\"N/A\")","v":4.5999999999999999E-2}]
[{"$f":"'Control Panel'!H93","v":"Hampton Medical Centre"},{"$f":"'Control Panel'!I93","v":"F86712"},3395,2868,0.84499999999999997,644,0.22500000000000001,108,3.7999999999999999E-2,42,1.4999999999999999E-2,21,7.0000000000000001E-3,1720,0.6,96,3.3000000000000002E-2]
[{"$f":"'Control Panel'!H94","v":"Chingford Medical Practice"},{"$f":"'Control Panel'!I94","v":"Y01291"},9173,7387,0.80500000000000005,2731,0.37,566,7.6999999999999999E-2,213,2.9000000000000001E-2,150,0.02,4887,0.66200000000000003,500,6.8000000000000005E-2]
[{"$f":"'Control Panel'!H95","v":"Lime Tree and Sinnott Healthcare Ltd"},{"$f":"'Control Panel'!I95","v":"Y01839"},6236,4970,{"$f":"IFERROR(D40/$C40,\"N/A\")","v":0.79700000000000004},791,{"$f":"IFERROR(F40/$D40,\"N/A\")","v":0.159},174,{"$f":"IFERROR(H40/$D40,\"N/A\")","v":3.5000000000000003E-2},77,{"$f":"IFERROR(J40/$D40,\"N/A\")","v":1.4999999999999999E-2},61,{"$f":"IFERROR(L40/$D40,\"N/A\")","v":1.2E-2},3083,{"$f":"IFERROR(N40/$D40,\"N/A\")","v":0.62},263,{"$f":"IFERROR(P40/$D40,\"N/A\")","v":5.2999999999999999E-2}]

{"sheet":"Hypertension","index":8,"n_rows":40,"n_cols":9,"rows_kept":40,"cut":false,"hidden":false,"merged":[]}
[null,null,"01. Listsize",{"$f":"INDEX('Control Panel'!$B$19:$B$24,COLUMN(D1)-COLUMN($D$1)+1)","v":"LDP.02: Hypertension Register"},{"$f":"INDEX('Control Panel'!$B$19:$B$24,COLUMN(E1)-COLUMN($D$1)+1)","v":"%LDP.02: Hypertension Register"},{"$f":"INDEX('Control Panel'!$B$19:$B$24,COLUMN(F1)-COLUMN($D$1)+1)","v":"LDP.02.02: Hypertension BP recorded (last 12m)"},{"$f":"INDEX('Control Panel'!$B$19:$B$24,COLUMN(G1)-COLUMN($D$1)+1)","v":"%LDP.02.02: Hypertension BP recorded (last 12m)"},{"$f":"INDEX('Control Panel'!$B$19:$B$24,COLUMN(H1)-COLUMN($D$1)+1)","v":"LDP.02.01: Hypertension and BP < 140/90 (age under 80) < 150/90 (Age 80+)"},{"$f":"INDEX('Control Panel'!$B$19:$B$24,COLUMN(I1)-COLUMN($D$1)+1)","v":"%LDP.02.01: Hypertension and BP < 140/90 (age under 80) < 150/90 (Age 80+)"}]
[null,null,"Waltham Forest - Practice Clinical Trends (LDP) Report"]
[null,{"$f":"VLOOKUP(C3,'Control Panel'!I14:J25,2,FALSE)","v":"2022-04-01"},"March 2022",{"$f":"VLOOKUP(C3,'Control Panel'!I14:J25,2,FALSE)","v":44652}]
[null,"2020-02-01",{"$f":"'Control Panel'!B18","v":"Hypertension"}]
["Home",null,{"$f":"VLOOKUP(C1,'Control Panel'!$B$3:$C$131,2,FALSE)","v":"List Size"},{"$f":"VLOOKUP(D1,'Control Panel'!$B$3:$D$131,3,FALSE)","v":"Hypertension Register"},{"$f":"VLOOKUP(E1,'Control Panel'!$B$3:$D$131,3,FALSE)","v":"% list size"},{"$f":"VLOOKUP(F1,'Control Panel'!$B$3:$D$131,3,FALSE)","v":"Hypertension and BP (last 12m)"},{"$f":"VLOOKUP(G1,'Control Panel'!$B$3:$D$131,3,FALSE)","v":"% Hypertension Register"},{"$f":"VLOOKUP(H1,'Control Panel'!$B$3:$D$131,3,FALSE)","v":"Hypertension and BP  < 140/90 (Patients aged under 80)  < 150/90 ( Aged 80 and over) (last 12m)"},{"$f":"VLOOKUP(I1,'Control Panel'!$B$3:$D$131,3,FALSE)","v":"% Hypertension Register"}]
["Practice Name","Total",{"$f":"SUM(C7:C40)","v":269929},{"$f":"SUM(D7:D40)","v":28424},{"$f":"IFERROR(D6/C6,\"N/A\")","v":0.105},{"$f":"SUM(F7:F40)","v":22014},{"$f":"IFERROR(F6/D6,\"N/A\")","v":0.77400000000000002},{"$f":"SUM(H7:H40)","v":14988},{"$f":"IFERROR(H6/D6,\"N/A\")","v":0.52700000000000002}]
[{"$f":"'Control Panel'!H62","v":"The Firs Medical Centre"},{"$f":"'Control Panel'!I62","v":"F86001"},{"$f":"SUMIFS(OFFSET(REL_D,,MATCH(C$1,IND,0)-2),REL_D,$D$3,OrgID,$B7)","v":7729},898,{"$f":"IFERROR(D7/C7,\"N/A\")","v":0.11600000000000001},{"$f":"SUMIFS(OFFSET(REL_D,,MATCH(F$1,IND,0)-2),REL_D,$D$3,OrgID,$B7)","v":707},{"$f":"IFERROR(F7/D7,\"N/A\")","v":0.78700000000000003},{"$f":"SUMIFS(OFFSET(REL_D,,MATCH(H$1,IND,0)-2),REL_D,$D$3,OrgID,$B7)","v":493},{"$f":"IFERROR(H7/D7,\"N/A\")","v":0.54900000000000004}]
[{"$f":"'Control Panel'!H63","v":"Penryhn Surgery"},{"$f":"'Control Panel'!I63","v":"F86005"},9510,808,{"$f":"IFERROR(D8/C8,\"N/A\")","v":8.5000000000000006E-2},624,{"$f":"IFERROR(F8/D8,\"N/A\")","v":0.77200000000000002},449,{"$f":"IFERROR(H8/D8,\"N/A\")","v":0.55600000000000005}]
[{"$f":"'Control Panel'!H64","v":"Seymour Medical Centre"},{"$f":"'Control Panel'!I64","v":"F86006"},6825,847,0.124,688,0.81200000000000006,393,0.46400000000000002]
[{"$f":"'Control Panel'!H65","v":"The Manor Practice "},{"$f":"'Control Panel'!I65","v":"F86011"},9698,1141,0.11799999999999999,922,0.80800000000000005,588,0.51500000000000001]
[{"$f":"'Control Panel'!H66","v":"Queens Road Medical Centre"},{"$f":"'Control Panel'!I66","v":"F86030"},8161,739,9.0999999999999998E-2,689,0.93200000000000005,547,0.74]
[{"$f":"'Control Panel'!H67","v":"The Allum Medical Centre"},{"$f":"'Control Panel'!I67","v":"F86036"},14732,1419,9.6000000000000002E-2,980,0.69099999999999995,717,0.505]
[{"$f":"'Control Panel'!H68","v":"SMA Medical Centre"},{"$f":"'Control Panel'!I68","v":"F86038"},11105,1065,9.6000000000000002E-2,941,0.88400000000000001,731,0.68600000000000005]
[{"$f":"'Control Panel'!H69","v":"Crawley Road Medical Centre"},{"$f":"'Control Panel'!I69","v":"F86044"},10802,764,7.0999999999999994E-2,593,0.77600000000000002,430,0.56299999999999994]
[{"$f":"'Control Panel'!H70","v":"High Road Surgery "},{"$f":"'Control Panel'!I70","v":"F86045"},2026,261,0.129,210,0.80500000000000005,152,0.58199999999999996]
[{"$f":"'Control Panel'!H71","v":"St James Medical Practice Ltd"},{"$f":"'Control Panel'!I71","v":"F86058"},16561,1475,8.8999999999999996E-2,1212,0.82199999999999995,901,0.61099999999999999]
[{"$f":"'Control Panel'!H72","v":"The Grove Road Medical Centre"},{"$f":"'Control Panel'!I72","v":"F86062"},7155,804,0.112,524,0.65200000000000002,324,0.40300000000000002]
[{"$f":"'Control Panel'!H73","v":"The Ridgeway Surgery"},{"$f":"'Control Panel'!I73","v":"F86078"},6869,1076,0.157,595,0.55300000000000005,372,0.34599999999999997]
[{"$f":"'Control Panel'!H74","v":"Dr Dhital Practice"},{"$f":"'Control Panel'!I74","v":"F86086"},6265,504,0.08,321,0.63700000000000001,238,0.47199999999999998]
[{"$f":"'Control Panel'!H75","v":"The Lyndhurst Surgery"},{"$f":"'Control Panel'!I75","v":"F86088"},5027,678,0.13500000000000001,458,0.67600000000000005,305,0.45]
[{"$f":"'Control Panel'!H76","v":"Addison Road Medical Practice"},{"$f":"'Control Panel'!I76","v":"F86607"},15547,1311,8.4000000000000005E-2,1042,0.79500000000000004,685,0.52300000000000002]
[{"$f":"'Control Panel'!H77","v":"The Old Church Surgery"},{"$f":"'Control Panel'!I77","v":"F86616"},7996,846,0.106,789,0.93300000000000005,522,0.61699999999999999]
[{"$f":"'Control Panel'!H78","v":"Green Man Medical Centre"},{"$f":"'Control Panel'!I78","v":"F86621"},6445,597,9.2999999999999999E-2,399,0.66800000000000004,268,0.44900000000000001]
[{"$f":"'Control Panel'!H79","v":"L.L. Medical Care Ltd (Agarwal & Agrawal Practice)"},{"$f":"'Control Panel'!I79","v":"F86625"},5882,685,0.11600000000000001,556,0.81200000000000006,341,0.498]
[{"$f":"'Control Panel'!H80","v":"Dr Shantir's Practice - Forest Road Medical Centre"},{"$f":"'Control Panel'!I80","v":"F86626"},7021,544,7.6999999999999999E-2,349,0.64200000000000002,240,0.441]
[{"$f":"'Control Panel'!H81","v":"Churchill Medical Centre"},{"$f":"'Control Panel'!I81","v":"F86627"},13283,1831,0.13800000000000001,1526,0.83299999999999996,972,0.53100000000000003]
[{"$f":"'Control Panel'!H82","v":"Waltham Forest Community And FHS Ltd"},{"$f":"'Control Panel'!I82","v":"F86644"},{"$f":"SUMIFS(OFFSET(REL_D,,MATCH(C$1,IND,0)-2),REL_D,$D$3,OrgID,$B27)","v":9254},1097,0.11899999999999999,713,0.65,417,0.38]
[{"$f":"'Control Panel'!H83","v":"Lime Tree Surgery"},{"$f":"'Control Panel'!I83","v":"F86650"},8080,690,8.5000000000000006E-2,536,0.77700000000000002,384,0.55700000000000005]
[{"$f":"'Control Panel'!H84","v":"Larkshall Medical Centre "},{"$f":"'Control Panel'!I84","v":"F86664"},8471,876,0.10299999999999999,563,0.64300000000000002,411,0.46899999999999997]
[{"$f":"'Control Panel'!H85","v":"The Harrow Rd GP Surgery "},{"$f":"'Control Panel'!I85","v":"F86666"},14983,1829,0.122,1481,0.81,1041,0.56899999999999995]
[{"$f":"'Control Panel'!H86","v":"Higham Hill Medical Centre"},{"$f":"'Control Panel'!I86","v":"F86679"},6372,463,7.2999999999999995E-2,370,0.79900000000000004,288,0.622]
[{"$f":"'Control Panel'!H87","v":"The Bailey Practice "},{"$f":"'Control Panel'!I87","v":"F86689"},4395,297,6.8000000000000005E-2,264,0.88900000000000001,200,0.67300000000000004]
[{"$f":"'Control Panel'!H88","v":"Francis Road Medical Centre"},{"$f":"'Control Panel'!I88","v":"F86696"},6883,585,8.5000000000000006E-2,513,0.877,349,0.59699999999999998]
[{"$f":"'Control Panel'!H89","v":"Kingshead Medical Practice"},{"$f":"'Control Panel'!I89","v":"F86700"},3901,738,0.189,651,0.88200000000000001,443,0.6]
[{"$f":"'Control Panel'!H90","v":"Kiyani Medical Practice"},{"$f":"'Control Panel'!I90","v":"F86701"},3853,466,0.121,373,0.8,247,0.53]
[{"$f":"'Control Panel'!H91","v":"Langthorne Sharma Family Practice"},{"$f":"'Control Panel'!I91","v":"F86705"},3512,338,9.6000000000000002E-2,273,0.80800000000000005,194,0.57399999999999995]
[{"$f":"'Control Panel'!H92","v":"Claremont Medical Centre"},{"$f":"'Control Panel'!I92","v":"F86708"},2782,370,0.13300000000000001,279,0.754,183,0.495]
[{"$f":"'Control Panel'!H93","v":"Hampton Medical Centre"},{"$f":"'Control Panel'!I93","v":"F86712"},3395,350,0.10299999999999999,303,0.86599999999999999,192,0.54900000000000004]
[{"$f":"'Control Panel'!H94","v":"Chingford Medical Practice"},{"$f":"'Control Panel'!I94","v":"Y01291"},9173,1326,0.14499999999999999,1197,0.90300000000000002,736,0.55500000000000005]
[{"$f":"'Control Panel'!H95","v":"Lime Tree and Sinnott Healthcare Ltd"},{"$f":"'Control Panel'!I95","v":"Y01839"},6236,706,0.113,373,0.52800000000000002,235,0.33300000000000002]

{"sheet":"CHD","index":9,"n_rows":40,"n_cols":11,"rows_kept":40,"cut":false,"hidden":false,"merged":[]}
[null,null,"01. Listsize",{"$f":"INDEX('Control Panel'!$B$26:$B$39,COLUMN(D1)-COLUMN($D$1)+1)","v":"LDP.03: CHD Register"},{"$f":"INDEX('Control Panel'!$B$26:$B$39,COLUMN(E1)-COLUMN($D$1)+1)","v":"%LDP.03: CHD Register"},{"$f":"INDEX('Control Panel'!$B$26:$B$39,COLUMN(F1)-COLUMN($D$1)+1)","v":"LDP.03.04: CHD Cholesterol recorded (last 12m)"},{"$f":"INDEX('Control Panel'!$B$26:$B$39,COLUMN(G1)-COLUMN($D$1)+1)","v":"%LDP.03.04: CHD Cholesterol recorded (last 12m)"},{"$f":"INDEX('Control Panel'!$B$26:$B$39,COLUMN(H1)-COLUMN($D$1)+1)","v":"LDP.03.01: CHD Chol less than 5mmol (last 12m)"},{"$f":"INDEX('Control Panel'!$B$26:$B$39,COLUMN(I1)-COLUMN($D$1)+1)","v":"%LDP.03.01: CHD Chol less than 5mmol (last 12m)"},{"$f":"INDEX('Control Panel'!$B$26:$B$39,COLUMN(J1)-COLUMN($D$1)+1)","v":"LDP.03.02: CHD BP less than or equal 150/90 (last 9m)"},{"$f":"INDEX('Control Panel'!$B$26:$B$39,COLUMN(K1)-COLUMN($D$1)+1)","v":"%LDP.03.02: CHD BP less than or equal 150/90 (last 9m)"}]
[null,null,"Waltham Forest - Practice Clinical Trends (LDP) Report"]
[null,{"$f":"VLOOKUP(C3,'Control Panel'!I14:J25,2,FALSE)","v":"2022-04-01"},"March 2022",{"$f":"VLOOKUP(C3,'Control Panel'!I14:J25,2,FALSE)","v":44652}]
[null,"2020-02-01",{"$f":"'Control Panel'!B25","v":"CHD"}]
["Home",null,{"$f":"VLOOKUP(C1,'Control Panel'!$B$3:$C$131,2,FALSE)","v":"List Size"},{"$f":"VLOOKUP(D1,'Control Panel'!$B$3:$D$131,3,FALSE)","v":"CHD register"},{"$f":"VLOOKUP(E1,'Control Panel'!$B$3:$D$131,3,FALSE)","v":"% list size"},{"$f":"VLOOKUP(F1,'Control Panel'!$B$3:$D$131,3,FALSE)","v":"Cholesterol (last 12m)"},{"$f":"VLOOKUP(G1,'Control Panel'!$B$3:$D$131,3,FALSE)","v":"% CHD register"},{"$f":"VLOOKUP(H1,'Control Panel'!$B$3:$D$131,3,FALSE)","v":"Cholesterol < 5 (last 12m)"},{"$f":"VLOOKUP(I1,'Control Panel'!$B$3:$D$131,3,FALSE)","v":"% CHD register"},{"$f":"VLOOKUP(J1,'Control Panel'!$B$3:$D$131,3,FALSE)","v":"BP ≤ 150/90 (last 9m)"},{"$f":"VLOOKUP(K1,'Control Panel'!$B$3:$D$131,3,FALSE)","v":"% CHD register"}]
["Practice Name","Total",{"$f":"SUM(C7:C40)","v":269929},{"$f":"SUM(D7:D40)","v":4648},{"$f":"IFERROR(D6/C6,\"N/A\")","v":1.7000000000000001E-2},{"$f":"SUM(F7:F40)","v":2981},{"$f":"IFERROR(F6/D6,\"N/A\")","v":0.64100000000000001},{"$f":"SUM(H7:H40)","v":2515},{"$f":"IFERROR(H6/D6,\"N/A\")","v":0.54100000000000004},{"$f":"SUM(J7:J40)","v":2761},{"$f":"IFERROR(J6/D6,\"N/A\")","v":0.59399999999999997}]
[{"$f":"'Control Panel'!H62","v":"The Firs Medical Centre"},{"$f":"'Control Panel'!I62","v":"F86001"},{"$f":"SUMIFS(OFFSET(REL_D,,MATCH(C$1,IND,0)-2),REL_D,$D$3,OrgID,$B7)","v":7729},160,{"$f":"IFERROR(D7/C7,\"N/A\")","v":2.1000000000000001E-2},{"$f":"SUMIFS(OFFSET(REL_D,,MATCH(F$1,IND,0)-2),REL_D,$D$3,OrgID,$B7)","v":89},{"$f":"IFERROR(F7/$D7,\"N/A\")","v":0.55600000000000005},{"$f":"SUMIFS(OFFSET(REL_D,,MATCH(H$1,IND,0)-2),REL_D,$D$3,OrgID,$B7)","v":68},{"$f":"IFERROR(H7/$D7,\"N/A\")","v":0.42499999999999999},{"$f":"SUMIFS(OFFSET(REL_D,,MATCH(J$1,IND,0)-2),REL_D,$D$3,OrgID,$B7)","v":89},{"$f":"IFERROR(J7/$D7,\"N/A\")","v":0.55600000000000005}]
[{"$f":"'Control Panel'!H63","v":"Penryhn Surgery"},{"$f":"'Control Panel'!I63","v":"F86005"},9510,87,{"$f":"IFERROR(D8/C8,\"N/A\")","v":8.9999999999999993E-3},55,{"$f":"IFERROR(F8/$D8,\"N/A\")","v":0.63200000000000001},45,{"$f":"IFERROR(H8/$D8,\"N/A\")","v":0.51700000000000002},60,{"$f":"IFERROR(J8/$D8,\"N/A\")","v":0.69}]
[{"$f":"'Control Panel'!H64","v":"Seymour Medical Centre"},{"$f":"'Control Panel'!I64","v":"F86006"},6825,99,1.4999999999999999E-2,70,0.70699999999999996,55,0.55600000000000005,51,0.51500000000000001]
[{"$f":"'Control Panel'!H65","v":"The Manor Practice "},{"$f":"'Control Panel'!I65","v":"F86011"},9698,223,2.3E-2,131,0.58699999999999997,107,0.48,142,0.63700000000000001]
[{"$f":"'Control Panel'!H66","v":"Queens Road Medical Centre"},{"$f":"'Control Panel'!I66","v":"F86030"},8161,157,1.9E-2,146,0.93,131,0.83399999999999996,113,0.72]
[{"$f":"'Control Panel'!H67","v":"The Allum Medical Centre"},{"$f":"'Control Panel'!I67","v":"F86036"},14732,230,1.6E-2,141,0.61299999999999999,115,0.5,136,0.59099999999999997]
[{"$f":"'Control Panel'!H68","v":"SMA Medical Centre"},{"$f":"'Control Panel'!I68","v":"F86038"},11105,252,2.3E-2,179,0.71,154,0.61099999999999999,183,0.72599999999999998]
[{"$f":"'Control Panel'!H69","v":"Crawley Road Medical Centre"},{"$f":"'Control Panel'!I69","v":"F86044"},10802,88,8.0000000000000002E-3,45,0.51100000000000001,38,0.432,51,0.57999999999999996]
[{"$f":"'Control Panel'!H70","v":"High Road Surgery "},{"$f":"'Control Panel'!I70","v":"F86045"},2026,53,2.5999999999999999E-2,49,0.92500000000000004,37,0.69799999999999995,37,0.69799999999999995]
[{"$f":"'Control Panel'!H71","v":"St James Medical Practice Ltd"},{"$f":"'Control Panel'!I71","v":"F86058"},16561,217,1.2999999999999999E-2,133,0.61299999999999999,115,0.53,152,0.7]
[{"$f":"'Control Panel'!H72","v":"The Grove Road Medical Centre"},{"$f":"'Control Panel'!I72","v":"F86062"},7155,139,1.9E-2,93,0.66900000000000004,81,0.58299999999999996,79,0.56799999999999995]
[{"$f":"'Control Panel'!H73","v":"The Ridgeway Surgery"},{"$f":"'Control Panel'!I73","v":"F86078"},6869,175,2.5000000000000001E-2,101,0.57699999999999996,86,0.49099999999999999,61,0.34899999999999998]
[{"$f":"'Control Panel'!H74","v":"Dr Dhital Practice"},{"$f":"'Control Panel'!I74","v":"F86086"},6265,90,1.4E-2,49,0.54400000000000004,41,0.45600000000000002,56,0.622]
[{"$f":"'Control Panel'!H75","v":"The Lyndhurst Surgery"},{"$f":"'Control Panel'!I75","v":"F86088"},5027,104,2.1000000000000001E-2,74,0.71199999999999997,70,0.67300000000000004,55,0.52900000000000003]
[{"$f":"'Control Panel'!H76","v":"Addison Road Medical Practice"},{"$f":"'Control Panel'!I76","v":"F86607"},15547,195,1.2999999999999999E-2,118,0.60499999999999998,105,0.53800000000000003,118,0.60499999999999998]
[{"$f":"'Control Panel'!H77","v":"The Old Church Surgery"},{"$f":"'Control Panel'!I77","v":"F86616"},7996,162,0.02,101,0.623,93,0.57399999999999995,103,0.63600000000000001]
[{"$f":"'Control Panel'!H78","v":"Green Man Medical Centre"},{"$f":"'Control Panel'!I78","v":"F86621"},6445,108,1.7000000000000001E-2,76,0.70399999999999996,63,0.58299999999999996,59,0.54600000000000004]
[{"$f":"'Control Panel'!H79","v":"L.L. Medical Care Ltd (Agarwal & Agrawal Practice)"},{"$f":"'Control Panel'!I79","v":"F86625"},5882,134,2.3E-2,74,0.55200000000000005,63,0.47,86,0.64200000000000002]
[{"$f":"'Control Panel'!H80","v":"Dr Shantir's Practice - Forest Road Medical Centre"},{"$f":"'Control Panel'!I80","v":"F86626"},7021,90,1.2999999999999999E-2,49,0.54400000000000004,38,0.42199999999999999,50,0.55600000000000005]
[{"$f":"'Control Panel'!H81","v":"Churchill Medical Centre"},{"$f":"'Control Panel'!I81","v":"F86627"},13283,362,2.7E-2,258,0.71299999999999997,210,0.57999999999999996,178,0.49199999999999999]
[{"$f":"'Control Panel'!H82","v":"Waltham Forest Community And FHS Ltd"},{"$f":"'Control Panel'!I82","v":"F86644"},{"$f":"SUMIFS(OFFSET(REL_D,,MATCH(C$1,IND,0)-2),REL_D,$D$3,OrgID,$B27)","v":9254},185,0.02,95,0.51400000000000001,82,0.443,95,0.51400000000000001]
[{"$f":"'Control Panel'!H83","v":"Lime Tree Surgery"},{"$f":"'Control Panel'!I83","v":"F86650"},8080,115,1.4E-2,65,0.56499999999999995,54,0.47,83,0.72199999999999998]
[{"$f":"'Control Panel'!H84","v":"Larkshall Medical Centre "},{"$f":"'Control Panel'!I84","v":"F86664"},8471,173,0.02,88,0.50900000000000001,70,0.40500000000000003,101,0.58399999999999996]
[{"$f":"'Control Panel'!H85","v":"The Harrow Rd GP Surgery "},{"$f":"'Control Panel'!I85","v":"F86666"},14983,194,1.2999999999999999E-2,145,0.747,114,0.58799999999999997,131,0.67500000000000004]
[{"$f":"'Control Panel'!H86","v":"Higham Hill Medical Centre"},{"$f":"'Control Panel'!I86","v":"F86679"},6372,50,8.0000000000000002E-3,40,0.8,37,0.74,40,0.8]
[{"$f":"'Control Panel'!H87","v":"The Bailey Practice "},{"$f":"'Control Panel'!I87","v":"F86689"},4395,57,1.2999999999999999E-2,33,0.57899999999999996,31,0.54400000000000004,35,0.61399999999999999]
[{"$f":"'Control Panel'!H88","v":"Francis Road Medical Centre"},{"$f":"'Control Panel'!I88","v":"F86696"},6883,101,1.4999999999999999E-2,70,0.69299999999999995,60,0.59399999999999997,61,0.60399999999999998]
[{"$f":"'Control Panel'!H89","v":"Kingshead Medical Practice"},{"$f":"'Control Panel'!I89","v":"F86700"},3901,111,2.8000000000000001E-2,64,0.57699999999999996,53,0.47699999999999998,65,0.58599999999999997]
[{"$f":"'Control Panel'!H90","v":"Kiyani Medical Practice"},{"$f":"'Control Panel'!I90","v":"F86701"},3853,54,1.4E-2,34,0.63,29,0.53700000000000003,32,0.59299999999999997]
[{"$f":"'Control Panel'!H91","v":"Langthorne Sharma Family Practice"},{"$f":"'Control Panel'!I91","v":"F86705"},3512,60,1.7000000000000001E-2,41,0.68300000000000005,35,0.58299999999999996,46,0.76700000000000002]
[{"$f":"'Control Panel'!H92","v":"Claremont Medical Centre"},{"$f":"'Control Panel'!I92","v":"F86708"},2782,57,0.02,35,0.61399999999999999,31,0.54400000000000004,29,0.50900000000000001]
[{"$f":"'Control Panel'!H93","v":"Hampton Medical Centre"},{"$f":"'Control Panel'!I93","v":"F86712"},3395,49,1.4E-2,34,0.69399999999999995,30,0.61199999999999999,29,0.59199999999999997]
[{"$f":"'Control Panel'!H94","v":"Chingford Medical Practice"},{"$f":"'Control Panel'!I94","v":"Y01291"},9173,207,2.3E-2,154,0.74399999999999999,129,0.623,116,0.56000000000000005]
[{"$f":"'Control Panel'!H95","v":"Lime Tree and Sinnott Healthcare Ltd"},{"$f":"'Control Panel'!I95","v":"Y01839"},6236,110,{"$f":"IFERROR(D40/C40,\"N/A\")","v":1.7999999999999999E-2},52,{"$f":"IFERROR(F40/$D40,\"N/A\")","v":0.47299999999999998},45,{"$f":"IFERROR(H40/$D40,\"N/A\")","v":0.40899999999999997},39,0.35499999999999998]

{"sheet":"Stroke","index":10,"n_rows":40,"n_cols":9,"rows_kept":40,"cut":false,"hidden":false,"merged":[]}
[null,null,"01. Listsize","LDP.10 Stroke or TIA register","%LDP.10 Stroke or TIA register","LDP.10.01: Stroke/TIA BP recorded (last 12m)","%LDP.10.01: Stroke/TIA BP recorded (last 12m)","LDP.10.02 Patients on Stroke/TIA register with BP <140/90 (12m)","%LDP.10.02 Patients on Stroke/TIA register with BP <140/90 (12m)"]
[null,null,"Waltham Forest - Practice Clinical Trends (LDP) Report"]
[null,{"$f":"VLOOKUP(C3,'Control Panel'!I14:J25,2,FALSE)","v":"2022-04-01"},"March 2022",{"$f":"VLOOKUP(C3,'Control Panel'!I14:J25,2,FALSE)","v":44652}]
[null,"2020-02-01",{"$f":"'Control Panel'!B40","v":"Stroke/TIA"}]
["Home",null,{"$f":"VLOOKUP(C1,'Control Panel'!$B$3:$C$131,2,FALSE)","v":"List Size"},"Stroke/TIA register","% list size","Patients on Stroke/TIA register with BP recorded","% of stroke register","Patients on Stroke/TIA register with BP <140/90 (12m)","% of stroke register"]
["Practice Name","Total",{"$f":"SUM(C7:C40)","v":269929},{"$f":"SUM(D7:D40)","v":2522},{"$f":"IFERROR(D6/C6,\"N/A\")","v":8.9999999999999993E-3},{"$f":"SUM(F7:F40)","v":2027},{"$f":"IFERROR(F6/D6,\"N/A\")","v":0.80400000000000005},{"$f":"SUM(H7:H40)","v":1466},{"$f":"IFERROR(H6/D6,\"N/A\")","v":0.58099999999999996}]
[{"$f":"'Control Panel'!H62","v":"The Firs Medical Centre"},{"$f":"'Control Panel'!I62","v":"F86001"},{"$f":"SUMIFS(OFFSET(REL_D,,MATCH(C$1,IND,0)-2),REL_D,$D$3,OrgID,$B7)","v":7729},80,{"$f":"IFERROR(D7/C7,\"N/A\")","v":0.01},{"$f":"SUMIFS(OFFSET(REL_D,,MATCH(F$1,IND,0)-2),REL_D,$D$3,OrgID,$B7)","v":64},{"$f":"IFERROR(F7/D7,\"N/A\")","v":0.8},{"$f":"SUMIFS(OFFSET(REL_D,,MATCH(H$1,IND,0)-2),REL_D,$D$3,OrgID,$B7)","v":43},{"$f":"IFERROR(H7/D7,\"N/A\")","v":0.53800000000000003}]
[{"$f":"'Control Panel'!H63","v":"Penryhn Surgery"},{"$f":"'Control Panel'!I63","v":"F86005"},9510,59,{"$f":"IFERROR(D8/C8,\"N/A\")","v":6.0000000000000001E-3},43,{"$f":"IFERROR(F8/D8,\"N/A\")","v":0.72899999999999998},27,{"$f":"IFERROR(H8/D8,\"N/A\")","v":0.45800000000000002}]
[{"$f":"'Control Panel'!H64","v":"Seymour Medical Centre"},{"$f":"'Control Panel'!I64","v":"F86006"},6825,63,8.9999999999999993E-3,56,0.88900000000000001,36,0.57099999999999995]
[{"$f":"'Control Panel'!H65","v":"The Manor Practice "},{"$f":"'Control Panel'!I65","v":"F86011"},9698,145,1.4999999999999999E-2,125,0.86199999999999999,89,0.61399999999999999]
[{"$f":"'Control Panel'!H66","v":"Queens Road Medical Centre"},{"$f":"'Control Panel'!I66","v":"F86030"},8161,52,6.0000000000000001E-3,50,0.96199999999999997,39,0.75]
[{"$f":"'Control Panel'!H67","v":"The Allum Medical Centre"},{"$f":"'Control Panel'!I67","v":"F86036"},14732,131,8.9999999999999993E-3,110,0.84,74,0.56499999999999995]
[{"$f":"'Control Panel'!H68","v":"SMA Medical Centre"},{"$f":"'Control Panel'!I68","v":"F86038"},11105,106,0.01,93,0.877,76,0.71699999999999997]
[{"$f":"'Control Panel'!H69","v":"Crawley Road Medical Centre"},{"$f":"'Control Panel'!I69","v":"F86044"},10802,64,6.0000000000000001E-3,49,0.76600000000000001,28,0.438]
[{"$f":"'Control Panel'!H70","v":"High Road Surgery "},{"$f":"'Control Panel'!I70","v":"F86045"},2026,22,1.0999999999999999E-2,17,0.77300000000000002,14,0.63600000000000001]
[{"$f":"'Control Panel'!H71","v":"St James Medical Practice Ltd"},{"$f":"'Control Panel'!I71","v":"F86058"},16561,118,7.0000000000000001E-3,102,0.86399999999999999,83,0.70299999999999996]
[{"$f":"'Control Panel'!H72","v":"The Grove Road Medical Centre"},{"$f":"'Control Panel'!I72","v":"F86062"},7155,70,0.01,65,0.92900000000000005,45,0.64300000000000002]
[{"$f":"'Control Panel'!H73","v":"The Ridgeway Surgery"},{"$f":"'Control Panel'!I73","v":"F86078"},6869,108,1.6E-2,61,0.56499999999999995,46,0.42599999999999999]
[{"$f":"'Control Panel'!H74","v":"Dr Dhital Practice"},{"$f":"'Control Panel'!I74","v":"F86086"},6265,45,7.0000000000000001E-3,29,0.64400000000000002,26,0.57799999999999996]
[{"$f":"'Control Panel'!H75","v":"The Lyndhurst Surgery"},{"$f":"'Control Panel'!I75","v":"F86088"},5027,32,6.0000000000000001E-3,22,0.68799999999999994,11,0.34399999999999997]
[{"$f":"'Control Panel'!H76","v":"Addison Road Medical Practice"},{"$f":"'Control Panel'!I76","v":"F86607"},15547,123,8.0000000000000002E-3,88,0.71499999999999997,53,0.43099999999999999]
[{"$f":"'Control Panel'!H77","v":"The Old Church Surgery"},{"$f":"'Control Panel'!I77","v":"F86616"},7996,87,1.0999999999999999E-2,78,0.89700000000000002,66,0.75900000000000001]
[{"$f":"'Control Panel'!H78","v":"Green Man Medical Centre"},{"$f":"'Control Panel'!I78","v":"F86621"},6445,54,8.0000000000000002E-3,41,0.75900000000000001,28,0.51900000000000002]
[{"$f":"'Control Panel'!H79","v":"L.L. Medical Care Ltd (Agarwal & Agrawal Practice)"},{"$f":"'Control Panel'!I79","v":"F86625"},5882,70,1.2E-2,62,0.88600000000000001,47,0.67100000000000004]
[{"$f":"'Control Panel'!H80","v":"Dr Shantir's Practice - Forest Road Medical Centre"},{"$f":"'Control Panel'!I80","v":"F86626"},7021,25,4.0000000000000001E-3,18,0.72,13,0.52]
[{"$f":"'Control Panel'!H81","v":"Churchill Medical Centre"},{"$f":"'Control Panel'!I81","v":"F86627"},13283,208,1.6E-2,164,0.78800000000000003,114,0.54800000000000004]
[{"$f":"'Control Panel'!H82","v":"Waltham Forest Community And FHS Ltd"},{"$f":"'Control Panel'!I82","v":"F86644"},{"$f":"SUMIFS(OFFSET(REL_D,,MATCH(C$1,IND,0)-2),REL_D,$D$3,OrgID,$B27)","v":9254},71,8.0000000000000002E-3,51,0.71799999999999997,41,0.57699999999999996]
[{"$f":"'Control Panel'!H83","v":"Lime Tree Surgery"},{"$f":"'Control Panel'!I83","v":"F86650"},8080,79,0.01,60,0.75900000000000001,42,0.53200000000000003]
[{"$f":"'Control Panel'!H84","v":"Larkshall Medical Centre "},{"$f":"'Control Panel'!I84","v":"F86664"},8471,96,1.0999999999999999E-2,68,0.70799999999999996,56,0.58299999999999996]
[{"$f":"'Control Panel'!H85","v":"The Harrow Rd GP Surgery "},{"$f":"'Control Panel'!I85","v":"F86666"},14983,124,8.0000000000000002E-3,101,0.81499999999999995,69,0.55600000000000005]
[{"$f":"'Control Panel'!H86","v":"Higham Hill Medical Centre"},{"$f":"'Control Panel'!I86","v":"F86679"},6372,33,5.0000000000000001E-3,28,0.84799999999999998,27,0.81799999999999995]
[{"$f":"'Control Panel'!H87","v":"The Bailey Practice "},{"$f":"'Control Panel'!I87","v":"F86689"},4395,24,5.0000000000000001E-3,23,0.95799999999999996,19,0.79200000000000004]
[{"$f":"'Control Panel'!H88","v":"Francis Road Medical Centre"},{"$f":"'Control Panel'!I88","v":"F86696"},6883,51,7.0000000000000001E-3,44,0.86299999999999999,31,0.60799999999999998]
[{"$f":"'Control Panel'!H89","v":"Kingshead Medical Practice"},{"$f":"'Control Panel'!I89","v":"F86700"},3901,92,2.4E-2,79,0.85899999999999999,63,0.68500000000000005]
[{"$f":"'Control Panel'!H90","v":"Kiyani Medical Practice"},{"$f":"'Control Panel'!I90","v":"F86701"},3853,38,0.01,31,0.81599999999999995,22,0.57899999999999996]
[{"$f":"'Control Panel'!H91","v":"Langthorne Sharma Family Practice"},{"$f":"'Control Panel'!I91","v":"F86705"},3512,20,6.0000000000000001E-3,20,1,11,0.55000000000000004]
[{"$f":"'Control Panel'!H92","v":"Claremont Medical Centre"},{"$f":"'Control Panel'!I92","v":"F86708"},2782,29,0.01,24,0.82799999999999996,14,0.48299999999999998]
[{"$f":"'Control Panel'!H93","v":"Hampton Medical Centre"},{"$f":"'Control Panel'!I93","v":"F86712"},3395,16,5.0000000000000001E-3,15,0.93799999999999994,8,0.5]
[{"$f":"'Control Panel'!H94","v":"Chingford Medical Practice"},{"$f":"'Control Panel'!I94","v":"Y01291"},9173,128,1.4E-2,108,0.84399999999999997,73,0.56999999999999995]
[{"$f":"'Control Panel'!H95","v":"Lime Tree and Sinnott Healthcare Ltd"},{"$f":"'Control Panel'!I95","v":"Y01839"},6236,59,8.9999999999999993E-3,38,0.64400000000000002,32,0.54200000000000004]

{"sheet":"CVD Risk","index":11,"n_rows":40,"n_cols":10,"rows_kept":40,"cut":false,"hidden":false,"merged":[]}
[null,null,"01. Listsize",{"$f":"INDEX('Control Panel'!$B$48:$B$54,COLUMN(D1)-COLUMN($D$1)+1)","v":"LDP.05: CVD 25-84yrs (excl CVD)"},{"$f":"INDEX('Control Panel'!$B$48:$B$54,COLUMN(E1)-COLUMN($D$1)+1)","v":"LDP.05.02: Cardiovascular Risk Score Done (5y)"},{"$f":"INDEX('Control Panel'!$B$48:$B$54,COLUMN(F1)-COLUMN($D$1)+1)","v":"%LDP.05.02: Cardiovascular Risk Score Done (5y)"},{"$f":"INDEX('Control Panel'!$B$48:$B$54,COLUMN(G1)-COLUMN($D$1)+1)","v":"LDP.05.01: CVD QRISK greater than or equal 20%"},{"$f":"INDEX('Control Panel'!$B$48:$B$54,COLUMN(H1)-COLUMN($D$1)+1)","v":"%LDP.05.01: CVD QRISK greater than or equal 20%"},{"$f":"INDEX('Control Panel'!$B$48:$B$54,COLUMN(I1)-COLUMN($D$1)+1)","v":"LDP.05.01.01: CVD Proxy Annual Review (last 12m)"},{"$f":"INDEX('Control Panel'!$B$48:$B$54,COLUMN(J1)-COLUMN($D$1)+1)","v":"%LDP.05.01.01: CVD Proxy Annual Review (last 12m)"}]
[null,null,"Waltham Forest - Practice Clinical Trends (LDP) Report"]
[null,{"$f":"VLOOKUP(C3,'Control Panel'!I14:J25,2,FALSE)","v":"2022-04-01"},"March 2022",{"$f":"VLOOKUP(C3,'Control Panel'!I14:J25,2,FALSE)","v":44652}]
[null,"2020-02-01",{"$f":"'Control Panel'!B47","v":"CVD Risk"}]
["Home",null,{"$f":"VLOOKUP(C1,'Control Panel'!$B$3:$C$131,2,FALSE)","v":"List Size"},{"$f":"VLOOKUP(D1,'Control Panel'!$B$3:$D$131,3,FALSE)","v":"Aged 25 to 84 (exc CVD) "},{"$f":"VLOOKUP(E1,'Control Panel'!$B$3:$D$131,3,FALSE)","v":"QRISK recorded (5 years)"},{"$f":"VLOOKUP(F1,'Control Panel'!$B$3:$D$131,3,FALSE)","v":"% of patients aged 25 to 84 (exc CVD)"},{"$f":"VLOOKUP(G1,'Control Panel'!$B$3:$D$131,3,FALSE)","v":"QRISK ≥ 20% "},{"$f":"VLOOKUP(H1,'Control Panel'!$B$3:$D$131,3,FALSE)","v":"% QRISK Score recorded"},{"$f":"VLOOKUP(I1,'Control Panel'!$B$3:$D$131,3,FALSE)","v":"QRISK ≥ 20% and proxy review (BP and Chol last 12m)"},{"$f":"VLOOKUP(J1,'Control Panel'!$B$3:$D$131,3,FALSE)","v":"% Patients with QRISK ≥ 20%"}]
["Practice Name","Total",{"$f":"SUM(C7:C40)","v":269929},{"$f":"SUM(D7:D40)","v":181906},{"$f":"SUM(E7:E40)","v":63078},{"$f":"IFERROR(E6/D6,\"N/A\")","v":0.34699999999999998},{"$f":"SUM(G7:G40)","v":9378},{"$f":"IFERROR(G6/E6,\"N/A\")","v":0.14899999999999999},{"$f":"SUM(I7:I40)","v":5459},{"$f":"IFERROR(I6/G6,\"N/A\")","v":0.58199999999999996}]
[{"$f":"'Control Panel'!H62","v":"The Firs Medical Centre"},{"$f":"'Control Panel'!I62","v":"F86001"},{"$f":"SUMIFS(OFFSET(REL_D,,MATCH(C$1,IND,0)-2),REL_D,$D$3,OrgID,$B7)","v":7729},5286,2087,{"$f":"IFERROR(E7/$D7,\"N/A\")","v":0.39500000000000002},{"$f":"SUMIFS(OFFSET(REL_D,,MATCH(G$1,IND,0)-2),REL_D,$D$3,OrgID,$B7)","v":233},{"$f":"IFERROR(G7/$E7,\"N/A\")","v":0.112},{"$f":"SUMIFS(OFFSET(REL_D,,MATCH(I$1,IND,0)-2),REL_D,$D$3,OrgID,$B7)","v":119},{"$f":"IFERROR(I7/$G7,\"N/A\")","v":0.51100000000000001}]
[{"$f":"'Control Panel'!H63","v":"Penryhn Surgery"},{"$f":"'Control Panel'!I63","v":"F86005"},9510,6477,2245,{"$f":"IFERROR(E8/$D8,\"N/A\")","v":0.34699999999999998},229,{"$f":"IFERROR(G8/$E8,\"N/A\")","v":0.10199999999999999},151,{"$f":"IFERROR(I8/$G8,\"N/A\")","v":0.65900000000000003}]
[{"$f":"'Control Panel'!H64","v":"Seymour Medical Centre"},{"$f":"'Control Panel'!I64","v":"F86006"},6825,4620,1272,0.27500000000000002,137,0.108,69,0.504]
[{"$f":"'Control Panel'!H65","v":"The Manor Practice "},{"$f":"'Control Panel'!I65","v":"F86011"},9698,6502,1875,0.28799999999999998,445,0.23699999999999999,256,0.57499999999999996]
[{"$f":"'Control Panel'!H66","v":"Queens Road Medical Centre"},{"$f":"'Control Panel'!I66","v":"F86030"},8161,5408,1635,0.30199999999999999,388,0.23699999999999999,300,0.77300000000000002]
[{"$f":"'Control Panel'!H67","v":"The Allum Medical Centre"},{"$f":"'Control Panel'!I67","v":"F86036"},14732,10148,3632,0.35799999999999998,526,0.14499999999999999,296,0.56299999999999994]
[{"$f":"'Control Panel'!H68","v":"SMA Medical Centre"},{"$f":"'Control Panel'!I68","v":"F86038"},11105,6781,2616,0.38600000000000001,482,0.184,315,0.65400000000000003]
[{"$f":"'Control Panel'!H69","v":"Crawley Road Medical Centre"},{"$f":"'Control Panel'!I69","v":"F86044"},10802,7735,1466,0.19,279,0.19,168,0.60199999999999998]
[{"$f":"'Control Panel'!H70","v":"High Road Surgery "},{"$f":"'Control Panel'!I70","v":"F86045"},2026,1440,810,0.56299999999999994,104,0.128,79,0.76]
[{"$f":"'Control Panel'!H71","v":"St James Medical Practice Ltd"},{"$f":"'Control Panel'!I71","v":"F86058"},16561,11214,3724,0.33200000000000002,471,0.126,290,0.61599999999999999]
[{"$f":"'Control Panel'!H72","v":"The Grove Road Medical Centre"},{"$f":"'Control Panel'!I72","v":"F86062"},7155,4926,1408,0.28599999999999998,283,0.20100000000000001,143,0.505]
[{"$f":"'Control Panel'!H73","v":"The Ridgeway Surgery"},{"$f":"'Control Panel'!I73","v":"F86078"},6869,4716,1581,0.33500000000000002,351,0.222,140,0.39900000000000002]
[{"$f":"'Control Panel'!H74","v":"Dr Dhital Practice"},{"$f":"'Control Panel'!I74","v":"F86086"},6265,3956,790,0.2,138,0.17499999999999999,70,0.50700000000000001]
[{"$f":"'Control Panel'!H75","v":"The Lyndhurst Surgery"},{"$f":"'Control Panel'!I75","v":"F86088"},5027,3562,851,0.23899999999999999,131,0.154,75,0.57299999999999995]
[{"$f":"'Control Panel'!H76","v":"Addison Road Medical Practice"},{"$f":"'Control Panel'!I76","v":"F86607"},15547,10546,4778,0.45300000000000001,515,0.108,271,0.52600000000000002]
[{"$f":"'Control Panel'!H77","v":"The Old Church Surgery"},{"$f":"'Control Panel'!I77","v":"F86616"},7996,5180,2239,0.432,319,0.14199999999999999,181,0.56699999999999995]
[{"$f":"'Control Panel'!H78","v":"Green Man Medical Centre"},{"$f":"'Control Panel'!I78","v":"F86621"},6445,4719,777,0.16500000000000001,130,0.16700000000000001,85,0.65400000000000003]
[{"$f":"'Control Panel'!H79","v":"L.L. Medical Care Ltd (Agarwal & Agrawal Practice)"},{"$f":"'Control Panel'!I79","v":"F86625"},5882,3947,1056,0.26800000000000002,145,0.13700000000000001,94,0.64800000000000002]
[{"$f":"'Control Panel'!H80","v":"Dr Shantir's Practice - Forest Road Medical Centre"},{"$f":"'Control Panel'!I80","v":"F86626"},7021,4750,1471,0.31,180,0.122,85,0.47199999999999998]
[{"$f":"'Control Panel'!H81","v":"Churchill Medical Centre"},{"$f":"'Control Panel'!I81","v":"F86627"},13283,8666,3178,0.36699999999999999,688,0.216,424,0.61599999999999999]
[{"$f":"'Control Panel'!H82","v":"Waltham Forest Community And FHS Ltd"},{"$f":"'Control Panel'!I82","v":"F86644"},{"$f":"SUMIFS(OFFSET(REL_D,,MATCH(C$1,IND,0)-2),REL_D,$D$3,OrgID,$B27)","v":9254},5999,2411,0.40200000000000002,343,0.14199999999999999,149,0.434]
[{"$f":"'Control Panel'!H83","v":"Lime Tree Surgery"},{"$f":"'Control Panel'!I83","v":"F86650"},8080,5506,1701,0.309,297,0.17499999999999999,143,0.48099999999999998]
[{"$f":"'Control Panel'!H84","v":"Larkshall Medical Centre "},{"$f":"'Control Panel'!I84","v":"F86664"},8471,5496,2496,0.45400000000000001,246,9.9000000000000005E-2,104,0.42299999999999999]
[{"$f":"'Control Panel'!H85","v":"The Harrow Rd GP Surgery "},{"$f":"'Control Panel'!I85","v":"F86666"},14983,10347,4719,0.45600000000000002,691,0.14599999999999999,451,0.65300000000000002]
[{"$f":"'Control Panel'!H86","v":"Higham Hill Medical Centre"},{"$f":"'Control Panel'!I86","v":"F86679"},6372,4155,986,0.23699999999999999,128,0.13,98,0.76600000000000001]
[{"$f":"'Control Panel'!H87","v":"The Bailey Practice "},{"$f":"'Control Panel'!I87","v":"F86689"},4395,2969,718,0.24199999999999999,60,8.4000000000000005E-2,30,0.5]
[{"$f":"'Control Panel'!H88","v":"Francis Road Medical Centre"},{"$f":"'Control Panel'!I88","v":"F86696"},6883,4826,1889,0.39100000000000001,210,0.111,153,0.72899999999999998]
[{"$f":"'Control Panel'!H89","v":"Kingshead Medical Practice"},{"$f":"'Control Panel'!I89","v":"F86700"},3901,2509,582,0.23200000000000001,131,0.22500000000000001,57,0.435]
[{"$f":"'Control Panel'!H90","v":"Kiyani Medical Practice"},{"$f":"'Control Panel'!I90","v":"F86701"},3853,2667,1559,0.58499999999999996,188,0.121,104,0.55300000000000005]
[{"$f":"'Control Panel'!H91","v":"Langthorne Sharma Family Practice"},{"$f":"'Control Panel'!I91","v":"F86705"},3512,2550,1391,0.54500000000000004,153,0.11,109,0.71199999999999997]
[{"$f":"'Control Panel'!H92","v":"Claremont Medical Centre"},{"$f":"'Control Panel'!I92","v":"F86708"},2782,1766,813,0.46,121,0.14899999999999999,63,0.52100000000000002]
[{"$f":"'Control Panel'!H93","v":"Hampton Medical Centre"},{"$f":"'Control Panel'!I93","v":"F86712"},3395,2450,529,0.216,54,0.10199999999999999,31,0.57399999999999995]
[{"$f":"'Control Panel'!H94","v":"Chingford Medical Practice"},{"$f":"'Control Panel'!I94","v":"Y01291"},9173,5911,2651,0.44800000000000001,397,0.15,268,0.67500000000000004]
[{"$f":"'Control Panel'!H95","v":"Lime Tree and Sinnott Healthcare Ltd"},{"$f":"'Control Panel'!I95","v":"Y01839"},6236,4176,1142,{"$f":"IFERROR(E40/$D40,\"N/A\")","v":0.27300000000000002},185,{"$f":"IFERROR(G40/$E40,\"N/A\")","v":0.16200000000000001},88,{"$f":"IFERROR(I40/$G40,\"N/A\")","v":0.47599999999999998}]

{"sheet":"Diabetes","index":12,"n_rows":40,"n_cols":15,"rows_kept":40,"cut":false,"hidden":false,"merged":[]}
[null,null,"01. Listsize",{"$f":"'Control Panel'!B56","v":"LDP.04: Diabetes Register"},{"$f":"INDEX('Control Panel'!$B$56:$B$105,COLUMN(E1)-COLUMN($D$1)+1)","v":"%LDP.04: Diabetes Register"},{"$f":"'Control Panel'!B60","v":"LDP.04.11: Diabetes and BP in last 12 months"},{"$f":"'Control Panel'!B61","v":"%LDP.04.11: Diabetes and BP in last 12 months"},{"$f":"'Control Panel'!B62","v":"LDP.04.09: Diabetes BP less than 145/85 (last 12m)"},{"$f":"'Control Panel'!B63","v":"%LDP.04.09: Diabetes BP less than 145/85 (last 12m)"},{"$f":"'Control Panel'!B66","v":"LDP.04.08: Diabetes Chol less than 5mmol (last 12m)"},{"$f":"'Control Panel'!B67","v":"%LDP.04.08: Diabetes Chol less than 5mmol (last 12m)"},{"$f":"'Control Panel'!B68","v":"LDP.04.01: Diabetes HbA1c <7.5% OR <59mmol (last 12m)"},{"$f":"'Control Panel'!B69","v":"%LDP.04.01: Diabetes HbA1c <7.5% OR <59mmol (last 12m)"},{"$f":"'Control Panel'!B80","v":"LDP.04.07: Diabetes Influenza Vaccinations (From August 2018)"},{"$f":"'Control Panel'!B81","v":"%LDP.04.07: Diabetes Influenza Vaccinations (From August 2018)"}]
[null,null,"Waltham Forest - Practice Clinical Trends (LDP) Report"]
[null,{"$f":"VLOOKUP(C3,'Control Panel'!I14:J25,2,FALSE)","v":"2022-04-01"},"March 2022",{"$f":"VLOOKUP(C3,'Control Panel'!I14:J25,2,FALSE)","v":44652}]
[null,"2020-02-01",{"$f":"'Control Panel'!B55","v":"Diabetes"}]
["Home",null,{"$f":"VLOOKUP(C1,'Control Panel'!$B$3:$C$131,2,FALSE)","v":"List Size"},{"$f":"'Control Panel'!D56","v":"Diabetes register"},{"$f":"'Control Panel'!C57","v":"% List size"},{"$f":"'Control Panel'!D58","v":"BP (last 12m)"},{"$f":"'Control Panel'!D59","v":"% Diabetes Register"},{"$f":"'Control Panel'!D60","v":"BP <  145/85  (last 12m)"},{"$f":"'Control Panel'!D61","v":"% Diabetes Register"},{"$f":"'Control Panel'!D62","v":"Cholesterol < 5mmols (last 12m)"},{"$f":"'Control Panel'!D63","v":"% Diabetes Register"},{"$f":"'Control Panel'!D64","v":"HbA1c < 59 (last 12m)"},{"$f":"'Control Panel'!D65","v":"% Diabetes register"},{"$f":"'Control Panel'!E66","v":"Flu jab (From August 2021)"},{"$f":"'Control Panel'!D67","v":"% Diabetes Register"}]
["Practice Name","Total",{"$f":"SUM(C7:C40)","v":269929},{"$f":"SUM(D7:D40)","v":15139},{"$f":"IFERROR(D6/C6,\"N/A\")","v":5.6000000000000001E-2},{"$f":"SUM(F7:F40)","v":12456},{"$f":"IFERROR(F6/D6,\"N/A\")","v":0.82299999999999995},{"$f":"SUM(H7:H40)","v":9858},{"$f":"IFERROR(H6/$D$6,\"N/A\")","v":0.65100000000000002},{"$f":"SUM(J7:J40)","v":8365},{"$f":"IFERROR(J6/$D$6,\"N/A\")","v":0.55300000000000005},{"$f":"SUM(L7:L40)","v":7255},{"$f":"IFERROR(L6/$D$6,\"N/A\")","v":0.47899999999999998},{"$f":"SUM(N7:N40)","v":8978},{"$f":"IFERROR(N6/$D$6,\"N/A\")","v":0.59299999999999997}]
[{"$f":"'Control Panel'!H62","v":"The Firs Medical Centre"},{"$f":"'Control Panel'!I62","v":"F86001"},{"$f":"SUMIFS(OFFSET(REL_D,,MATCH(C$1,IND,0)-2),REL_D,$D$3,OrgID,$B7)","v":7729},554,{"$f":"IFERROR(D7/C7,\"N/A\")","v":7.1999999999999995E-2},{"$f":"SUMIFS(OFFSET(REL_D,,MATCH(F$1,IND,0)-2),REL_D,$D$3,OrgID,$B7)","v":465},{"$f":"IFERROR(F7/$D7,\"N/A\")","v":0.83899999999999997},{"$f":"SUMIFS(OFFSET(REL_D,,MATCH(H$1,IND,0)-2),REL_D,$D$3,OrgID,$B7)","v":393},0.70899999999999996,{"$f":"SUMIFS(OFFSET(REL_D,,MATCH(J$1,IND,0)-2),REL_D,$D$3,OrgID,$B7)","v":263},{"$f":"IFERROR(J7/$D7,\"N/A\")","v":0.47499999999999998},{"$f":"SUMIFS(OFFSET(REL_D,,MATCH(L$1,IND,0)-2),REL_D,$D$3,OrgID,$B7)","v":265},{"$f":"IFERROR(L7/$D7,\"N/A\")","v":0.47799999999999998},{"$f":"SUMIFS(OFFSET(REL_D,,MATCH(N$1,IND,0)-2),REL_D,$D$3,OrgID,$B7)","v":292},{"$f":"IFERROR(N7/$D7,\"N/A\")","v":0.52700000000000002}]
[{"$f":"'Control Panel'!H63","v":"Penryhn Surgery"},{"$f":"'Control Panel'!I63","v":"F86005"},9510,362,{"$f":"IFERROR(D8/C8,\"N/A\")","v":3.7999999999999999E-2},298,{"$f":"IFERROR(F8/$D8,\"N/A\")","v":0.82299999999999995},232,{"$f":"IFERROR(H8/$D8,\"N/A\")","v":0.64100000000000001},205,{"$f":"IFERROR(J8/$D8,\"N/A\")","v":0.56599999999999995},172,{"$f":"IFERROR(L8/$D8,\"N/A\")","v":0.47499999999999998},213,{"$f":"IFERROR(N8/$D8,\"N/A\")","v":0.58799999999999997}]
[{"$f":"'Control Panel'!H64","v":"Seymour Medical Centre"},{"$f":"'Control Panel'!I64","v":"F86006"},6825,440,6.4000000000000001E-2,362,0.82299999999999995,241,0.54800000000000004,239,0.54300000000000004,197,0.44800000000000001,261,0.59299999999999997]
[{"$f":"'Control Panel'!H65","v":"The Manor Practice "},{"$f":"'Control Panel'!I65","v":"F86011"},9698,747,7.6999999999999999E-2,649,0.86899999999999999,473,0.63300000000000001,394,0.52700000000000002,337,0.45100000000000001,434,0.58099999999999996]
[{"$f":"'Control Panel'!H66","v":"Queens Road Medical Centre"},{"$f":"'Control Panel'!I66","v":"F86030"},8161,556,6.8000000000000005E-2,525,0.94399999999999995,475,0.85399999999999998,415,0.746,340,0.61199999999999999,417,0.75]
[{"$f":"'Control Panel'!H67","v":"The Allum Medical Centre"},{"$f":"'Control Panel'!I67","v":"F86036"},14732,787,5.2999999999999999E-2,628,0.79800000000000004,499,0.63400000000000001,435,0.55300000000000005,363,0.46100000000000002,442,0.56200000000000006]
[{"$f":"'Control Panel'!H68","v":"SMA Medical Centre"},{"$f":"'Control Panel'!I68","v":"F86038"},11105,798,7.1999999999999995E-2,749,0.93899999999999995,676,0.84699999999999998,430,0.53900000000000003,364,0.45600000000000002,518,0.64900000000000002]
[{"$f":"'Control Panel'!H69","v":"Crawley Road Medical Centre"},{"$f":"'Control Panel'!I69","v":"F86044"},10802,428,0.04,387,0.90400000000000003,328,0.76600000000000001,244,0.56999999999999995,227,0.53,214,0.5]
[{"$f":"'Control Panel'!H70","v":"High Road Surgery "},{"$f":"'Control Panel'!I70","v":"F86045"},2026,135,6.7000000000000004E-2,121,0.89600000000000002,108,0.8,103,0.76300000000000001,80,0.59299999999999997,93,0.68899999999999995]
[{"$f":"'Control Panel'!H71","v":"St James Medical Practice Ltd"},{"$f":"'Control Panel'!I71","v":"F86058"},16561,775,4.7E-2,678,0.875,570,0.73499999999999999,439,0.56599999999999995,386,0.498,393,0.50700000000000001]
[{"$f":"'Control Panel'!H72","v":"The Grove Road Medical Centre"},{"$f":"'Control Panel'!I72","v":"F86062"},7155,452,6.3E-2,305,0.67500000000000004,205,0.45400000000000001,228,0.504,180,0.39800000000000002,192,0.42499999999999999]
[{"$f":"'Control Panel'!H73","v":"The Ridgeway Surgery"},{"$f":"'Control Panel'!I73","v":"F86078"},6869,342,0.05,222,0.64900000000000002,170,0.497,164,0.48,154,0.45,227,0.66400000000000003]
[{"$f":"'Control Panel'!H74","v":"Dr Dhital Practice"},{"$f":"'Control Panel'!I74","v":"F86086"},6265,322,5.0999999999999997E-2,234,0.72699999999999998,192,0.59599999999999997,145,0.45,118,0.36599999999999999,147,0.45700000000000002]
[{"$f":"'Control Panel'!H75","v":"The Lyndhurst Surgery"},{"$f":"'Control Panel'!I75","v":"F86088"},5027,372,7.3999999999999996E-2,263,0.70699999999999996,188,0.505,223,0.59899999999999998,159,0.42699999999999999,202,0.54300000000000004]
[{"$f":"'Control Panel'!H76","v":"Addison Road Medical Practice"},{"$f":"'Control Panel'!I76","v":"F86607"},15547,693,4.4999999999999998E-2,580,0.83699999999999997,446,0.64400000000000002,356,0.51400000000000001,296,0.42699999999999999,457,0.65900000000000003]
[{"$f":"'Control Panel'!H77","v":"The Old Church Surgery"},{"$f":"'Control Panel'!I77","v":"F86616"},7996,379,4.7E-2,347,0.91600000000000004,277,0.73099999999999998,266,0.70199999999999996,230,0.60699999999999998,249,0.65700000000000003]
[{"$f":"'Control Panel'!H78","v":"Green Man Medical Centre"},{"$f":"'Control Panel'!I78","v":"F86621"},6445,322,0.05,265,0.82299999999999995,218,0.67700000000000005,213,0.66100000000000003,195,0.60599999999999998,254,0.78900000000000003]
[{"$f":"'Control Panel'!H79","v":"L.L. Medical Care Ltd (Agarwal & Agrawal Practice)"},{"$f":"'Control Panel'!I79","v":"F86625"},5882,431,7.2999999999999995E-2,380,0.88200000000000001,247,0.57299999999999995,275,0.63800000000000001,218,0.50600000000000001,257,0.59599999999999997]
[{"$f":"'Control Panel'!H80","v":"Dr Shantir's Practice - Forest Road Medical Centre"},{"$f":"'Control Panel'!I80","v":"F86626"},7021,310,4.3999999999999997E-2,196,0.63200000000000001,140,0.45200000000000001,132,0.42599999999999999,129,0.41599999999999998,160,0.51600000000000001]
[{"$f":"'Control Panel'!H81","v":"Churchill Medical Centre"},{"$f":"'Control Panel'!I81","v":"F86627"},13283,818,6.2E-2,672,0.82199999999999995,507,0.62,469,0.57299999999999995,397,0.48499999999999999,471,0.57599999999999996]
[{"$f":"'Control Panel'!H82","v":"Waltham Forest Community And FHS Ltd"},{"$f":"'Control Panel'!I82","v":"F86644"},{"$f":"SUMIFS(OFFSET(REL_D,,MATCH(C$1,IND,0)-2),REL_D,$D$3,OrgID,$B27)","v":9254},518,5.6000000000000001E-2,402,0.77600000000000002,265,0.51200000000000001,224,0.432,245,0.47299999999999998,317,0.61199999999999999]
[{"$f":"'Control Panel'!H83","v":"Lime Tree Surgery"},{"$f":"'Control Panel'!I83","v":"F86650"},8080,515,6.4000000000000001E-2,362,0.70299999999999996,301,0.58399999999999996,254,0.49299999999999999,242,0.47,266,0.51700000000000002]
[{"$f":"'Control Panel'!H84","v":"Larkshall Medical Centre "},{"$f":"'Control Panel'!I84","v":"F86664"},8471,424,0.05,309,0.72899999999999998,287,0.67700000000000005,179,0.42199999999999999,153,0.36099999999999999,245,0.57799999999999996]
[{"$f":"'Control Panel'!H85","v":"The Harrow Rd GP Surgery "},{"$f":"'Control Panel'!I85","v":"F86666"},14983,884,5.8999999999999997E-2,732,0.82799999999999996,613,0.69299999999999995,501,0.56699999999999995,429,0.48499999999999999,499,0.56399999999999995]
[{"$f":"'Control Panel'!H86","v":"Higham Hill Medical Centre"},{"$f":"'Control Panel'!I86","v":"F86679"},6372,241,3.7999999999999999E-2,230,0.95399999999999996,189,0.78400000000000003,157,0.65100000000000002,127,0.52700000000000002,141,0.58499999999999996]
[{"$f":"'Control Panel'!H87","v":"The Bailey Practice "},{"$f":"'Control Panel'!I87","v":"F86689"},4395,127,2.9000000000000001E-2,118,0.92900000000000005,100,0.78700000000000003,70,0.55100000000000005,71,0.55900000000000005,108,0.85]
[{"$f":"'Control Panel'!H88","v":"Francis Road Medical Centre"},{"$f":"'Control Panel'!I88","v":"F86696"},6883,360,5.1999999999999998E-2,307,0.85299999999999998,217,0.60299999999999998,224,0.622,172,0.47799999999999998,223,0.61899999999999999]
[{"$f":"'Control Panel'!H89","v":"Kingshead Medical Practice"},{"$f":"'Control Panel'!I89","v":"F86700"},3901,220,5.6000000000000001E-2,210,0.95499999999999996,171,0.77700000000000002,117,0.53200000000000003,138,0.627,175,0.79500000000000004]
[{"$f":"'Control Panel'!H90","v":"Kiyani Medical Practice"},{"$f":"'Control Panel'!I90","v":"F86701"},3853,268,7.0000000000000007E-2,231,0.86199999999999999,163,0.60799999999999998,157,0.58599999999999997,144,0.53700000000000003,172,0.64200000000000002]
[{"$f":"'Control Panel'!H91","v":"Langthorne Sharma Family Practice"},{"$f":"'Control Panel'!I91","v":"F86705"},3512,214,6.0999999999999999E-2,200,0.93500000000000005,151,0.70599999999999996,115,0.53700000000000003,115,0.53700000000000003,170,0.79400000000000004]
[{"$f":"'Control Panel'!H92","v":"Claremont Medical Centre"},{"$f":"'Control Panel'!I92","v":"F86708"},2782,205,7.3999999999999996E-2,164,0.8,126,0.61499999999999999,104,0.50700000000000001,92,0.44900000000000001,119,0.57999999999999996]
[{"$f":"'Control Panel'!H93","v":"Hampton Medical Centre"},{"$f":"'Control Panel'!I93","v":"F86712"},3395,220,6.5000000000000002E-2,178,0.80900000000000005,141,0.64100000000000001,130,0.59099999999999997,112,0.50900000000000001,143,0.65]
[{"$f":"'Control Panel'!H94","v":"Chingford Medical Practice"},{"$f":"'Control Panel'!I94","v":"Y01291"},9173,503,5.5E-2,456,0.90700000000000003,376,0.748,321,0.63800000000000001,260,0.51700000000000002,300,0.59599999999999997]
[{"$f":"'Control Panel'!H95","v":"Lime Tree and Sinnott Healthcare Ltd"},{"$f":"'Control Panel'!I95","v":"Y01839"},6236,417,6.7000000000000004E-2,231,0.55400000000000005,173,0.41499999999999998,174,0.41699999999999998,148,0.35499999999999998,207,0.496]

{"sheet":"Mental Health","index":13,"n_rows":40,"n_cols":19,"rows_kept":40,"cut":false,"hidden":false,"merged":[]}
[null,null,"01. Listsize",{"$f":"INDEX('Control Panel'!$B$107:$B$122,COLUMN(D1)-COLUMN($D$1)+1)","v":"CSPMH.01 SMI Register"},{"$f":"INDEX('Control Panel'!$B$107:$B$122,COLUMN(E1)-COLUMN($D$1)+1)","v":"%CSPMH.01 SMI Register"},{"$f":"INDEX('Control Panel'!$B$107:$B$122,COLUMN(F1)-COLUMN($D$1)+1)","v":"CSPMH.01.02 Smoking Status Recorded (12m)"},{"$f":"INDEX('Control Panel'!$B$107:$B$122,COLUMN(G1)-COLUMN($D$1)+1)","v":"%CSPMH.01.02 Smoking Status Recorded (12m)"},{"$f":"INDEX('Control Panel'!$B$107:$B$122,COLUMN(H1)-COLUMN($D$1)+1)","v":"CSPMH.01.02.01 Current Smoker (12m)"},{"$f":"INDEX('Control Panel'!$B$107:$B$122,COLUMN(I1)-COLUMN($D$1)+1)","v":"%CSPMH.01.02.01 Current Smoker (12m)"},{"$f":"INDEX('Control Panel'!$B$107:$B$122,COLUMN(J1)-COLUMN($D$1)+1)","v":"CSPMH 01.02.01.01 Ref to clinic 12m"},{"$f":"INDEX('Control Panel'!$B$107:$B$122,COLUMN(K1)-COLUMN($D$1)+1)","v":"%CSPMH 01.02.01.01 Ref to clinic 12m"},{"$f":"INDEX('Control Panel'!$B$107:$B$122,COLUMN(L1)-COLUMN($D$1)+1)","v":"CSPMH.01.02.02 Ex-smoker Recorded (latest 12m)"},{"$f":"INDEX('Control Panel'!$B$107:$B$122,COLUMN(M1)-COLUMN($D$1)+1)","v":"%CSPMH.01.02.02 Ex-smoker Recorded (latest 12m)"},{"$f":"INDEX('Control Panel'!$B$107:$B$122,COLUMN(N1)-COLUMN($D$1)+1)","v":"CSPMH. 01.03 QRisk Recorded (12m)"},{"$f":"INDEX('Control Panel'!$B$107:$B$122,COLUMN(O1)-COLUMN($D$1)+1)","v":"%CSPMH. 01.03 QRisk Recorded (12m)"},{"$f":"INDEX('Control Panel'!$B$107:$B$122,COLUMN(P1)-COLUMN($D$1)+1)","v":"CSPMH. 01.03.02 Qrisk>=20 (12m)"},{"$f":"INDEX('Control Panel'!$B$107:$B$122,COLUMN(Q1)-COLUMN($D$1)+1)","v":"%CSPMH. 01.03.02 Qrisk>=20 (12m)"},{"$f":"INDEX('Control Panel'!$B$107:$B$122,COLUMN(R1)-COLUMN($D$1)+1)","v":"CSPMH. 01.03.01 BP recorded on same day as QRisk (12m)"},{"$f":"INDEX('Control Panel'!$B$107:$B$122,COLUMN(S1)-COLUMN($D$1)+1)","v":"%CSPMH. 01.03.01 BP recorded on same day as QRisk (12m)"}]
[null,null,"Waltham Forest - Practice Clinical Trends (LDP) Report"]
[null,{"$f":"VLOOKUP(C3,'Control Panel'!I14:J25,2,FALSE)","v":"2022-04-01"},"March 2022",{"$f":"VLOOKUP(C3,'Control Panel'!I14:J25,2,FALSE)","v":44652}]
[null,"2020-02-01",{"$f":"'Control Panel'!B106","v":"Mental Health"}]
["Home",null,{"$f":"VLOOKUP(C1,'Control Panel'!$B$3:$C$131,2,FALSE)","v":"List Size"},{"$f":"VLOOKUP(D1,'Control Panel'!$B$3:$D$131,3,FALSE)","v":"Mental Health register"},{"$f":"VLOOKUP(E1,'Control Panel'!$B$3:$D$131,3,FALSE)","v":"% list size"},{"$f":"VLOOKUP(F1,'Control Panel'!$B$3:$D$131,3,FALSE)","v":"No. of Mental Health Patients with smoking status recorded (last 12m) or never smoked"},{"$f":"VLOOKUP(G1,'Control Panel'!$B$3:$D$131,3,FALSE)","v":"% Mental Health Register"},{"$f":"VLOOKUP(H1,'Control Panel'!$B$3:$D$131,3,FALSE)","v":"No. of Mental Health patients recorded as a Smoker"},{"$f":"VLOOKUP(I1,'Control Panel'!$B$3:$D$131,3,FALSE)","v":"% Mental Health Register"},{"$f":"VLOOKUP(J1,'Control Panel'!$B$3:$D$131,3,FALSE)","v":"No. of Mental Health Patients who are current smokers & referred to the Stop Smoking Clinic"},{"$f":"VLOOKUP(K1,'Control Panel'!$B$3:$D$131,3,FALSE)","v":"% Mental Health Register"},{"$f":"VLOOKUP(L1,'Control Panel'!$B$3:$D$131,3,FALSE)","v":"No. Of Mental Health Patients who are recorded as quitters"},{"$f":"VLOOKUP(M1,'Control Panel'!$B$3:$D$131,3,FALSE)","v":"% Mental Health Register"},{"$f":"VLOOKUP(N1,'Control Panel'!$B$3:$D$131,3,FALSE)","v":" Patients with Mental Health with QRISK recorded in the last 12m"},{"$f":"VLOOKUP(O1,'Control Panel'!$B$3:$D$131,3,FALSE)","v":"% Mental Health Register"},{"$f":"VLOOKUP(P1,'Control Panel'!$B$3:$D$131,3,FALSE)","v":" Patients with Mental Health with QRISK 20% or higher in the last 12m"},{"$f":"VLOOKUP(Q1,'Control Panel'!$B$3:$D$131,3,FALSE)","v":"% patients with QRISK recorded"},{"$f":"VLOOKUP(R1,'Control Panel'!$B$3:$D$131,3,FALSE)","v":"Patients with Mental Health with BP & QRisk  on the same day in the last 12m"},{"$f":"VLOOKUP(S1,'Control Panel'!$B$3:$D$131,3,FALSE)","v":"% Mental Health Register"}]
["Practice Name","Total",{"$f":"SUM(C7:C40)","v":269929},{"$f":"SUM(D7:D40)","v":3204},{"$f":"IFERROR(D6/C6,\"N/A\")","v":1.2E-2},{"$f":"SUM(F7:F40)","v":2709},{"$f":"IFERROR(F6/$D$6,\"N/A\")","v":0.84599999999999997},{"$f":"SUM(H7:H40)","v":901},{"$f":"IFERROR(H6/$D$6,\"N/A\")","v":0.28100000000000003},{"$f":"SUM(J7:J40)","v":20},{"$f":"IFERROR(J6/$D$6,\"N/A\")","v":6.0000000000000001E-3},{"$f":"SUM(L7:L40)","v":222},{"$f":"IFERROR(L6/$D$6,\"N/A\")","v":6.9000000000000006E-2},{"$f":"SUM(N7:N40)","v":1014},{"$f":"IFERROR(N6/$D$6,\"N/A\")","v":0.316},{"$f":"SUM(P7:P40)","v":182},{"$f":"IFERROR(P6/N6,\"N/A\")","v":0.17899999999999999},{"$f":"SUM(R7:R40)","v":568},{"$f":"IFERROR(R6/$D$6,\"N/A\")","v":0.17699999999999999}]
[{"$f":"'Control Panel'!H62","v":"The Firs Medical Centre"},{"$f":"'Control Panel'!I62","v":"F86001"},{"$f":"SUMIFS(OFFSET(REL_D,,MATCH(C$1,IND,0)-2),REL_D,$D$3,OrgID,$B7)","v":7729},99,{"$f":"IFERROR(D7/C7,\"N/A\")","v":1.2999999999999999E-2},{"$f":"SUMIFS(OFFSET(REL_D,,MATCH(F$1,IND,0)-2),REL_D,$D$3,OrgID,$B7)","v":85},{"$f":"IFERROR(F7/$D7,\"N/A\")","v":0.85899999999999999},{"$f":"SUMIFS(OFFSET(REL_D,,MATCH(H$1,IND,0)-2),REL_D,$D$3,OrgID,$B7)","v":29},{"$f":"IFERROR(H7/$D7,\"N/A\")","v":0.29299999999999998},{"$f":"SUMIFS(OFFSET(REL_D,,MATCH(J$1,IND,0)-2),REL_D,$D$3,OrgID,$B7)","v":0},{"$f":"IFERROR(J7/$D7,\"N/A\")","v":0},{"$f":"SUMIFS(OFFSET(REL_D,,MATCH(L$1,IND,0)-2),REL_D,$D$3,OrgID,$B7)","v":7},{"$f":"IFERROR(L7/$D7,\"N/A\")","v":7.0999999999999994E-2},{"$f":"SUMIFS(OFFSET(REL_D,,MATCH(N$1,IND,0)-2),REL_D,$D$3,OrgID,$B7)","v":23},{"$f":"IFERROR(N7/$D7,\"N/A\")","v":0.23200000000000001},{"$f":"SUMIFS(OFFSET(REL_D,,MATCH(P$1,IND,0)-2),REL_D,$D$3,OrgID,$B7)","v":4},{"$f":"IFERROR(P7/$N7,\"N/A\")","v":0.17399999999999999},{"$f":"SUMIFS(OFFSET(REL_D,,MATCH(R$1,IND,0)-2),REL_D,$D$3,OrgID,$B7)","v":18},{"$f":"IFERROR(R7/$D7,\"N/A\")","v":0.182}]
[{"$f":"'Control Panel'!H63","v":"Penryhn Surgery"},{"$f":"'Control Panel'!I63","v":"F86005"},9510,62,{"$f":"IFERROR(D8/C8,\"N/A\")","v":7.0000000000000001E-3},56,{"$f":"IFERROR(F8/$D8,\"N/A\")","v":0.90300000000000002},25,{"$f":"IFERROR(H8/$D8,\"N/A\")","v":0.40300000000000002},0,{"$f":"IFERROR(J8/$D8,\"N/A\")","v":0},3,{"$f":"IFERROR(L8/$D8,\"N/A\")","v":4.8000000000000001E-2},14,{"$f":"IFERROR(N8/$D8,\"N/A\")","v":0.22600000000000001},2,{"$f":"IFERROR(P8/$N8,\"N/A\")","v":0.14299999999999999},10,0.161]
[{"$f":"'Control Panel'!H64","v":"Seymour Medical Centre"},{"$f":"'Control Panel'!I64","v":"F86006"},6825,62,8.9999999999999993E-3,50,0.80600000000000005,14,0.22600000000000001,0,0,4,6.5000000000000002E-2,12,0.19400000000000001,0,0,4,6.5000000000000002E-2]
[{"$f":"'Control Panel'!H65","v":"The Manor Practice "},{"$f":"'Control Panel'!I65","v":"F86011"},9698,173,1.7999999999999999E-2,164,0.94799999999999995,73,0.42199999999999999,4,2.3E-2,17,9.8000000000000004E-2,83,0.48,22,0.26500000000000001,20,0.11600000000000001]
[{"$f":"'Control Panel'!H66","v":"Queens Road Medical Centre"},{"$f":"'Control Panel'!I66","v":"F86030"},8161,49,6.0000000000000001E-3,44,0.89800000000000002,13,0.26500000000000001,1,0.02,4,8.2000000000000003E-2,23,0.46899999999999997,6,0.26100000000000001,12,0.245]
[{"$f":"'Control Panel'!H67","v":"The Allum Medical Centre"},{"$f":"'Control Panel'!I67","v":"F86036"},14732,217,1.4999999999999999E-2,190,0.876,63,0.28999999999999998,0,0,9,4.1000000000000002E-2,62,0.28599999999999998,10,0.161,27,0.124]
[{"$f":"'Control Panel'!H68","v":"SMA Medical Centre"},{"$f":"'Control Panel'!I68","v":"F86038"},11105,129,1.2E-2,127,0.98399999999999999,36,0.27900000000000003,0,0,15,0.11600000000000001,69,0.53500000000000003,14,0.20300000000000001,60,0.46500000000000002]
[{"$f":"'Control Panel'!H69","v":"Crawley Road Medical Centre"},{"$f":"'Control Panel'!I69","v":"F86044"},10802,123,1.0999999999999999E-2,95,0.77200000000000002,31,0.252,0,0,4,3.3000000000000002E-2,11,8.8999999999999996E-2,3,0.27300000000000002,3,2.4E-2]
[{"$f":"'Control Panel'!H70","v":"High Road Surgery "},{"$f":"'Control Panel'!I70","v":"F86045"},2026,37,1.7999999999999999E-2,34,0.91900000000000004,12,0.32400000000000001,0,0,4,0.108,22,0.59499999999999997,2,9.0999999999999998E-2,8,0.216]
[{"$f":"'Control Panel'!H71","v":"St James Medical Practice Ltd"},{"$f":"'Control Panel'!I71","v":"F86058"},16561,196,1.2E-2,156,0.79600000000000004,59,0.30099999999999999,2,0.01,13,6.6000000000000003E-2,93,0.47399999999999998,10,0.108,51,0.26]
[{"$f":"'Control Panel'!H72","v":"The Grove Road Medical Centre"},{"$f":"'Control Panel'!I72","v":"F86062"},7155,84,1.2E-2,74,0.88100000000000001,27,0.32100000000000001,4,4.8000000000000001E-2,8,9.5000000000000001E-2,35,0.41699999999999998,8,0.22900000000000001,23,0.27400000000000002]
[{"$f":"'Control Panel'!H73","v":"The Ridgeway Surgery"},{"$f":"'Control Panel'!I73","v":"F86078"},6869,63,8.9999999999999993E-3,44,0.69799999999999995,8,0.127,0,0,3,4.8000000000000001E-2,14,0.222,4,0.28599999999999998,0,0]
[{"$f":"'Control Panel'!H74","v":"Dr Dhital Practice"},{"$f":"'Control Panel'!I74","v":"F86086"},6265,85,1.4E-2,65,0.76500000000000001,21,0.247,0,0,3,3.5000000000000003E-2,19,0.224,6,0.316,13,0.153]
[{"$f":"'Control Panel'!H75","v":"The Lyndhurst Surgery"},{"$f":"'Control Panel'!I75","v":"F86088"},5027,56,1.0999999999999999E-2,41,0.73199999999999998,7,0.125,0,0,1,1.7999999999999999E-2,4,7.0999999999999994E-2,1,0.25,1,1.7999999999999999E-2]
[{"$f":"'Control Panel'!H76","v":"Addison Road Medical Practice"},{"$f":"'Control Panel'!I76","v":"F86607"},15547,211,1.4E-2,192,0.91,63,0.29899999999999999,3,1.4E-2,11,5.1999999999999998E-2,109,0.51700000000000002,14,0.128,55,0.26100000000000001]
[{"$f":"'Control Panel'!H77","v":"The Old Church Surgery"},{"$f":"'Control Panel'!I77","v":"F86616"},7996,54,7.0000000000000001E-3,45,0.83299999999999996,19,0.35199999999999998,0,0,2,3.6999999999999998E-2,21,0.38900000000000001,2,9.5000000000000001E-2,11,0.20399999999999999]
[{"$f":"'Control Panel'!H78","v":"Green Man Medical Centre"},{"$f":"'Control Panel'!I78","v":"F86621"},6445,81,1.2999999999999999E-2,71,0.877,15,0.185,0,0,4,4.9000000000000002E-2,28,0.34599999999999997,4,0.14299999999999999,22,0.27200000000000002]
[{"$f":"'Control Panel'!H79","v":"L.L. Medical Care Ltd (Agarwal & Agrawal Practice)"},{"$f":"'Control Panel'!I79","v":"F86625"},5882,91,1.4999999999999999E-2,83,0.91200000000000003,33,0.36299999999999999,1,1.0999999999999999E-2,6,6.6000000000000003E-2,18,0.19800000000000001,3,0.16700000000000001,7,7.6999999999999999E-2]
[{"$f":"'Control Panel'!H80","v":"Dr Shantir's Practice - Forest Road Medical Centre"},{"$f":"'Control Panel'!I80","v":"F86626"},7021,51,7.0000000000000001E-3,44,0.86299999999999999,8,0.157,1,0.02,3,5.8999999999999997E-2,9,0.17599999999999999,2,0.222,6,0.11799999999999999]
[{"$f":"'Control Panel'!H81","v":"Churchill Medical Centre"},{"$f":"'Control Panel'!I81","v":"F86627"},13283,211,1.6E-2,159,0.754,57,0.27,0,0,11,5.1999999999999998E-2,38,0.18,5,0.13200000000000001,18,8.5000000000000006E-2]
[{"$f":"'Control Panel'!H82","v":"Waltham Forest Community And FHS Ltd"},{"$f":"'Control Panel'!I82","v":"F86644"},{"$f":"SUMIFS(OFFSET(REL_D,,MATCH(C$1,IND,0)-2),REL_D,$D$3,OrgID,$B27)","v":9254},137,1.4999999999999999E-2,107,0.78100000000000003,31,0.22600000000000001,0,0,16,0.11700000000000001,41,0.29899999999999999,8,0.19500000000000001,22,0.161]
[{"$f":"'Control Panel'!H83","v":"Lime Tree Surgery"},{"$f":"'Control Panel'!I83","v":"F86650"},8080,117,1.4E-2,96,0.82099999999999995,29,0.248,1,8.9999999999999993E-3,9,7.6999999999999999E-2,26,0.222,9,0.34599999999999997,17,0.14499999999999999]
[{"$f":"'Control Panel'!H84","v":"Larkshall Medical Centre "},{"$f":"'Control Panel'!I84","v":"F86664"},8471,99,1.2E-2,82,0.82799999999999996,28,0.28299999999999997,0,0,8,8.1000000000000003E-2,26,0.26300000000000001,4,0.154,24,0.24199999999999999]
[{"$f":"'Control Panel'!H85","v":"The Harrow Rd GP Surgery "},{"$f":"'Control Panel'!I85","v":"F86666"},14983,224,1.4999999999999999E-2,190,0.84799999999999998,71,0.317,0,0,24,0.107,90,0.40200000000000002,22,0.24399999999999999,55,0.246]
[{"$f":"'Control Panel'!H86","v":"Higham Hill Medical Centre"},{"$f":"'Control Panel'!I86","v":"F86679"},6372,32,5.0000000000000001E-3,28,0.875,10,0.313,2,6.3E-2,4,0.125,14,0.438,3,0.214,8,0.25]
[{"$f":"'Control Panel'!H87","v":"The Bailey Practice "},{"$f":"'Control Panel'!I87","v":"F86689"},4395,27,6.0000000000000001E-3,25,0.92600000000000005,5,0.185,0,0,4,0.14799999999999999,7,0.25900000000000001,0,0,7,0.25900000000000001]
[{"$f":"'Control Panel'!H88","v":"Francis Road Medical Centre"},{"$f":"'Control Panel'!I88","v":"F86696"},6883,54,8.0000000000000002E-3,42,0.77800000000000002,10,0.185,0,0,5,9.2999999999999999E-2,7,0.13,1,0.14299999999999999,2,3.6999999999999998E-2]
[{"$f":"'Control Panel'!H89","v":"Kingshead Medical Practice"},{"$f":"'Control Panel'!I89","v":"F86700"},3901,49,1.2999999999999999E-2,42,0.85699999999999998,14,0.28599999999999998,0,0,2,4.1000000000000002E-2,3,6.0999999999999999E-2,1,0.33300000000000002,2,4.1000000000000002E-2]
[{"$f":"'Control Panel'!H90","v":"Kiyani Medical Practice"},{"$f":"'Control Panel'!I90","v":"F86701"},3853,80,2.1000000000000001E-2,69,0.86299999999999999,33,0.41299999999999998,0,0,1,1.2999999999999999E-2,31,0.38800000000000001,5,0.161,27,0.33800000000000002]
[{"$f":"'Control Panel'!H91","v":"Langthorne Sharma Family Practice"},{"$f":"'Control Panel'!I91","v":"F86705"},3512,32,8.9999999999999993E-3,29,0.90600000000000003,9,0.28100000000000003,0,0,4,0.125,9,0.28100000000000003,0,0,8,0.25]
[{"$f":"'Control Panel'!H92","v":"Claremont Medical Centre"},{"$f":"'Control Panel'!I92","v":"F86708"},2782,26,8.9999999999999993E-3,22,0.84599999999999997,5,0.192,0,0,0,0,7,0.26900000000000002,1,0.14299999999999999,5,0.192]
[{"$f":"'Control Panel'!H93","v":"Hampton Medical Centre"},{"$f":"'Control Panel'!I93","v":"F86712"},3395,15,4.0000000000000001E-3,13,0.86699999999999999,3,0.2,0,0,3,0.2,5,0.33300000000000002,2,0.4,2,0.13300000000000001]
[{"$f":"'Control Panel'!H94","v":"Chingford Medical Practice"},{"$f":"'Control Panel'!I94","v":"Y01291"},9173,96,0.01,79,0.82299999999999995,26,0.27100000000000002,1,0.01,6,6.3E-2,25,0.26,4,0.16,13,0.13500000000000001]
[{"$f":"'Control Panel'!H95","v":"Lime Tree and Sinnott Healthcare Ltd"},{"$f":"'Control Panel'!I95","v":"Y01839"},6236,82,{"$f":"IFERROR(D40/C40,\"N/A\")","v":1.2999999999999999E-2},66,{"$f":"IFERROR(F40/$D40,\"N/A\")","v":0.80500000000000005},14,{"$f":"IFERROR(H40/$D40,\"N/A\")","v":0.17100000000000001},0,{"$f":"IFERROR(J40/$D40,\"N/A\")","v":0},4,{"$f":"IFERROR(L40/$D40,\"N/A\")","v":4.9000000000000002E-2},16,{"$f":"IFERROR(N40/$D40,\"N/A\")","v":0.19500000000000001},0,0,7,{"$f":"IFERROR(R40/$D40,\"N/A\")","v":8.5000000000000006E-2}]

{"sheet":"CKD","index":14,"n_rows":40,"n_cols":11,"rows_kept":40,"cut":false,"hidden":false,"merged":[]}
[null,null,"01. Listsize",{"$f":"INDEX('Control Panel'!$B$124:$B$135,COLUMN(D1)-COLUMN($D$1)+1)","v":"LDP.08 CKD Register"},{"$f":"INDEX('Control Panel'!$B$124:$B$135,COLUMN(E1)-COLUMN($D$1)+1)","v":"%LDP.08 CKD Register"},{"$f":"INDEX('Control Panel'!$B$124:$B$135,COLUMN(F1)-COLUMN($D$1)+1)","v":"LDP.08.03 CKD and BP Recorded (last 12 m)"},{"$f":"INDEX('Control Panel'!$B$124:$B$135,COLUMN(G1)-COLUMN($D$1)+1)","v":"%LDP.08.03 CKD and BP Recorded (last 12 m)"},{"$f":"INDEX('Control Panel'!$B$124:$B$135,COLUMN(H1)-COLUMN($D$1)+1)","v":"LDP.08.01 CKD and BP less than 140/90 (last 12 m)"},{"$f":"INDEX('Control Panel'!$B$124:$B$135,COLUMN(I1)-COLUMN($D$1)+1)","v":"%LDP.08.01 CKD and BP less than 140/90 (last 12 m)"},{"$f":"INDEX('Control Panel'!$B$124:$B$135,COLUMN(J1)-COLUMN($D$1)+1)","v":"LDP.08.02 CKD Diagnosed (Last 6m)"},{"$f":"INDEX('Control Panel'!$B$124:$B$135,COLUMN(K1)-COLUMN($D$1)+1)","v":"%LDP.08.02 CKD Diagnosed (Last 6m)"}]
[null,null,"Waltham Forest - Practice Clinical Trends (LDP) Report"]
[null,{"$f":"VLOOKUP(C3,'Control Panel'!I14:J25,2,FALSE)","v":"2022-04-01"},"March 2022",{"$f":"VLOOKUP(C3,'Control Panel'!I14:J25,2,FALSE)","v":44652}]
[null,"2020-02-01",{"$f":"'Control Panel'!B123","v":"CKD"}]
["Home",null,{"$f":"VLOOKUP(C1,'Control Panel'!$B$3:$C$131,2,FALSE)","v":"List Size"},{"$f":"VLOOKUP(D1,'Control Panel'!$B$3:$D$131,3,FALSE)","v":"No. of patients on CKD register"},{"$f":"VLOOKUP(E1,'Control Panel'!$B$3:$D$131,3,FALSE)","v":"% List Size"},{"$f":"VLOOKUP(F1,'Control Panel'!$B$3:$D$131,3,FALSE)","v":"BP Recorded (last 12m)"},{"$f":"VLOOKUP(G1,'Control Panel'!$B$3:$D$131,3,FALSE)","v":"% CKD register"},{"$f":"VLOOKUP(H1,'Control Panel'!$B$3:$D$131,3,FALSE)","v":"BP < 140/90"},{"$f":"VLOOKUP(I1,'Control Panel'!$B$3:$D$131,3,FALSE)","v":"% CKD register"},{"$f":"VLOOKUP(J1,'Control Panel'!$B$3:$D$131,3,FALSE)","v":"No of patients with new diagnosis of CKD (last 6m)"},{"$f":"VLOOKUP(K1,'Control Panel'!$B$3:$D$131,3,FALSE)","v":"% CKD register"}]
["Practice Name","Total",{"$f":"SUM(C7:C40)","v":269929},{"$f":"SUM(D7:D40)","v":8232},{"$f":"IFERROR(D6/C6,\"N/A\")","v":0.03},{"$f":"SUM(F7:F40)","v":6312},{"$f":"IFERROR(F6/D6,\"N/A\")","v":0.76700000000000002},{"$f":"SUM(H7:H40)","v":4428},{"$f":"IFERROR(H6/D6,\"N/A\")","v":0.53800000000000003},{"$f":"SUM(J7:J40)","v":352},{"$f":"IFERROR(J6/D6,\"N/A\")","v":4.2999999999999997E-2}]
[{"$f":"'Control Panel'!H62","v":"The Firs Medical Centre"},{"$f":"'Control Panel'!I62","v":"F86001"},{"$f":"SUMIFS(OFFSET(REL_D,,MATCH(C$1,IND,0)-2),REL_D,$D$3,OrgID,$B7)","v":7729},305,{"$f":"IFERROR(D7/C7,\"N/A\")","v":3.9E-2},{"$f":"SUMIFS(OFFSET(REL_D,,MATCH(F$1,IND,0)-2),REL_D,$D$3,OrgID,$B7)","v":223},{"$f":"IFERROR(F7/$D7,\"N/A\")","v":0.73099999999999998},{"$f":"SUMIFS(OFFSET(REL_D,,MATCH(H$1,IND,0)-2),REL_D,$D$3,OrgID,$B7)","v":154},{"$f":"IFERROR(H7/$D7,\"N/A\")","v":0.505},{"$f":"SUMIFS(OFFSET(REL_D,,MATCH(J$1,IND,0)-2),REL_D,$D$3,OrgID,$B7)","v":8},{"$f":"IFERROR(J7/$D7,\"N/A\")","v":2.5999999999999999E-2}]
[{"$f":"'Control Panel'!H63","v":"Penryhn Surgery"},{"$f":"'Control Panel'!I63","v":"F86005"},9510,338,{"$f":"IFERROR(D8/C8,\"N/A\")","v":3.5999999999999997E-2},245,{"$f":"IFERROR(F8/$D8,\"N/A\")","v":0.72499999999999998},168,{"$f":"IFERROR(H8/$D8,\"N/A\")","v":0.497},7,{"$f":"IFERROR(J8/$D8,\"N/A\")","v":2.1000000000000001E-2}]
[{"$f":"'Control Panel'!H64","v":"Seymour Medical Centre"},{"$f":"'Control Panel'!I64","v":"F86006"},6825,154,2.3E-2,130,0.84399999999999997,66,0.42899999999999999,0,0]
[{"$f":"'Control Panel'!H65","v":"The Manor Practice "},{"$f":"'Control Panel'!I65","v":"F86011"},9698,254,2.5999999999999999E-2,211,0.83099999999999996,132,0.52,9,3.5000000000000003E-2]
[{"$f":"'Control Panel'!H66","v":"Queens Road Medical Centre"},{"$f":"'Control Panel'!I66","v":"F86030"},8161,216,2.5999999999999999E-2,191,0.88400000000000001,144,0.66700000000000004,6,2.8000000000000001E-2]
[{"$f":"'Control Panel'!H67","v":"The Allum Medical Centre"},{"$f":"'Control Panel'!I67","v":"F86036"},14732,320,2.1999999999999999E-2,257,0.80300000000000005,193,0.60299999999999998,3,8.9999999999999993E-3]
[{"$f":"'Control Panel'!H68","v":"SMA Medical Centre"},{"$f":"'Control Panel'!I68","v":"F86038"},11105,250,2.3E-2,219,0.876,170,0.68,8,3.2000000000000001E-2]
[{"$f":"'Control Panel'!H69","v":"Crawley Road Medical Centre"},{"$f":"'Control Panel'!I69","v":"F86044"},10802,227,2.1000000000000001E-2,148,0.65200000000000002,94,0.41399999999999998,5,2.1999999999999999E-2]
[{"$f":"'Control Panel'!H70","v":"High Road Surgery "},{"$f":"'Control Panel'!I70","v":"F86045"},2026,60,0.03,51,0.85,43,0.71699999999999997,2,3.3000000000000002E-2]
[{"$f":"'Control Panel'!H71","v":"St James Medical Practice Ltd"},{"$f":"'Control Panel'!I71","v":"F86058"},16561,348,2.1000000000000001E-2,286,0.82199999999999995,231,0.66400000000000003,12,3.4000000000000002E-2]
[{"$f":"'Control Panel'!H72","v":"The Grove Road Medical Centre"},{"$f":"'Control Panel'!I72","v":"F86062"},7155,167,2.3E-2,124,0.74299999999999999,75,0.44900000000000001,16,9.6000000000000002E-2]
[{"$f":"'Control Panel'!H73","v":"The Ridgeway Surgery"},{"$f":"'Control Panel'!I73","v":"F86078"},6869,156,2.3E-2,93,0.59599999999999997,66,0.42299999999999999,4,2.5999999999999999E-2]
[{"$f":"'Control Panel'!H74","v":"Dr Dhital Practice"},{"$f":"'Control Panel'!I74","v":"F86086"},6265,103,1.6E-2,70,0.68,55,0.53400000000000003,1,0.01]
[{"$f":"'Control Panel'!H75","v":"The Lyndhurst Surgery"},{"$f":"'Control Panel'!I75","v":"F86088"},5027,185,3.6999999999999998E-2,128,0.69199999999999995,88,0.47599999999999998,5,2.7E-2]
[{"$f":"'Control Panel'!H76","v":"Addison Road Medical Practice"},{"$f":"'Control Panel'!I76","v":"F86607"},15547,370,2.4E-2,284,0.76800000000000002,183,0.495,20,5.3999999999999999E-2]
[{"$f":"'Control Panel'!H77","v":"The Old Church Surgery"},{"$f":"'Control Panel'!I77","v":"F86616"},7996,345,4.2999999999999997E-2,306,0.88700000000000001,236,0.68400000000000005,11,3.2000000000000001E-2]
[{"$f":"'Control Panel'!H78","v":"Green Man Medical Centre"},{"$f":"'Control Panel'!I78","v":"F86621"},6445,204,3.2000000000000001E-2,147,0.72099999999999997,110,0.53900000000000003,3,1.4999999999999999E-2]
[{"$f":"'Control Panel'!H79","v":"L.L. Medical Care Ltd (Agarwal & Agrawal Practice)"},{"$f":"'Control Panel'!I79","v":"F86625"},5882,210,3.5999999999999997E-2,171,0.81399999999999995,113,0.53800000000000003,7,3.3000000000000002E-2]
[{"$f":"'Control Panel'!H80","v":"Dr Shantir's Practice - Forest Road Medical Centre"},{"$f":"'Control Panel'!I80","v":"F86626"},7021,120,1.7000000000000001E-2,70,0.58299999999999996,49,0.40799999999999997,0,0]
[{"$f":"'Control Panel'!H81","v":"Churchill Medical Centre"},{"$f":"'Control Panel'!I81","v":"F86627"},13283,712,5.3999999999999999E-2,538,0.75600000000000001,349,0.49,2,3.0000000000000001E-3]
[{"$f":"'Control Panel'!H82","v":"Waltham Forest Community And FHS Ltd"},{"$f":"'Control Panel'!I82","v":"F86644"},{"$f":"SUMIFS(OFFSET(REL_D,,MATCH(C$1,IND,0)-2),REL_D,$D$3,OrgID,$B27)","v":9254},330,3.5999999999999997E-2,213,0.64500000000000002,144,0.436,38,0.115]
[{"$f":"'Control Panel'!H83","v":"Lime Tree Surgery"},{"$f":"'Control Panel'!I83","v":"F86650"},8080,225,2.8000000000000001E-2,156,0.69299999999999995,100,0.44400000000000001,6,2.7E-2]
[{"$f":"'Control Panel'!H84","v":"Larkshall Medical Centre "},{"$f":"'Control Panel'!I84","v":"F86664"},8471,267,3.2000000000000001E-2,180,0.67400000000000004,143,0.53600000000000003,33,0.124]
[{"$f":"'Control Panel'!H85","v":"The Harrow Rd GP Surgery "},{"$f":"'Control Panel'!I85","v":"F86666"},14983,414,2.8000000000000001E-2,342,0.82599999999999996,247,0.59699999999999998,15,3.5999999999999997E-2]
[{"$f":"'Control Panel'!H86","v":"Higham Hill Medical Centre"},{"$f":"'Control Panel'!I86","v":"F86679"},6372,120,1.9E-2,103,0.85799999999999998,82,0.68300000000000005,5,4.2000000000000003E-2]
[{"$f":"'Control Panel'!H87","v":"The Bailey Practice "},{"$f":"'Control Panel'!I87","v":"F86689"},4395,99,2.3E-2,74,0.747,51,0.51500000000000001,2,0.02]
[{"$f":"'Control Panel'!H88","v":"Francis Road Medical Centre"},{"$f":"'Control Panel'!I88","v":"F86696"},6883,166,2.4E-2,145,0.873,77,0.46400000000000002,5,0.03]
[{"$f":"'Control Panel'!H89","v":"Kingshead Medical Practice"},{"$f":"'Control Panel'!I89","v":"F86700"},3901,344,8.7999999999999995E-2,270,0.78500000000000003,212,0.61599999999999999,12,3.5000000000000003E-2]
[{"$f":"'Control Panel'!H90","v":"Kiyani Medical Practice"},{"$f":"'Control Panel'!I90","v":"F86701"},3853,141,3.6999999999999998E-2,106,0.752,79,0.56000000000000005,7,0.05]
[{"$f":"'Control Panel'!H91","v":"Langthorne Sharma Family Practice"},{"$f":"'Control Panel'!I91","v":"F86705"},3512,90,2.5999999999999999E-2,72,0.8,50,0.55600000000000005,1,1.0999999999999999E-2]
[{"$f":"'Control Panel'!H92","v":"Claremont Medical Centre"},{"$f":"'Control Panel'!I92","v":"F86708"},2782,98,3.5000000000000003E-2,73,0.745,51,0.52,3,3.1E-2]
[{"$f":"'Control Panel'!H93","v":"Hampton Medical Centre"},{"$f":"'Control Panel'!I93","v":"F86712"},3395,98,2.9000000000000001E-2,80,0.81599999999999995,51,0.52,7,7.0999999999999994E-2]
[{"$f":"'Control Panel'!H94","v":"Chingford Medical Practice"},{"$f":"'Control Panel'!I94","v":"Y01291"},9173,605,6.6000000000000003E-2,499,0.82499999999999996,340,0.56200000000000006,87,0.14399999999999999]
[{"$f":"'Control Panel'!H95","v":"Lime Tree and Sinnott Healthcare Ltd"},{"$f":"'Control Panel'!I95","v":"Y01839"},6236,191,{"$f":"IFERROR(D40/C40,\"N/A\")","v":3.1E-2},107,{"$f":"IFERROR(F40/$D40,\"N/A\")","v":0.56000000000000005},82,{"$f":"IFERROR(H40/$D40,\"N/A\")","v":0.42899999999999999},2,{"$f":"IFERROR(J40/$D40,\"N/A\")","v":0.01}]

{"sheet":"COPD","index":15,"n_rows":40,"n_cols":19,"rows_kept":40,"cut":false,"hidden":false,"merged":[]}
[null,null,"01. Listsize","LDP.09 COPD Register",{"$f":"\"%\"&D1","v":"%LDP.09 COPD Register"},"LDP.09.01 Patients with severe or very severe COPD (FEV1<50)",{"$f":"\"%\"&F1","v":"%LDP.09.01 Patients with severe or very severe COPD (FEV1<50)"},"LDP.09.02 Patients with smoking status recorded (last 12m) or never smoked",{"$f":"\"%\"&H1","v":"%LDP.09.02 Patients with smoking status recorded (last 12m) or never smoked"},"LDP.09.03 COPD patients recorded as a Smoker",{"$f":"\"%\"&J1","v":"%LDP.09.03 COPD patients recorded as a Smoker"},"LDP.09.04 COPD Patients who are current smokers & referred to the Stop Smoking C",{"$f":"\"%\"&L1","v":"%LDP.09.04 COPD Patients who are current smokers & referred to the Stop Smoking C"},"LDP.09.05 No of COPD with flu vaccination (From August 2018)",{"$f":"\"%\"&N1","v":"%LDP.09.05 No of COPD with flu vaccination (From August 2018)"},"LDP.09.06 No of COPD with pneumococcal vaccination ever",{"$f":"\"%\"&P1","v":"%LDP.09.06 No of COPD with pneumococcal vaccination ever"},"LDP.09.07 No of COPD patients referred to pulmonary rehab ever",{"$f":"\"%\"&R1","v":"%LDP.09.07 No of COPD patients referred to pulmonary rehab ever"}]
[null,null,"Waltham Forest - Practice Clinical Trends (LDP) Report"]
[null,{"$f":"VLOOKUP(C3,'Control Panel'!I14:J25,2,FALSE)","v":"2022-04-01"},"March 2022",{"$f":"VLOOKUP(C3,'Control Panel'!I14:J25,2,FALSE)","v":44652}]
[null,"2020-02-01",{"$f":"'Control Panel'!B132","v":"COPD"},1,2,3,4,5,6,7,8,9,10,11,12,13,14,15,16]
["Home",null,"List Size","No. of patients on COPD register","% List Size","No of patients with severe or very severe COPD (FEV1<50)","% COPD register","No. of COPD Patients with smoking status recorded (last 12m) or never smoked","% COPD","No. of COPD patients recorded as a Smoker","% COPD","No. of COPD Patients who are current smokers & referred to the Stop Smoking Clinic (12m)","% of current COPD smokers","No of COPD with flu  vaccination (From August 2021)","% of COPD register","No of COPD with pneumococcal vaccination ever","% of COPD register","No of COPD patients referred to pulmonary rehab ever","% of COPD register"]
["Practice Name","Total",{"$f":"SUM(C7:C40)","v":269929},{"$f":"SUM(D7:D40)","v":2214},{"$f":"IFERROR(D6/C6,\"N/A\")","v":8.0000000000000002E-3},{"$f":"SUM(F7:F40)","v":360},{"$f":"IFERROR(F6/$D$6,\"N/A\")","v":0.16300000000000001},{"$f":"SUM(H7:H40)","v":1895},{"$f":"IFERROR(H6/$D$6,\"N/A\")","v":0.85599999999999998},{"$f":"SUM(J7:J40)","v":659},{"$f":"IFERROR(J6/$D$6,\"N/A\")","v":0.29799999999999999},{"$f":"SUM(L7:L40)","v":22},{"$f":"IFERROR(L6/$J$6,\"N/A\")","v":3.3000000000000002E-2},{"$f":"SUM(N7:N40)","v":1539},{"$f":"IFERROR(N6/$D$6,\"N/A\")","v":0.69499999999999995},{"$f":"SUM(P7:P40)","v":1654},{"$f":"IFERROR(P6/$D$6,\"N/A\")","v":0.747},{"$f":"SUM(R7:R40)","v":1131},{"$f":"IFERROR(R6/$D$6,\"N/A\")","v":0.51100000000000001}]
[{"$f":"'Control Panel'!H62","v":"The Firs Medical Centre"},{"$f":"'Control Panel'!I62","v":"F86001"},{"$f":"SUMIFS(OFFSET(REL_D,,MATCH(C$1,IND,0)-2),REL_D,$D$3,OrgID,$B7)","v":7729},84,{"$f":"IFERROR(D7/C7,\"N/A\")","v":1.0999999999999999E-2},{"$f":"SUMIFS(OFFSET(REL_D,,MATCH(F$1,IND,0)-2),REL_D,$D$3,OrgID,$B7)","v":11},{"$f":"IFERROR(F7/$D7,\"N/A\")","v":0.13100000000000001},{"$f":"SUMIFS(OFFSET(REL_D,,MATCH(H$1,IND,0)-2),REL_D,$D$3,OrgID,$B7)","v":64},{"$f":"IFERROR(H7/$D7,\"N/A\")","v":0.76200000000000001},{"$f":"SUMIFS(OFFSET(REL_D,,MATCH(J$1,IND,0)-2),REL_D,$D$3,OrgID,$B7)","v":17},{"$f":"IFERROR(J7/$D7,\"N/A\")","v":0.20200000000000001},{"$f":"SUMIFS(OFFSET(REL_D,,MATCH(L$1,IND,0)-2),REL_D,$D$3,OrgID,$B7)","v":0},{"$f":"IFERROR(L7/$J7,\"N/A\")","v":0},{"$f":"SUMIFS(OFFSET(REL_D,,MATCH(N$1,IND,0)-2),REL_D,$D$3,OrgID,$B7)","v":48},{"$f":"IFERROR(N7/$D7,\"N/A\")","v":0.57099999999999995},{"$f":"SUMIFS(OFFSET(REL_D,,MATCH(P$1,IND,0)-2),REL_D,$D$3,OrgID,$B7)","v":55},{"$f":"IFERROR(P7/$D7,\"N/A\")","v":0.65500000000000003},{"$f":"SUMIFS(OFFSET(REL_D,,MATCH(R$1,IND,0)-2),REL_D,$D$3,OrgID,$B7)","v":30},{"$f":"IFERROR(R7/$D7,\"N/A\")","v":0.35699999999999998}]
[{"$f":"'Control Panel'!H63","v":"Penryhn Surgery"},{"$f":"'Control Panel'!I63","v":"F86005"},9510,105,1.0999999999999999E-2,11,0.105,90,0.85699999999999998,33,0.314,0,{"$f":"IFERROR(L8/$J8,\"N/A\")","v":0},80,{"$f":"IFERROR(N8/$D8,\"N/A\")","v":0.76200000000000001},81,{"$f":"IFERROR(P8/$D8,\"N/A\")","v":0.77100000000000002},52,{"$f":"IFERROR(R8/$D8,\"N/A\")","v":0.495}]
[{"$f":"'Control Panel'!H64","v":"Seymour Medical Centre"},{"$f":"'Control Panel'!I64","v":"F86006"},6825,56,8.0000000000000002E-3,18,0.32100000000000001,35,0.625,17,0.30399999999999999,1,5.8999999999999997E-2,33,{"$f":"IFERROR(N9/$D9,\"N/A\")","v":0.58899999999999997},31,{"$f":"IFERROR(P9/$D9,\"N/A\")","v":0.55400000000000005},35,{"$f":"IFERROR(R9/$D9,\"N/A\")","v":0.625}]
[{"$f":"'Control Panel'!H65","v":"The Manor Practice "},{"$f":"'Control Panel'!I65","v":"F86011"},9698,93,0.01,18,0.19400000000000001,91,0.97799999999999998,27,0.28999999999999998,6,0.222,62,{"$f":"IFERROR(N10/$D10,\"N/A\")","v":0.66700000000000004},70,{"$f":"IFERROR(P10/$D10,\"N/A\")","v":0.753},60,{"$f":"IFERROR(R10/$D10,\"N/A\")","v":0.64500000000000002}]
[{"$f":"'Control Panel'!H66","v":"Queens Road Medical Centre"},{"$f":"'Control Panel'!I66","v":"F86030"},8161,38,5.0000000000000001E-3,4,0.105,36,0.94699999999999995,10,0.26300000000000001,0,0,30,{"$f":"IFERROR(N11/$D11,\"N/A\")","v":0.78900000000000003},29,{"$f":"IFERROR(P11/$D11,\"N/A\")","v":0.76300000000000001},13,{"$f":"IFERROR(R11/$D11,\"N/A\")","v":0.34200000000000003}]
[{"$f":"'Control Panel'!H67","v":"The Allum Medical Centre"},{"$f":"'Control Panel'!I67","v":"F86036"},14732,105,7.0000000000000001E-3,20,0.19,100,0.95199999999999996,37,0.35199999999999998,3,8.1000000000000003E-2,74,{"$f":"IFERROR(N12/$D12,\"N/A\")","v":0.70499999999999996},85,{"$f":"IFERROR(P12/$D12,\"N/A\")","v":0.81},81,{"$f":"IFERROR(R12/$D12,\"N/A\")","v":0.77100000000000002}]
[{"$f":"'Control Panel'!H68","v":"SMA Medical Centre"},{"$f":"'Control Panel'!I68","v":"F86038"},11105,46,4.0000000000000001E-3,7,0.152,44,0.95699999999999996,12,0.26100000000000001,1,8.3000000000000004E-2,37,{"$f":"IFERROR(N13/$D13,\"N/A\")","v":0.80400000000000005},30,{"$f":"IFERROR(P13/$D13,\"N/A\")","v":0.65200000000000002},22,{"$f":"IFERROR(R13/$D13,\"N/A\")","v":0.47799999999999998}]
[{"$f":"'Control Panel'!H69","v":"Crawley Road Medical Centre"},{"$f":"'Control Panel'!I69","v":"F86044"},10802,35,3.0000000000000001E-3,5,0.14299999999999999,33,0.94299999999999995,8,0.22900000000000001,0,0,19,{"$f":"IFERROR(N14/$D14,\"N/A\")","v":0.54300000000000004},26,{"$f":"IFERROR(P14/$D14,\"N/A\")","v":0.74299999999999999},15,{"$f":"IFERROR(R14/$D14,\"N/A\")","v":0.42899999999999999}]
[{"$f":"'Control Panel'!H70","v":"High Road Surgery "},{"$f":"'Control Panel'!I70","v":"F86045"},2026,20,0.01,1,0.05,19,0.95,8,0.4,0,0,16,{"$f":"IFERROR(N15/$D15,\"N/A\")","v":0.8},17,{"$f":"IFERROR(P15/$D15,\"N/A\")","v":0.85},4,{"$f":"IFERROR(R15/$D15,\"N/A\")","v":0.2}]
[{"$f":"'Control Panel'!H71","v":"St James Medical Practice Ltd"},{"$f":"'Control Panel'!I71","v":"F86058"},16561,108,7.0000000000000001E-3,14,0.13,99,0.91700000000000004,30,0.27800000000000002,0,0,70,{"$f":"IFERROR(N16/$D16,\"N/A\")","v":0.64800000000000002},85,{"$f":"IFERROR(P16/$D16,\"N/A\")","v":0.78700000000000003},45,{"$f":"IFERROR(R16/$D16,\"N/A\")","v":0.41699999999999998}]
[{"$f":"'Control Panel'!H72","v":"The Grove Road Medical Centre"},{"$f":"'Control Panel'!I72","v":"F86062"},7155,61,8.9999999999999993E-3,16,0.26200000000000001,60,0.98399999999999999,21,0.34399999999999997,2,9.5000000000000001E-2,34,{"$f":"IFERROR(N17/$D17,\"N/A\")","v":0.55700000000000005},43,{"$f":"IFERROR(P17/$D17,\"N/A\")","v":0.70499999999999996},25,{"$f":"IFERROR(R17/$D17,\"N/A\")","v":0.41}]
[{"$f":"'Control Panel'!H73","v":"The Ridgeway Surgery"},{"$f":"'Control Panel'!I73","v":"F86078"},6869,72,0.01,6,8.3000000000000004E-2,47,0.65300000000000002,14,0.19400000000000001,0,0,59,{"$f":"IFERROR(N18/$D18,\"N/A\")","v":0.81899999999999995},53,{"$f":"IFERROR(P18/$D18,\"N/A\")","v":0.73599999999999999},10,{"$f":"IFERROR(R18/$D18,\"N/A\")","v":0.13900000000000001}]
[{"$f":"'Control Panel'!H74","v":"Dr Dhital Practice"},{"$f":"'Control Panel'!I74","v":"F86086"},6265,30,5.0000000000000001E-3,2,6.7000000000000004E-2,23,0.76700000000000002,5,0.16700000000000001,0,0,15,{"$f":"IFERROR(N19/$D19,\"N/A\")","v":0.5},16,{"$f":"IFERROR(P19/$D19,\"N/A\")","v":0.53300000000000003},11,{"$f":"IFERROR(R19/$D19,\"N/A\")","v":0.36699999999999999}]
[{"$f":"'Control Panel'!H75","v":"The Lyndhurst Surgery"},{"$f":"'Control Panel'!I75","v":"F86088"},5027,36,7.0000000000000001E-3,7,0.19400000000000001,24,0.66700000000000004,7,0.19400000000000001,0,0,21,{"$f":"IFERROR(N20/$D20,\"N/A\")","v":0.58299999999999996},28,{"$f":"IFERROR(P20/$D20,\"N/A\")","v":0.77800000000000002},19,{"$f":"IFERROR(R20/$D20,\"N/A\")","v":0.52800000000000002}]
[{"$f":"'Control Panel'!H76","v":"Addison Road Medical Practice"},{"$f":"'Control Panel'!I76","v":"F86607"},15547,88,6.0000000000000001E-3,10,0.114,77,0.875,34,0.38600000000000001,3,8.7999999999999995E-2,66,{"$f":"IFERROR(N21/$D21,\"N/A\")","v":0.75},72,{"$f":"IFERROR(P21/$D21,\"N/A\")","v":0.81799999999999995},57,{"$f":"IFERROR(R21/$D21,\"N/A\")","v":0.64800000000000002}]
[{"$f":"'Control Panel'!H77","v":"The Old Church Surgery"},{"$f":"'Control Panel'!I77","v":"F86616"},7996,69,8.9999999999999993E-3,6,8.6999999999999994E-2,58,0.84099999999999997,15,0.217,0,0,52,{"$f":"IFERROR(N22/$D22,\"N/A\")","v":0.754},59,{"$f":"IFERROR(P22/$D22,\"N/A\")","v":0.85499999999999998},21,{"$f":"IFERROR(R22/$D22,\"N/A\")","v":0.30399999999999999}]
[{"$f":"'Control Panel'!H78","v":"Green Man Medical Centre"},{"$f":"'Control Panel'!I78","v":"F86621"},6445,28,4.0000000000000001E-3,1,3.5999999999999997E-2,26,0.92900000000000005,11,0.39300000000000002,2,0.182,20,{"$f":"IFERROR(N23/$D23,\"N/A\")","v":0.71399999999999997},24,{"$f":"IFERROR(P23/$D23,\"N/A\")","v":0.85699999999999998},24,{"$f":"IFERROR(R23/$D23,\"N/A\")","v":0.85699999999999998}]
[{"$f":"'Control Panel'!H79","v":"L.L. Medical Care Ltd (Agarwal & Agrawal Practice)"},{"$f":"'Control Panel'!I79","v":"F86625"},5882,50,8.9999999999999993E-3,13,0.26,41,0.82,17,0.34,0,0,32,{"$f":"IFERROR(N24/$D24,\"N/A\")","v":0.64},31,{"$f":"IFERROR(P24/$D24,\"N/A\")","v":0.62},47,{"$f":"IFERROR(R24/$D24,\"N/A\")","v":0.94}]
[{"$f":"'Control Panel'!H80","v":"Dr Shantir's Practice - Forest Road Medical Centre"},{"$f":"'Control Panel'!I80","v":"F86626"},7021,26,4.0000000000000001E-3,7,0.26900000000000002,18,0.69199999999999995,4,0.154,0,0,15,{"$f":"IFERROR(N25/$D25,\"N/A\")","v":0.57699999999999996},18,{"$f":"IFERROR(P25/$D25,\"N/A\")","v":0.69199999999999995},10,{"$f":"IFERROR(R25/$D25,\"N/A\")","v":0.38500000000000001}]
[{"$f":"'Control Panel'!H81","v":"Churchill Medical Centre"},{"$f":"'Control Panel'!I81","v":"F86627"},13283,223,1.7000000000000001E-2,35,0.157,186,0.83399999999999996,76,0.34100000000000003,0,0,142,{"$f":"IFERROR(N26/$D26,\"N/A\")","v":0.63700000000000001},164,{"$f":"IFERROR(P26/$D26,\"N/A\")","v":0.73499999999999999},108,{"$f":"IFERROR(R26/$D26,\"N/A\")","v":0.48399999999999999}]
[{"$f":"'Control Panel'!H82","v":"Waltham Forest Community And FHS Ltd"},{"$f":"'Control Panel'!I82","v":"F86644"},{"$f":"SUMIFS(OFFSET(REL_D,,MATCH(C$1,IND,0)-2),REL_D,$D$3,OrgID,$B27)","v":9254},89,0.01,10,0.112,77,0.86499999999999999,19,0.21299999999999999,1,5.2999999999999999E-2,59,{"$f":"IFERROR(N27/$D27,\"N/A\")","v":0.66300000000000003},68,{"$f":"IFERROR(P27/$D27,\"N/A\")","v":0.76400000000000001},36,{"$f":"IFERROR(R27/$D27,\"N/A\")","v":0.40400000000000003}]
[{"$f":"'Control Panel'!H83","v":"Lime Tree Surgery"},{"$f":"'Control Panel'!I83","v":"F86650"},8080,57,7.0000000000000001E-3,12,0.21099999999999999,50,0.877,13,0.22800000000000001,0,0,42,{"$f":"IFERROR(N28/$D28,\"N/A\")","v":0.73699999999999999},37,{"$f":"IFERROR(P28/$D28,\"N/A\")","v":0.64900000000000002},42,{"$f":"IFERROR(R28/$D28,\"N/A\")","v":0.73699999999999999}]
[{"$f":"'Control Panel'!H84","v":"Larkshall Medical Centre "},{"$f":"'Control Panel'!I84","v":"F86664"},8471,96,1.0999999999999999E-2,14,0.14599999999999999,89,0.92700000000000005,24,0.25,0,0,75,{"$f":"IFERROR(N29/$D29,\"N/A\")","v":0.78100000000000003},81,{"$f":"IFERROR(P29/$D29,\"N/A\")","v":0.84399999999999997},32,{"$f":"IFERROR(R29/$D29,\"N/A\")","v":0.33300000000000002}]
[{"$f":"'Control Panel'!H85","v":"The Harrow Rd GP Surgery "},{"$f":"'Control Panel'!I85","v":"F86666"},14983,122,8.0000000000000002E-3,38,0.311,115,0.94299999999999995,60,0.49199999999999999,1,1.7000000000000001E-2,83,{"$f":"IFERROR(N30/$D30,\"N/A\")","v":0.68},91,{"$f":"IFERROR(P30/$D30,\"N/A\")","v":0.746},50,{"$f":"IFERROR(R30/$D30,\"N/A\")","v":0.41}]
[{"$f":"'Control Panel'!H86","v":"Higham Hill Medical Centre"},{"$f":"'Control Panel'!I86","v":"F86679"},6372,32,5.0000000000000001E-3,10,0.313,31,0.96899999999999997,11,0.34399999999999997,0,0,20,{"$f":"IFERROR(N31/$D31,\"N/A\")","v":0.625},19,{"$f":"IFERROR(P31/$D31,\"N/A\")","v":0.59399999999999997},12,{"$f":"IFERROR(R31/$D31,\"N/A\")","v":0.375}]
[{"$f":"'Control Panel'!H87","v":"The Bailey Practice "},{"$f":"'Control Panel'!I87","v":"F86689"},4395,44,0.01,2,4.4999999999999998E-2,41,0.93200000000000005,15,0.34100000000000003,1,6.7000000000000004E-2,31,{"$f":"IFERROR(N32/$D32,\"N/A\")","v":0.70499999999999996},26,{"$f":"IFERROR(P32/$D32,\"N/A\")","v":0.59099999999999997},25,{"$f":"IFERROR(R32/$D32,\"N/A\")","v":0.56799999999999995}]
[{"$f":"'Control Panel'!H88","v":"Francis Road Medical Centre"},{"$f":"'Control Panel'!I88","v":"F86696"},6883,25,4.0000000000000001E-3,3,0.12,21,0.84,5,0.2,0,0,13,{"$f":"IFERROR(N33/$D33,\"N/A\")","v":0.52},13,{"$f":"IFERROR(P33/$D33,\"N/A\")","v":0.52},16,{"$f":"IFERROR(R33/$D33,\"N/A\")","v":0.64}]
[{"$f":"'Control Panel'!H89","v":"Kingshead Medical Practice"},{"$f":"'Control Panel'!I89","v":"F86700"},3901,104,2.7E-2,13,0.125,93,0.89400000000000002,31,0.29799999999999999,0,0,90,{"$f":"IFERROR(N34/$D34,\"N/A\")","v":0.86499999999999999},87,{"$f":"IFERROR(P34/$D34,\"N/A\")","v":0.83699999999999997},64,{"$f":"IFERROR(R34/$D34,\"N/A\")","v":0.61499999999999999}]
[{"$f":"'Control Panel'!H90","v":"Kiyani Medical Practice"},{"$f":"'Control Panel'!I90","v":"F86701"},3853,24,6.0000000000000001E-3,6,0.25,17,0.70799999999999996,10,0.41699999999999998,0,0,18,{"$f":"IFERROR(N35/$D35,\"N/A\")","v":0.75},19,{"$f":"IFERROR(P35/$D35,\"N/A\")","v":0.79200000000000004},17,{"$f":"IFERROR(R35/$D35,\"N/A\")","v":0.70799999999999996}]
[{"$f":"'Control Panel'!H91","v":"Langthorne Sharma Family Practice"},{"$f":"'Control Panel'!I91","v":"F86705"},3512,27,8.0000000000000002E-3,4,0.14799999999999999,23,0.85199999999999998,11,0.40699999999999997,0,0,23,{"$f":"IFERROR(N36/$D36,\"N/A\")","v":0.85199999999999998},18,{"$f":"IFERROR(P36/$D36,\"N/A\")","v":0.66700000000000004},14,{"$f":"IFERROR(R36/$D36,\"N/A\")","v":0.51900000000000002}]
[{"$f":"'Control Panel'!H92","v":"Claremont Medical Centre"},{"$f":"'Control Panel'!I92","v":"F86708"},2782,17,6.0000000000000001E-3,3,0.17599999999999999,14,0.82399999999999995,1,5.8999999999999997E-2,1,1,13,{"$f":"IFERROR(N37/$D37,\"N/A\")","v":0.76500000000000001},13,{"$f":"IFERROR(P37/$D37,\"N/A\")","v":0.76500000000000001},11,{"$f":"IFERROR(R37/$D37,\"N/A\")","v":0.64700000000000002}]
[{"$f":"'Control Panel'!H93","v":"Hampton Medical Centre"},{"$f":"'Control Panel'!I93","v":"F86712"},3395,14,4.0000000000000001E-3,4,0.28599999999999998,11,0.78600000000000003,3,0.214,0,0,11,{"$f":"IFERROR(N38/$D38,\"N/A\")","v":0.78600000000000003},11,{"$f":"IFERROR(P38/$D38,\"N/A\")","v":0.78600000000000003},6,{"$f":"IFERROR(R38/$D38,\"N/A\")","v":0.42899999999999999}]
[{"$f":"'Control Panel'!H94","v":"Chingford Medical Practice"},{"$f":"'Control Panel'!I94","v":"Y01291"},9173,113,1.2E-2,24,0.21199999999999999,89,0.78800000000000003,27,0.23899999999999999,0,0,83,{"$f":"IFERROR(N39/$D39,\"N/A\")","v":0.73499999999999999},90,{"$f":"IFERROR(P39/$D39,\"N/A\")","v":0.79600000000000004},96,{"$f":"IFERROR(R39/$D39,\"N/A\")","v":0.85}]
[{"$f":"'Control Panel'!H95","v":"Lime Tree and Sinnott Healthcare Ltd"},{"$f":"'Control Panel'!I95","v":"Y01839"},6236,77,1.2E-2,5,6.5000000000000002E-2,53,0.68799999999999994,26,0.33800000000000002,0,0,53,{"$f":"IFERROR(N40/$D40,\"N/A\")","v":0.68799999999999994},64,{"$f":"IFERROR(P40/$D40,\"N/A\")","v":0.83099999999999996},21,{"$f":"IFERROR(R40/$D40,\"N/A\")","v":0.27300000000000002}]

{"sheet":"Practice list","index":16,"n_rows":41,"n_cols":14,"rows_kept":41,"cut":false,"hidden":true,"merged":[]}
["Practice ID","Practice","Locality ID","Locality","SubLocality ID","SubLocality","Address 1","Address 2","Postcode","Grid Reference","X (easting)","Y (northing)","Latitude","Longitude"]
["F86700","Kings Head Medical Practice","WF","Waltham Forest","WF-1","Chingford/ Walthamstow","178 Kings Head Hill","Chingford","E4 7NX","TQ 37715 94859",537715,194859,51.635688000000002,-1.1447793E-2]
["F86664","Larkshall Medical Centre","WF","Waltham Forest","WF-1","Chingford/ Walthamstow","1 Larkshall Road","Chingford","E4 7HS","TQ 38739 93914",538739,193914,51.626944999999999,2.9649466000000002E-3]
["F86638","The Microfaculty","WF","Waltham Forest","WF-1","Chingford/ Walthamstow","107 Chingford Mount Road","Chingford","E4 8LT","TQ 37307 92314",537307,192314,51.612918000000001,-1.8336228999999999E-2]
["F86005"," The Penryhn Surgery","WF","Waltham Forest","WF-1","Chingford/ Walthamstow","2a Penryn Avenue","Walthamstow","E17 5DB","TQ 36985 90544",536985,190544,51.597090999999999,-2.3674555E-2]
["F86626","Dr Shantir Practice","WF","Waltham Forest","WF-1","Chingford/ Walthamstow","354-358 Forest Rd","Walthamstow","E17 5JG","TQ 36694 89687",536694,189687,51.589461,-2.8206729E-2]
["Y01839","Lime Tree & Sinnott Healthcare Ltd","WF","Waltham Forest","WF-1","Chingford/ Walthamstow","12b Sinnott Road","Walthamstow","E17 5QB","TQ 35891 90652",535891,190652,51.598326999999998,-3.9417391000000003E-2]
["F86689","The Bailey Practice","WF","Waltham Forest","WF-1","Chingford/ Walthamstow","107 Shernhall Street","Walthamstow","E17 9HS","TQ 38167 89081",538167,189081,51.583657000000002,-7.1959318999999999E-3]
["F86026","Forest Surgery","WF","Waltham Forest","WF-1","Chingford/ Walthamstow","2 Macdonald Road","Walthamstow","E17 4BA","TQ 38283 90316",538283,190316,51.594726000000001,-5.0366318E-3]
["F86004","Handsworth Medical Centre","WF","Waltham Forest","WF-2","Chingford E4","Highams Park, Handsworth Avenue","Chingford","E4 9PD"]
["Y01291","Chingford Medical Practice","WF","Waltham Forest","WF-2","Chingford E4","109 York Road","Chingford","E4 8LF","TQ 37006 92657",537006,192657,51.616073999999998,-2.2546676000000002E-2]
["F86627","Churchill Medical Centre","WF","Waltham Forest","WF-2","Chingford E4","1 Churchill Terrace","Chingford","E4 8DG","TQ 37293 92913",537293,192913,51.618304000000002,-1.8303841000000001E-2]
["F86078","The Ridgeway Surgery","WF","Waltham Forest","WF-2","Chingford E4","1 Mount Echo Avenue","Chingford","E4 7JX","TQ 37765 94083",537765,194083,51.628701999999997,-1.1030843E-2]
["F86616","Old Church Surgery","WF","Waltham Forest","WF-2","Chingford E4","99 Chingford Avenue","Chingford","E4 6RG","TQ 37534 93450",537534,193450,51.623071000000003,-1.4614411000000001E-2]
["F86011","The Manor Practice","WF","Waltham Forest","WF-3","Leyton Collaborative","454 Lea Bridge Road","Leyton","E10 7DY","TQ 37179 87682",537179,187682,51.571325999999999,-2.1992728E-2]
["F86038","Sma Medical Centre","WF","Waltham Forest","WF-3","Leyton Collaborative","693-695 High Road","Leyton","E10 6RA","TQ 38108 87688",538108,187688,51.571154,-8.5942013999999994E-3]
["Y02585","The Orient Practice","WF","Waltham Forest","WF-3","Leyton Collaborative","75 Oliver Rd","Leyton","E10 5LG","TQ 37815 86429",537815,186429,51.559911999999997,-1.3312475000000001E-2]
["F86074","Leyton Healthcare (Oliver Road)","WF","Waltham Forest","WF-3","Leyton Collaborative","Leyton Orient Football Club (West Stand), 75 Oliver Road","Leyton","E10 5LG","TQ 37815 86429",537815,186429,51.559911999999997,-1.3312475000000001E-2]
["F86036","The Allum Medical Centre","WF","Waltham Forest","WF-4","Forest Integrated Health","Fairlop Road","Leytonstone","E11 1BN","TQ 38947 87574",538947,187574,51.569923000000003,3.4589922000000002E-3]
["F86044"," Crawley Road Medical Centre","WF","Waltham Forest","WF-4","Forest Integrated Health","479 High Road","Leyton","E10 5EL","TQ 37940 86918",537940,186918,51.564276,-1.1318719E-2]
["F86696","Francis Road Medical Centre","WF","Waltham Forest","WF-4","Forest Integrated Health","94 Francis Road","Leyton","E10 6PP","TQ 38466 86672",538466,186672,51.561936000000003,-3.8318204999999998E-3]
["F86712","Hampton Medical Centre","WF","Waltham Forest","WF-4","Forest Integrated Health","1 Pretoria Road","Leytonstone","E11 4BB","TQ 38721 87186",538721,187186,51.566491999999997,4.7171125999999997E-5]
["F86650","Lime Tree Surgery","WF","Waltham Forest","WF-4","Forest Integrated Health","38 Cann Hall Road","Leytonstone","E11 3HZ","TQ 39258 85734",539258,185734,51.553313000000003,7.2151919999999996E-3]
["F86088","The Lyndhurst Surgery","WF","Waltham Forest","WF-4","Forest Integrated Health","53 Lyndhurst Drive","Leyton","E10 6JB","TQ 38433 87787",538433,187787,51.571964000000001,-3.8687688000000001E-3]
["F86018","The Ecclesbourne Practice","WF","Waltham Forest","WF-4","Forest Integrated Health","Ecclesbourne Warwick Terrace, Leabridge Rd","Leyton","E17 9DP","TQ 38574 88755",538574,188755,51.580627,-1.4539803E-3]
["F86621","Green Man Medical Centre","WF","Waltham Forest","WF-5","South Leytonstone","1 Hanbury Drive","Leytonstone","E11 1HR","TQ 39685 87696",539685,187696,51.570836999999997,1.4148923000000001E-2]
["F86045","High Road Surgery","WF","Waltham Forest","WF-5","South Leytonstone","287 High Road","Leytonstone","E11 4HH","TQ 39101 85749",539101,185749,51.553485999999999,4.9580980000000002E-3]
["F86701","Kiyani Medical Practice","WF","Waltham Forest","WF-5","South Leytonstone","13 Langthorne Rd","Leytonstone","E11 4HX","TQ 38897 85957",538897,185957,51.555405999999998,2.0996700000000001E-3]
["F86625","LL Medical Care (Agarwal & Agrwal Practice)","WF","Waltham Forest","WF-5","South Leytonstone","13 Langthorne Rd","Leytonstone","E11 4HX","TQ 38897 85957",538897,185957,51.555405999999998,2.0996700000000001E-3]
["F86666","The Harrow Road Surgery","WF","Waltham Forest","WF-5","South Leytonstone","2-8 Harrow Road","Leytonstone","E11 3QF","TQ 39369 86366",539369,186366,51.558964000000003,9.0654107999999997E-3]
["F86705","The Langthorne Sharma Family Practice","WF","Waltham Forest","WF-5","South Leytonstone","13 Langthorne Rd","Leytonstone","E11 4HX","TQ 38897 85957",538897,185957,51.555405999999998,2.0996700000000001E-3]
["F86607","Addison Road Medical Practice","WF","Waltham Forest","WF-6","Central Walthamstow","Comely Bank Clinic","Walthamstow","E17 9LY","TQ 38040 89024",538040,189024,51.583176000000002,-9.0501534999999998E-3]
["F86708","Claremont Medical Centre","WF","Waltham Forest","WF-6","Central Walthamstow","29-31 Claremont Medical Centre","Walthamstow","E17 5RJ","TQ 36291 90221",536291,190221,51.594357000000002,-3.3813172000000002E-2]
["F86001"," The Firs","WF","Waltham Forest","WF-6","Central Walthamstow","26 Stephenson Road","Walthamstow","E17 7JT","TQ 36241 88655",536241,188655,51.580297000000002,-3.5141800000000001E-2]
["F86086","Dr Dhital Practice","WF","Waltham Forest","WF-6","Central Walthamstow","6 Linford Rd","Walthamstow","E17 3LA","TQ 38444 89544",538444,189544,51.587749000000002,-3.0181050000000001E-3]
["F86644","Waltham Forest Community & Family Health Services Ltd","WF","Waltham Forest","WF-6","Central Walthamstow","6 Linford Rd","Walthamstow","E17 3LA","TQ 38444 89544",538444,189544,51.587749000000002,-3.0181050000000001E-3]
["F86006","Seymour Medical Centre","WF","Waltham Forest","WF-7","Walthamstow West","266 Lea Bridge Road","Walthamstow","E10 7LD","TQ 36763 87420",536763,187420,51.569073000000003,-2.8093386000000001E-2]
["F86030"," Queens Road Medical Centre","WF","Waltham Forest","WF-7","Walthamstow West","48 Queens Road","Walthamstow","E17 8PX","TQ 37259 88627",537259,188627,51.579799000000001,-2.0470187000000001E-2]
["F86062","Grove Surgery","WF","Waltham Forest","WF-7","Walthamstow West","103-105 Grove Road","Walthamstow","E17 9BU","TQ 37919 88578",537919,188578,51.579197000000001,-1.0970442E-2]
["F86679","Higham Hill Medical Centre","WF","Waltham Forest","WF-7","Walthamstow West","258-260 Higham Hill Road","Walthamstow","E17 5RQ","TQ 36234 90272",536234,190272,51.594828999999997,-3.4615754999999998E-2]
["F86058","St James Medical Practice Ltd","WF","Waltham Forest","WF-7","Walthamstow West","47 St James St","Walthamstow","E17 7NH","TQ 36455 88670",536455,188670,51.580379999999998,-3.2049451E-2]

{"sheet":"WF LDP TABLE","index":17,"n_rows":1274,"n_cols":56,"rows_kept":1274,"cut":false,"hidden":true,"merged":[]}
["ProjectID","Rel_D","Run_D","Search","01. Listsize","LDP.04.11: Diabetes and BP in last 12 months","LDP.05: CVD 25-84yrs (excl CVD)","LDP.08.02 CKD Diagnosed (Last 6m)","LDP.08.03 CKD and BP Recorded (last 12 m)","CSPMH. 01.03 QRisk Recorded (12m)","CSPMH. 01.03.01 BP recorded on same day as QRisk (12m)","CSPMH. 01.03.02 Qrisk>=20 (12m)","LDP.08.01 CKD and BP less than 140/90 (last 12 m)","LDP.08 CKD Register","LDP.05.01: CVD QRISK greater than or equal 20%","LDP.05.01.01: CVD Proxy Annual Review (last 12m)","LDP.05.02: Cardiovascular Risk Score Done (5y)","LDP.04.09: Diabetes BP less than 145/85 (last 12m)","LDP.04.08: Diabetes Chol less than 5mmol (last 12m)","LDP.01.01.01: Obesity BMI more than or equal to 35 less than 40 (last 12m)","LDP.01.01.02: Obesity BMI between 30-35 (last 12m)","LDP.01.01.03: Obesity BMI equal to or over 40 (last 12m)","LDP.01.02: Smoking Status (last 12m) or Never Smoked (25yrs+)","LDP.01.03: Current Smoker (last 12m)","LDP.01.01: Obesity BMI recorded (last 12m)","LDP.01: Aged 16yrs+","CSPMH.01 SMI Register","CSPMH.01.02 Smoking Status Recorded (12m)","CSPMH.01.02.01 Current Smoker (12m)","CSPMH 01.02.01.01 Ref to clinic 12m","CSPMH.01.02.02 Ex-smoker Recorded (latest 12m)","LDP.02: Hypertension Register","LDP.02.01: Hypertension and BP < 140/90 (age under 80) < 150/90 (Age 80+)","LDP.04.07: Diabetes Influenza Vaccinations (From August 2018)","LDP.04.01: Diabetes HbA1c <7.5% OR <59mmol (last 12m)","LDP.02.02: Hypertension BP recorded (last 12m)","LDP.03: CHD Register","LDP.03.01: CHD Chol less than 5mmol (last 12m)","LDP.03.04: CHD Cholesterol recorded (last 12m)","LDP.04: Diabetes Register","LDP.09 COPD Register","LDP.09.01 Patients with severe or very severe COPD (FEV1<50)","LDP.09.02 Patients with smoking status recorded (last 12m) or never smoked","LDP.09.03 COPD patients recorded as a Smoker","LDP.09.04 COPD Patients who are current smokers & referred to the Stop Smoking C","LDP.09.05 No of COPD with flu vaccination (From August 2018)","LDP.09.06 No of COPD with pneumococcal vaccination ever","LDP.09.07 No of COPD patients referred to pulmonary rehab ever","LDP.03.02: CHD BP less than or equal 150/90 (last 9m)","LDP.10 Stroke or TIA register","LDP.10.01: Stroke/TIA BP recorded (last 12m)","LDP.10.02 Patients on Stroke/TIA register with BP <140/90 (12m)","Practice","Locality ID","SubLocality ID","SubLocality"]
["WF_LDP",43586,43598,"F86679",5757,240,3628,22,77,10,9,1,50,80,118,88,1049,207,162,86,213,49,3071,385,1387,4317,34,29,13,1,4,469,309,140,145,430,56,32,39,250,41,11,37,12,0,25,16,8,47,40,37,30,"Higham Hill Medical Centre","WF","WF-7","Walthamstow West"]
["WF_LDP",43586,43598,"F86666",14133,748,9594,37,322,109,94,21,215,366,615,415,4349,604,525,259,578,141,7501,912,3327,11406,222,182,84,0,23,1650,904,568,451,1426,197,121,139,828,99,28,89,41,0,67,76,5,157,108,92,71,"The Harrow Road Surgery","WF","WF-5","South Leytonstone"]
["WF_LDP",43586,43598,"F86696",5139,294,3449,16,161,5,2,0,82,186,102,74,823,233,205,83,177,33,1641,266,1118,4130,47,29,14,0,7,553,278,251,167,487,96,67,83,333,32,7,29,5,0,22,13,2,81,40,36,20,"Francis Road Medical Centre","WF","WF-4","Forest Integrated Health"]
["WF_LDP",43586,43598,"F86689",4059,119,2835,13,82,6,2,1,59,83,42,29,512,82,82,35,115,33,2277,131,785,3147,27,17,6,0,5,287,150,103,76,261,54,35,41,124,33,1,29,9,0,24,19,4,40,21,21,13,"The Bailey Practice","WF","WF-1","Chingford/ Walthamstow"]
["WF_LDP",43586,43598,"F86664",8332,330,5288,25,140,18,16,5,115,169,174,82,1345,290,211,131,299,73,4478,421,1624,6567,91,60,36,0,6,885,487,355,177,683,180,74,88,394,104,22,92,32,0,98,69,15,135,86,73,55,"Larkshall Medical Centre","WF","WF-1","Chingford/ Walthamstow"]
["WF_LDP",43586,43598,"F86627",13888,788,8938,21,606,36,27,9,328,670,629,417,2808,539,484,256,626,149,8109,978,2883,11332,207,150,71,12,25,1869,939,516,446,1717,409,234,282,819,241,49,217,72,6,171,163,41,300,255,234,137,"Churchill Medical Centre","WF","WF-2","Chingford E4"]
["WF_LDP",43586,43598,"F86626",5305,199,3598,3,76,7,6,1,52,81,148,111,718,151,138,64,163,35,2744,232,913,4185,35,26,10,0,2,434,273,124,125,401,68,47,54,205,21,6,20,4,0,14,12,1,56,26,24,18,"Dr Shantir Practice","WF","WF-1","Chingford/ Walthamstow"]
["WF_LDP",43586,43598,"F86650",8203,437,5522,32,141,11,8,2,88,169,205,113,1410,327,288,120,329,87,4417,530,2016,6589,112,54,27,0,14,732,328,248,249,633,117,65,76,483,62,13,45,15,1,42,37,10,90,71,64,37,"Lime Tree Surgery","WF","WF-4","Forest Integrated Health"]
["WF_LDP",43586,43598,"F86644",10868,506,6982,144,241,36,29,8,164,272,274,177,1843,325,319,123,325,72,5699,638,1717,8450,153,118,55,0,23,1238,634,344,299,1038,205,116,145,567,112,19,97,37,2,76,80,13,156,80,68,46,"Waltham Forest Community & Family Health Services Ltd","WF","WF-6","Central Walthamstow"]
["WF_LDP",43586,43598,"Y01839",6549,361,4330,57,123,27,17,4,97,135,188,142,1131,310,241,95,222,84,3672,486,1148,5221,97,67,29,0,11,743,441,209,209,630,119,71,87,400,93,5,80,39,0,67,73,4,93,52,47,31,"Lime Tree & Sinnott Healthcare Ltd","WF","WF-1","Chingford/ Walthamstow"]
["WF_LDP",43586,43598,"Y01291",8792,415,5647,39,433,10,3,0,292,516,374,209,2215,391,329,137,416,80,4624,440,2216,7033,81,64,30,0,13,1172,724,279,249,1041,201,123,145,434,114,31,108,26,0,79,72,17,172,123,112,79,"Chingford Medical Practice","WF","WF-2","Chingford E4"]
["WF_LDP",43586,43598,"Total",269643,13629,177255,1009,6517,797,499,127,4491,7274,8067,5439,63339,10942,9421,4004,10403,2353,147337,16566,58098,215039,3209,2340,1034,34,407,28849,16317,10010,7982,25304,4899,2902,3461,14670,2460,471,2207,801,31,1812,1676,375,3811,2460,2224,1534]
["WF_LDP",43586,43598,"Y02585",8112,168,5815,1,29,15,14,1,18,31,92,66,2503,119,91,70,219,52,4032,624,1365,6607,79,53,24,0,11,310,154,106,87,277,39,28,33,176,30,4,28,18,1,20,10,1,32,28,23,19]
["WF_LDP",43586,43598,"F86712",3085,196,2200,4,77,3,3,0,48,82,31,22,411,161,154,54,126,31,1850,177,806,2605,21,16,7,0,2,350,196,165,129,323,50,27,32,210,12,5,11,1,1,10,11,0,40,13,13,9,"Hampton Medical Centre","WF","WF-4","Forest Integrated Health"]
["WF_LDP",43586,43598,"F86701",3282,222,2284,5,114,28,20,3,93,126,152,117,966,194,171,52,175,24,1834,232,945,2693,75,58,32,0,11,425,288,193,137,386,59,41,47,232,19,4,19,8,0,19,19,2,48,30,27,19,"Kiyani Medical Practice","WF","WF-5","South Leytonstone"]
["WF_LDP",43586,43598,"F86700",3772,204,2461,23,246,6,6,0,189,274,163,109,592,187,152,58,166,29,2041,185,866,3054,50,35,12,2,6,772,508,175,141,684,135,70,82,216,121,20,110,38,2,104,92,30,101,89,78,61,"Kings Head Medical Practice","WF","WF-1","Chingford/ Walthamstow"]
["WF_LDP",43586,43598,"F86708",2776,176,1676,28,67,13,11,4,44,69,123,81,907,133,105,63,156,45,1526,122,656,2164,29,25,7,0,5,377,182,125,89,344,61,34,42,194,14,3,14,5,0,10,8,4,42,33,29,15,"Claremont Medical Centre","WF","WF-6","Central Walthamstow"]
["WF_LDP",43586,43598,"F86705",3029,168,2100,24,49,4,4,2,32,54,115,88,1089,121,114,52,156,28,1698,205,826,2463,24,16,7,0,2,288,160,148,100,249,51,30,34,176,29,4,22,11,0,28,16,3,39,20,19,12,"The Langthorne Sharma Family Practice","WF","WF-5","South Leytonstone"]
["WF_LDP",43586,43598,"F86625",6111,382,4056,95,155,13,3,4,101,177,141,112,1006,269,272,81,232,65,3137,335,1225,4908,97,70,32,2,15,719,382,267,233,634,134,72,94,404,62,9,58,17,2,44,38,3,97,57,52,34,"LL Medical Care (Agarwal & Agrwal Practice)","WF","WF-5","South Leytonstone"]
["WF_LDP",43586,43598,"F86036",15798,734,11041,28,325,39,22,6,254,360,206,135,2713,667,555,234,623,134,9485,927,3630,12744,235,176,74,3,38,1460,834,569,486,1221,243,157,185,817,117,30,103,50,1,86,91,31,193,119,105,69,"The Allum Medical Centre","WF","WF-4","Forest Integrated Health"]
["WF_LDP",43586,43598,"F86030",8091,497,5254,12,165,12,7,3,122,172,384,293,4072,432,415,98,298,44,4422,341,1530,6356,54,35,12,1,4,733,468,426,319,667,169,130,145,531,44,5,41,12,0,33,31,1,125,53,47,30," Queens Road Medical Centre","WF","WF-7","Walthamstow West"]
["WF_LDP",43586,43598,"F86044",8955,333,6380,8,141,26,23,6,90,168,242,142,1288,258,205,88,225,74,5260,682,1310,7426,108,79,34,0,5,766,388,229,192,656,88,50,58,373,34,10,28,17,0,24,21,8,65,48,43,25," Crawley Road Medical Centre","WF","WF-4","Forest Integrated Health"]
["WF_LDP",43586,43598,"F86038",10989,727,6586,130,231,25,18,5,172,246,438,314,4398,541,485,166,408,89,5684,460,1709,8262,133,78,25,0,5,1097,623,519,396,988,255,165,196,782,38,3,35,10,0,27,18,4,189,107,98,63,"Sma Medical Centre","WF","WF-3","Leyton Collaborative"]
["WF_LDP",43586,43598,"F86011",9264,681,3876,11,228,35,23,3,171,256,238,150,1930,586,450,149,354,92,5532,689,1846,7562,153,123,54,6,25,1202,735,493,376,1070,236,130,166,727,102,23,99,28,1,76,78,9,194,152,147,116,"The Manor Practice","WF","WF-3","Leyton Collaborative"]
["WF_LDP",43586,43598,"F86001",7940,451,5371,54,262,44,20,6,178,294,202,131,2252,372,281,126,273,60,4375,458,1542,6435,98,79,24,0,22,919,533,312,246,823,156,84,107,493,107,16,98,30,0,65,67,9,125,71,62,44," The Firs","WF","WF-6","Central Walthamstow"]
["WF_LDP",43586,43598,"F84676",4401,267,2905,11,133,34,32,5,119,137,192,156,1484,255,215,70,209,44,2300,382,1280,3536,55,47,26,2,6,295,233,206,174,282,51,43,48,281,68,14,68,36,4,49,52,60,42,22,20,19]
["WF_LDP",43586,43598,"F86006",6199,379,4128,13,150,4,4,0,72,170,73,45,1003,269,281,91,185,54,3315,371,1033,4931,51,28,15,1,6,794,365,226,207,703,101,61,70,414,53,21,51,22,1,28,24,3,81,55,51,29,"Seymour Medical Centre","WF","WF-7","Walthamstow West"]
["WF_LDP",43586,43598,"F86005",8200,287,5462,7,298,9,5,1,196,345,171,139,2455,248,202,109,287,67,4486,512,2002,6354,52,35,20,0,2,792,446,206,197,718,87,62,73,295,110,16,97,35,1,87,75,14,70,60,54,35," The Penryhn Surgery","WF","WF-1","Chingford/ Walthamstow"]
["WF_LDP",43586,43598,"F86607",14154,605,9302,25,165,50,30,7,120,175,468,310,4027,452,392,178,478,93,7625,841,3296,10810,184,148,64,3,23,1207,676,437,300,1104,197,105,128,625,94,17,87,42,4,74,72,21,150,105,100,80,"Addison Road Medical Practice","WF","WF-6","Central Walthamstow"]
["WF_LDP",43586,43598,"F86088",4746,304,3293,31,146,5,4,0,106,167,84,57,852,242,221,67,185,42,2532,224,973,3973,42,27,6,0,4,663,375,224,187,539,101,59,66,338,43,10,36,10,0,35,36,7,64,34,27,22,"The Lyndhurst Surgery","WF","WF-4","Forest Integrated Health"]
["WF_LDP",43586,43598,"F86621",5674,306,4100,3,144,4,3,0,108,164,54,38,541,275,238,54,177,26,3349,302,1170,4794,73,52,18,0,13,615,422,293,210,551,102,65,72,313,29,3,27,10,0,21,27,23,84,47,47,38,"Green Man Medical Centre","WF","WF-5","South Leytonstone"]
["WF_LDP",43586,43598,"F86616",6670,276,4369,16,240,7,1,1,191,259,277,176,1728,232,198,104,281,66,3664,408,1551,5238,42,26,15,0,2,782,512,210,170,725,185,108,124,287,57,12,51,16,0,45,39,3,146,72,69,59,"Old Church Surgery","WF","WF-2","Chingford E4"]
["WF_LDP",43586,43598,"F86086",5885,260,3675,40,88,6,5,1,59,95,134,88,875,215,157,115,288,65,3141,416,1484,4443,75,66,31,0,12,488,260,174,145,413,93,42,58,274,33,4,30,9,0,24,19,2,77,29,26,17,"Dr Dhital Practice","WF","WF-6","Central Walthamstow"]
["WF_LDP",43586,43598,"F86058",15129,689,9852,10,338,113,14,11,268,363,463,314,3962,587,479,269,724,153,7957,1083,3804,11684,187,127,67,0,27,1461,918,511,362,1261,218,138,162,714,103,17,89,31,1,80,80,7,195,110,101,78,"St James Medical Practice Ltd","WF","WF-7","Walthamstow West"]
["WF_LDP",43586,43598,"F86045",1912,129,1383,4,60,11,2,3,19,60,85,68,624,116,110,50,125,24,1198,150,599,1638,32,29,9,0,5,260,92,102,85,229,55,42,51,134,26,2,23,6,0,20,18,2,45,24,22,7,"High Road Surgery","WF","WF-5","South Leytonstone"]
["WF_LDP",43586,43598,"F86078",7360,336,4982,11,113,4,0,0,68,135,396,244,2008,237,213,93,236,44,4242,399,1201,6193,57,33,13,0,7,1198,641,238,203,961,184,91,112,367,95,10,77,27,0,70,58,5,128,109,90,57,"The Ridgeway Surgery","WF","WF-2","Chingford E4"]
["WF_LDP",43586,43598,"F86062",7084,415,4893,6,151,12,12,3,111,168,274,187,1450,315,281,124,354,72,4419,622,2315,5789,97,83,31,1,16,844,459,319,218,749,147,83,97,460,68,17,62,20,3,48,46,3,112,71,66,40,"Grove Surgery","WF","WF-7","Walthamstow West"]
["WF_LDP",43617,43619,"F86679",5788,244,3653,19,74,9,8,1,51,81,125,95,1084,203,156,85,212,53,3083,373,1418,4343,35,31,14,1,4,472,305,140,141,425,56,33,39,252,40,10,37,11,0,25,15,8,45,38,33,26,"Higham Hill Medical Centre","WF","WF-7","Walthamstow West"]
["WF_LDP",43617,43619,"F86666",14227,747,9650,33,323,103,89,22,209,372,623,412,4393,589,509,253,556,139,7499,913,3230,11481,225,176,81,0,19,1661,879,569,432,1423,200,125,144,838,101,28,89,41,0,68,77,6,155,108,91,63,"The Harrow Road Surgery","WF","WF-5","South Leytonstone"]
["WF_LDP",43617,43619,"F86696",5140,291,3450,12,162,7,3,0,86,185,111,85,865,218,199,83,179,34,1667,265,1113,4141,48,31,13,0,8,550,282,249,162,483,95,67,82,331,32,7,29,5,0,23,13,2,78,40,35,21,"Francis Road Medical Centre","WF","WF-4","Forest Integrated Health"]
["WF_LDP",43617,43619,"F86689",4092,119,2854,15,83,6,2,1,65,86,44,31,533,77,78,36,121,33,2298,136,805,3170,27,17,6,0,5,285,158,104,75,262,54,34,40,124,34,1,30,8,0,24,19,7,44,20,19,11,"The Bailey Practice","WF","WF-1","Chingford/ Walthamstow"]
["WF_LDP",43617,43619,"F86664",8337,332,5299,26,141,21,18,6,114,173,179,88,1380,292,219,133,299,72,4489,426,1617,6578,94,62,37,0,6,883,483,355,184,675,181,78,92,396,105,22,92,32,0,98,69,15,134,85,70,53,"Larkshall Medical Centre","WF","WF-1","Chingford/ Walthamstow"]
["WF_LDP",43617,43619,"F86627",13882,795,8942,17,608,37,29,10,332,674,633,415,2871,529,469,261,635,149,8089,984,2906,11332,211,148,69,12,23,1874,962,515,442,1735,415,229,271,827,242,49,212,71,6,171,163,41,306,258,234,134,"Churchill Medical Centre","WF","WF-2","Chingford E4"]
["WF_LDP",43617,43619,"F86626",5320,198,3607,3,73,7,5,1,50,80,149,104,742,147,137,62,163,33,2750,227,929,4196,35,23,8,0,2,438,260,125,121,401,67,46,53,208,19,6,18,3,0,13,11,1,51,26,24,18,"Dr Shantir Practice","WF","WF-1","Chingford/ Walthamstow"]
["WF_LDP",43617,43619,"F86650",8208,431,5528,29,145,13,10,3,88,168,203,114,1439,321,277,110,324,83,4397,520,1981,6591,110,53,27,0,12,730,316,246,244,626,119,66,77,480,61,14,44,15,1,42,36,10,93,71,64,35,"Lime Tree Surgery","WF","WF-4","Forest Integrated Health"]
["WF_LDP",43617,43619,"F86644",10913,505,7009,143,242,69,59,13,169,273,283,185,1925,324,316,133,333,79,5758,655,1770,8479,156,125,55,0,26,1240,649,340,291,1047,205,116,146,566,112,18,101,37,2,75,79,12,154,80,67,43,"Waltham Forest Community & Family Health Services Ltd","WF","WF-6","Central Walthamstow"]
["WF_LDP",43617,43619,"Y01839",6550,357,4328,56,123,26,17,4,95,137,190,138,1146,301,240,94,215,87,3672,480,1134,5222,96,65,29,0,10,746,437,210,203,623,118,70,85,400,93,5,78,40,0,67,73,4,91,52,48,31,"Lime Tree & Sinnott Healthcare Ltd","WF","WF-1","Chingford/ Walthamstow"]
["WF_LDP",43617,43619,"Y01291",8804,415,5646,38,423,11,1,0,294,514,370,208,2237,389,325,135,398,81,4614,431,2162,7040,81,63,30,0,12,1178,714,278,242,1038,201,121,144,435,115,31,109,26,0,79,72,19,173,124,112,79,"Chingford Medical Practice","WF","WF-2","Chingford E4"]
["WF_LDP",43617,43619,"Total",270256,13571,177742,1009,6532,853,531,139,4504,7349,8118,5409,64067,10723,9257,3984,10363,2370,147373,16430,57939,215627,3233,2327,1015,34,402,28908,16247,9992,7838,25208,4922,2880,3431,14709,2471,472,2200,787,32,1813,1673,388,3805,2470,2222,1517]
["WF_LDP",43617,43619,"Y02585",8051,168,5785,1,29,17,16,1,18,31,90,65,2504,127,94,70,217,53,4022,628,1367,6564,80,51,23,0,13,313,169,108,90,285,38,27,32,177,27,3,26,16,1,19,9,1,30,29,26,19]
["WF_LDP",43617,43619,"F86712",3101,195,2210,6,84,3,3,0,60,87,30,20,417,157,143,52,129,29,1844,171,808,2619,21,15,6,0,2,352,198,166,122,319,51,29,34,210,12,5,11,1,1,10,11,0,43,14,14,11,"Hampton Medical Centre","WF","WF-4","Forest Integrated Health"]
["WF_LDP",43617,43619,"F86701",3309,216,2307,6,111,25,19,3,89,127,152,114,985,188,158,48,170,24,1822,220,895,2712,74,57,31,0,11,425,281,190,131,383,58,39,46,229,19,4,19,7,0,19,19,2,40,30,26,16,"Kiyani Medical Practice","WF","WF-5","South Leytonstone"]
["WF_LDP",43617,43619,"F86700",3810,207,2485,39,266,9,9,3,213,291,171,112,610,191,153,57,163,29,2050,179,864,3086,49,38,11,1,8,782,528,178,138,701,138,68,85,220,124,20,111,37,2,105,92,34,104,91,76,57,"Kings Head Medical Practice","WF","WF-1","Chingford/ Walthamstow"]
["WF_LDP",43617,43619,"F86708",2786,175,1686,28,67,11,10,3,44,70,123,81,911,134,106,55,160,48,1538,125,659,2176,28,23,7,0,4,377,183,124,91,341,61,35,42,193,14,3,14,5,0,10,8,4,42,34,32,16,"Claremont Medical Centre","WF","WF-6","Central Walthamstow"]
["WF_LDP",43617,43619,"F86705",3024,166,2102,22,49,5,4,2,30,54,114,82,1096,119,115,50,148,27,1688,199,807,2462,24,13,5,0,1,289,160,147,100,246,51,31,36,176,31,4,23,11,0,29,17,3,40,20,19,13,"The Langthorne Sharma Family Practice","WF","WF-5","South Leytonstone"]
["WF_LDP",43617,43619,"F86625",6101,380,4051,94,152,12,3,3,99,177,143,106,1024,266,268,83,225,69,3107,322,1207,4904,97,71,33,2,15,719,363,267,227,614,134,74,93,408,61,9,55,16,1,44,38,3,95,57,53,31,"LL Medical Care (Agarwal & Agrwal Practice)","WF","WF-5","South Leytonstone"]
["WF_LDP",43617,43619,"F86036",15888,722,11106,26,328,41,23,6,251,367,212,138,2751,644,539,228,632,142,9524,933,3646,12830,238,167,70,3,36,1468,831,569,470,1210,243,154,177,818,120,31,103,52,1,88,93,32,193,121,108,72,"The Allum Medical Centre","WF","WF-4","Forest Integrated Health"]
["WF_LDP",43617,43619,"F86030",8103,485,5260,17,168,12,7,3,124,177,386,270,4057,408,395,91,285,41,4405,338,1487,6366,53,34,12,1,4,731,451,426,307,652,170,128,139,534,45,5,42,13,0,33,32,2,129,55,51,31," Queens Road Medical Centre","WF","WF-7","Walthamstow West"]
["WF_LDP",43617,43619,"F86044",8989,328,6417,10,142,26,22,6,92,170,241,134,1303,252,202,85,214,72,5267,683,1288,7465,109,81,34,0,6,764,391,233,184,642,91,48,59,376,37,10,28,15,0,25,23,8,68,50,44,28," Crawley Road Medical Centre","WF","WF-4","Forest Integrated Health"]
["WF_LDP",43617,43619,"F86038",11020,730,6613,127,228,24,18,5,164,244,436,312,4378,540,472,167,405,88,5658,441,1690,8294,131,77,25,0,4,1097,639,518,390,988,254,157,188,780,38,3,33,8,0,27,18,4,189,107,97,69,"Sma Medical Centre","WF","WF-3","Leyton Collaborative"]
["WF_LDP",43617,43619,"F86011",9227,680,3874,12,230,35,22,3,168,259,236,147,1933,559,442,147,348,90,5498,682,1801,7542,155,126,55,6,25,1207,717,491,380,1069,236,125,162,731,99,22,92,26,1,73,76,8,192,151,148,114,"The Manor Practice","WF","WF-3","Leyton Collaborative"]
["WF_LDP",43617,43619,"F86001",7931,443,5363,50,258,44,20,6,173,295,199,126,2235,353,271,122,271,60,4312,432,1484,6423,99,75,25,0,19,925,526,302,238,812,160,86,111,482,109,16,100,30,0,66,67,9,121,73,65,47," The Firs","WF","WF-6","Central Walthamstow"]
["WF_LDP",43617,43619,"F84676",4396,271,2906,10,134,32,32,5,121,138,194,162,1498,257,221,73,208,47,2305,385,1292,3537,54,46,26,3,5,294,236,206,169,282,50,43,48,283,68,13,67,36,4,49,52,60,45,22,20,19]
["WF_LDP",43617,43619,"F86006",6212,371,4125,9,149,4,4,0,72,169,72,45,1019,260,280,98,183,52,3312,366,1049,4935,52,28,14,1,7,794,362,226,207,699,102,61,71,413,55,24,53,23,1,28,24,4,82,56,52,31,"Seymour Medical Centre","WF","WF-7","Walthamstow West"]
["WF_LDP",43617,43619,"F86005",8218,295,5482,8,302,9,5,1,195,347,171,140,2466,251,206,108,292,67,4487,510,2006,6381,53,33,19,0,2,798,445,205,196,730,88,59,72,300,109,16,98,36,1,86,74,14,65,60,54,38," The Penryhn Surgery","WF","WF-1","Chingford/ Walthamstow"]
["WF_LDP",43617,43619,"F86607",14162,600,9312,29,167,53,30,8,121,180,473,315,4056,458,395,179,475,91,7598,830,3264,10818,183,149,61,3,24,1203,670,437,303,1082,197,105,127,628,94,17,87,41,5,73,71,22,146,104,94,76,"Addison Road Medical Practice","WF","WF-6","Central Walthamstow"]
["WF_LDP",43617,43619,"F86088",4791,295,3318,28,144,8,4,0,107,167,83,54,864,232,213,68,176,41,2546,221,951,4003,44,31,6,0,6,664,378,226,176,537,102,62,68,341,44,10,38,8,0,35,37,7,68,33,27,23,"The Lyndhurst Surgery","WF","WF-4","Forest Integrated Health"]
["WF_LDP",43617,43619,"F86621",5695,302,4112,2,142,6,4,0,107,163,56,40,589,261,227,52,188,29,3371,305,1234,4815,73,51,18,0,13,618,419,290,203,548,102,61,68,312,28,3,25,10,0,20,26,22,82,48,46,36,"Green Man Medical Centre","WF","WF-5","South Leytonstone"]
["WF_LDP",43617,43619,"F86616",6736,274,4413,12,239,7,2,1,190,260,281,176,1750,229,199,103,272,63,3658,391,1524,5288,42,27,15,0,2,782,499,209,172,717,185,105,120,287,57,12,49,16,0,45,39,3,152,73,71,60,"Old Church Surgery","WF","WF-2","Chingford E4"]
["WF_LDP",43617,43619,"F86086",5939,256,3714,43,88,6,5,1,61,98,132,85,870,214,150,117,276,60,3164,414,1462,4487,76,64,29,0,12,491,268,173,142,412,93,41,57,274,33,4,28,7,0,24,18,2,78,30,26,16,"Dr Dhital Practice","WF","WF-6","Central Walthamstow"]
["WF_LDP",43617,43619,"F86058",15141,692,9883,10,330,125,12,13,254,364,460,310,4002,556,491,265,743,159,7988,1079,3873,11712,190,134,69,0,30,1460,898,513,364,1256,218,144,164,717,103,17,92,30,1,81,79,8,191,109,100,77,"St James Medical Practice Ltd","WF","WF-7","Walthamstow West"]
["WF_LDP",43617,43619,"F86045",1921,128,1388,4,59,14,4,3,17,60,84,65,628,111,108,53,129,25,1200,154,604,1645,34,28,10,0,3,259,86,102,82,226,55,41,51,134,26,2,24,6,0,20,18,3,41,24,22,8,"High Road Surgery","WF","WF-5","South Leytonstone"]
["WF_LDP",43617,43619,"F86078",7358,338,4974,12,111,5,1,0,68,136,395,248,2007,246,210,100,250,46,4258,391,1271,6195,58,34,14,0,7,1197,646,239,200,974,185,89,108,367,96,10,79,27,0,71,59,5,126,108,89,56,"The Ridgeway Surgery","WF","WF-2","Chingford E4"]
["WF_LDP",43617,43619,"F86062",7086,420,4890,13,158,11,11,2,113,175,274,187,1499,320,274,128,369,75,4435,621,2341,5795,98,80,28,1,16,842,458,316,219,745,149,83,100,462,68,18,64,21,4,48,46,3,119,69,65,39,"Grove Surgery","WF","WF-7","Walthamstow West"]
["WF_LDP",43647,43648,"F86689",4112,118,2859,14,83,5,2,1,65,87,48,38,541,81,75,40,121,34,2318,144,814,3178,28,17,6,0,6,287,159,102,70,264,54,33,40,122,33,1,28,8,1,23,20,6,45,21,20,11,"The Bailey Practice","WF","WF-1","Chingford/ Walthamstow"]
["WF_LDP",43647,43648,"F86679",5849,243,3689,19,75,9,8,1,51,81,129,97,1101,202,155,89,214,53,3067,361,1450,4382,34,30,13,1,4,470,310,139,139,426,55,34,38,251,40,10,36,11,0,25,15,8,49,38,34,27,"Higham Hill Medical Centre","WF","WF-7","Walthamstow West"]
["WF_LDP",43647,43648,"F86700",3834,208,2498,28,266,8,8,3,216,291,172,110,605,196,149,54,168,30,2064,186,845,3106,49,35,10,1,8,785,547,177,137,706,138,62,80,219,123,17,113,40,3,104,92,41,106,91,74,56,"Kings Head Medical Practice","WF","WF-1","Chingford/ Walthamstow"]
["WF_LDP",43647,43648,"F86696",5156,292,3462,10,160,9,5,0,84,183,124,94,894,211,201,86,168,32,1702,275,1091,4151,49,30,13,0,8,551,276,249,161,479,93,68,80,332,32,7,30,5,0,23,13,2,78,40,35,26,"Francis Road Medical Centre","WF","WF-4","Forest Integrated Health"]
["WF_LDP",43647,43648,"F86666",14259,735,9654,34,330,99,83,19,216,377,624,392,4460,557,477,240,531,131,7477,906,3093,11507,225,168,80,1,16,1672,847,570,415,1401,203,123,146,843,104,28,90,40,0,69,78,6,158,110,91,64,"The Harrow Road Surgery","WF","WF-5","South Leytonstone"]
["WF_LDP",43647,43648,"F86644",10849,495,6975,114,245,77,64,15,164,272,287,181,1945,311,308,132,323,80,5702,633,1736,8452,150,122,54,0,25,1237,627,337,289,1030,205,114,144,561,114,19,102,39,2,75,79,12,150,75,63,40,"Waltham Forest Community & Family Health Services Ltd","WF","WF-6","Central Walthamstow"]
["WF_LDP",43647,43648,"F86627",13882,795,8936,18,610,36,28,9,340,678,642,426,2909,533,465,281,641,144,8065,980,2890,11333,214,153,68,14,25,1872,959,514,447,1732,417,221,261,830,242,47,206,70,6,171,163,42,304,258,229,143,"Churchill Medical Centre","WF","WF-2","Chingford E4"]
["WF_LDP",43647,43648,"F86664",8373,331,5319,24,142,22,19,6,111,173,182,83,1401,294,224,135,294,74,4507,426,1626,6610,98,63,38,0,7,889,489,354,186,672,183,79,90,395,104,22,90,33,0,97,68,15,134,86,71,51,"Larkshall Medical Centre","WF","WF-1","Chingford/ Walthamstow"]
["WF_LDP",43647,43648,"F86650",8292,436,5585,31,149,16,13,3,88,174,210,123,1453,313,275,107,325,82,4405,511,1957,6654,113,55,28,0,14,738,319,247,248,628,122,70,81,486,64,14,47,16,0,44,36,11,93,72,63,33,"Lime Tree Surgery","WF","WF-4","Forest Integrated Health"]
["WF_LDP",43647,43648,"Y02585",7977,171,5745,0,29,17,16,1,19,30,92,72,2480,126,98,70,212,53,3953,610,1333,6505,81,55,23,0,15,311,168,108,89,284,37,26,30,177,27,4,25,17,1,19,9,1,32,29,26,20]
["WF_LDP",43647,43648,"Y01839",6535,345,4313,52,121,25,16,4,91,139,191,138,1154,290,239,90,194,79,3513,425,1060,5205,95,53,24,0,9,747,422,212,201,602,118,72,85,404,93,6,75,36,0,66,72,4,86,55,50,28,"Lime Tree & Sinnott Healthcare Ltd","WF","WF-1","Chingford/ Walthamstow"]
["WF_LDP",43647,43648,"F84676",4383,274,2905,12,134,35,35,5,122,138,191,161,1503,260,224,75,209,47,2293,375,1301,3529,55,49,27,3,5,293,237,208,171,284,51,43,48,287,67,14,66,36,4,49,51,60,45,21,19,18]
["WF_LDP",43647,43648,"Total",270844,13514,178198,945,6563,871,533,136,4525,7393,8197,5419,61973,10569,9209,4011,10282,2347,147087,16183,57664,216173,3251,2302,987,36,415,28957,16098,9973,7706,25044,4923,2868,3426,14745,2471,473,2196,786,31,1801,1667,400,3773,2484,2203,1533]
["WF_LDP",43647,43648,"Y01291",8805,411,5658,40,424,10,1,0,295,513,368,199,2247,377,321,142,400,83,4763,457,2176,7042,80,63,28,0,13,1177,707,277,238,1019,201,122,143,434,117,31,111,29,0,79,73,19,173,123,108,80,"Chingford Medical Practice","WF","WF-2","Chingford E4"]
["WF_LDP",43647,43648,"F86705",3038,169,2122,26,53,5,4,2,38,59,119,82,1110,125,115,49,142,28,1689,191,803,2482,25,13,4,0,1,294,163,148,95,247,51,29,34,180,31,4,22,11,0,29,17,3,39,21,19,12,"The Langthorne Sharma Family Practice","WF","WF-5","South Leytonstone"]
["WF_LDP",43647,43648,"F86701",3312,213,2310,5,106,25,18,3,94,126,152,113,998,182,158,45,167,22,1807,206,868,2715,74,56,29,0,12,423,272,190,124,376,59,37,45,227,19,4,19,7,0,19,19,2,37,30,26,18,"Kiyani Medical Practice","WF","WF-5","South Leytonstone"]
["WF_LDP",43647,43648,"F86712",3111,187,2217,6,76,4,3,0,55,84,31,22,418,143,137,53,134,28,1847,172,822,2627,21,15,6,0,2,347,195,162,114,311,48,26,31,206,10,5,9,0,0,8,9,0,39,14,13,11,"Hampton Medical Centre","WF","WF-4","Forest Integrated Health"]
["WF_LDP",43647,43648,"F86708",2786,173,1689,27,65,11,10,2,42,72,123,73,912,127,105,59,154,47,1525,126,651,2179,29,21,6,0,4,376,178,125,86,333,61,37,45,194,14,2,14,5,0,9,8,4,43,33,30,15,"Claremont Medical Centre","WF","WF-6","Central Walthamstow"]
["WF_LDP",43647,43648,"F86626",5342,202,3621,4,73,8,5,1,48,82,149,111,779,136,141,65,170,38,2796,242,987,4220,35,24,8,0,2,438,251,125,127,396,68,49,56,212,19,6,17,3,0,13,11,1,47,26,23,16,"Dr Shantir Practice","WF","WF-1","Chingford/ Walthamstow"]
["WF_LDP",43647,43648,"F86038",11048,732,6643,125,229,23,18,4,165,246,437,302,1858,540,468,164,402,81,5681,450,1679,8324,133,80,24,0,5,1095,629,519,368,983,252,154,187,783,38,3,34,7,0,27,18,4,187,111,102,70,"Sma Medical Centre","WF","WF-3","Leyton Collaborative"]
["WF_LDP",43647,43648,"F86036",15971,713,11173,20,333,40,20,4,246,373,216,135,2799,631,531,235,622,138,9555,934,3688,12915,240,156,64,3,36,1481,826,569,457,1205,244,153,177,821,120,31,104,50,0,88,93,31,183,121,104,70,"The Allum Medical Centre","WF","WF-4","Forest Integrated Health"]
["WF_LDP",43647,43648,"F86045",1940,127,1401,3,60,13,4,2,21,61,84,67,632,115,108,56,129,25,1204,156,611,1660,34,27,10,0,3,264,94,102,79,231,56,42,52,136,26,2,24,6,0,20,18,3,41,24,22,9,"High Road Surgery","WF","WF-5","South Leytonstone"]
["WF_LDP",43647,43648,"F86044",8948,326,6395,10,142,27,23,9,88,169,252,140,1288,251,199,88,198,68,5201,672,1256,7435,109,84,33,0,10,757,381,232,172,651,89,44,55,372,39,10,31,16,0,26,24,8,59,51,46,28," Crawley Road Medical Centre","WF","WF-4","Forest Integrated Health"]
["WF_LDP",43647,43648,"F86030",8163,480,5295,18,174,12,7,3,132,185,389,291,4051,406,409,96,284,39,4402,343,1455,6408,53,34,11,0,5,733,457,424,298,647,168,133,145,534,45,5,43,13,0,33,32,2,134,55,48,34," Queens Road Medical Centre","WF","WF-7","Walthamstow West"]
["WF_LDP",43647,43648,"F86005",8304,294,5534,11,306,9,5,1,194,349,173,139,2484,244,210,106,292,67,4494,497,2014,6441,54,31,17,0,2,800,432,206,190,727,89,58,72,305,109,16,98,36,1,86,74,14,70,60,52,39," The Penryhn Surgery","WF","WF-1","Chingford/ Walthamstow"]
["WF_LDP",43647,43648,"F86001",7931,446,5360,43,257,44,21,6,171,294,194,124,2223,346,267,122,273,61,4272,414,1460,6426,102,77,25,0,20,932,522,301,235,818,166,90,119,484,107,15,97,29,0,63,65,9,121,75,65,49," The Firs","WF","WF-6","Central Walthamstow"]
["WF_LDP",43647,43648,"F86011",9216,684,3889,9,231,38,24,3,168,255,238,158,1936,564,463,151,343,89,5470,668,1806,7534,152,124,54,7,24,1204,707,488,387,1072,233,127,160,730,101,22,98,27,1,73,77,8,184,154,148,116,"The Manor Practice","WF","WF-3","Leyton Collaborative"]
["WF_LDP",43647,43648,"F86006",6248,377,4131,8,146,3,3,0,71,169,72,42,1045,260,281,89,176,53,3315,365,1032,4961,51,27,13,0,7,796,354,225,216,699,101,55,68,413,53,24,50,21,0,26,22,4,76,58,52,32,"Seymour Medical Centre","WF","WF-7","Walthamstow West"]
["WF_LDP",43647,43648,"F86616",6809,278,4452,10,238,8,2,1,186,260,282,171,1770,219,203,114,270,61,3643,391,1538,5337,45,30,18,0,3,789,495,210,171,712,183,105,120,291,57,12,47,16,0,45,39,3,148,75,71,55,"Old Church Surgery","WF","WF-2","Chingford E4"]
["WF_LDP",43647,43648,"F86607",14131,596,9304,32,166,53,27,8,120,183,473,311,4019,456,393,174,480,92,7541,804,3237,10814,183,147,61,3,23,1202,651,432,304,1064,195,107,129,626,93,18,89,43,5,71,69,27,147,102,88,70,"Addison Road Medical Practice","WF","WF-6","Central Walthamstow"]
["WF_LDP",43647,43648,"F86625",6121,375,4067,96,152,12,3,3,100,178,145,105,1041,264,261,85,228,67,3096,317,1193,4927,96,68,32,2,13,718,355,268,211,597,133,74,93,410,60,9,56,17,1,43,37,3,99,57,53,33,"LL Medical Care (Agarwal & Agrwal Practice)","WF","WF-5","South Leytonstone"]
["WF_LDP",43647,43648,"F86621",5691,292,4101,1,137,9,6,0,104,163,58,42,614,256,214,51,180,30,3403,310,1220,4804,74,54,17,0,14,616,415,286,199,540,103,58,67,309,29,4,27,11,0,21,27,23,87,49,48,39,"Green Man Medical Centre","WF","WF-5","South Leytonstone"]
["WF_LDP",43647,43648,"F86088",4774,290,3309,14,148,9,5,0,106,170,82,50,865,226,210,65,180,43,2531,210,946,3990,46,32,7,0,7,663,368,225,176,524,101,61,67,342,43,10,38,8,0,35,37,7,66,34,28,23,"The Lyndhurst Surgery","WF","WF-4","Forest Integrated Health"]
["WF_LDP",43647,43648,"F86062",7121,421,4920,12,160,10,10,2,114,174,279,186,1512,308,278,129,378,73,4459,607,2328,5820,100,85,29,1,17,844,456,316,214,746,150,88,105,463,68,18,64,20,5,48,46,3,121,68,64,41,"Grove Surgery","WF","WF-7","Walthamstow West"]
["WF_LDP",43647,43648,"F86058",15254,702,9984,12,334,128,12,14,262,365,465,317,4057,561,491,261,767,163,7926,1029,3998,11822,189,130,66,0,31,1466,900,515,358,1252,218,147,170,725,103,19,90,29,1,80,80,8,190,111,103,80,"St James Medical Practice Ltd","WF","WF-7","Walthamstow West"]
["WF_LDP",43647,43648,"F86086",5932,249,3720,44,89,7,5,1,60,98,132,79,868,208,141,109,259,64,3158,410,1417,4492,77,61,28,0,12,494,275,174,130,415,93,39,55,276,34,4,30,6,0,26,19,2,78,30,28,18,"Dr Dhital Practice","WF","WF-6","Central Walthamstow"]
["WF_LDP",43647,43648,"F86078",7347,334,4963,13,120,5,0,0,78,142,392,245,2001,250,215,104,254,48,4243,380,1283,6186,58,33,13,0,7,1196,655,237,204,971,185,88,108,365,93,10,76,25,0,68,57,4,124,106,87,58,"The Ridgeway Surgery","WF","WF-2","Chingford E4"]
["WF_LDP",43678,43679,"F86664",8403,324,5341,20,137,23,20,6,106,172,185,91,1436,293,233,140,297,68,4507,425,1580,6630,98,63,39,0,7,887,494,354,187,669,184,82,96,396,107,21,98,32,0,97,68,15,126,87,72,50,"Larkshall Medical Centre","WF","WF-1","Chingford/ Walthamstow"]
["WF_LDP",43678,43679,"F86650",8276,428,5576,29,144,13,10,3,83,172,216,130,1493,304,266,104,314,78,4456,515,1936,6642,111,57,24,0,16,730,320,242,250,616,119,66,78,478,64,15,49,15,0,44,36,11,83,73,62,36,"Lime Tree Surgery","WF","WF-4","Forest Integrated Health"]
["WF_LDP",43678,43679,"F86679",5856,237,3700,16,74,11,9,1,51,81,127,97,1093,205,157,86,214,52,3069,359,1452,4386,33,28,12,1,4,473,305,134,135,425,53,37,41,242,41,10,37,12,0,25,15,8,45,36,30,24,"Higham Hill Medical Centre","WF","WF-7","Walthamstow West"]
["WF_LDP",43678,43679,"F86666",14288,721,9676,34,328,95,77,19,218,378,617,385,4487,533,459,221,546,125,7490,924,3014,11525,227,163,77,1,16,1673,826,565,409,1375,199,117,139,842,104,28,88,40,0,68,76,6,149,110,88,60,"The Harrow Road Surgery","WF","WF-5","South Leytonstone"]
["WF_LDP",43678,43679,"F86644",10928,500,7030,106,251,112,60,18,165,275,298,190,2025,320,321,137,342,75,5745,625,1765,8514,152,121,52,0,24,1242,641,339,297,1035,205,118,147,566,114,19,100,36,2,75,80,12,148,77,67,44,"Waltham Forest Community & Family Health Services Ltd","WF","WF-6","Central Walthamstow"]
["WF_LDP",43678,43679,"F86625",6148,373,4087,95,150,11,3,2,96,178,147,107,1058,259,271,91,220,65,3122,333,1220,4948,97,70,31,1,14,718,351,268,217,600,134,73,93,413,61,9,54,16,1,43,37,3,101,59,53,35,"LL Medical Care (Agarwal & Agrwal Practice)","WF","WF-5","South Leytonstone"]
["WF_LDP",43678,43679,"F86621",5697,291,4109,1,140,10,6,0,109,163,59,42,632,251,210,53,188,32,3414,309,1255,4808,73,53,15,0,12,613,424,286,198,543,102,61,70,309,29,4,26,12,0,21,27,23,82,49,46,39,"Green Man Medical Centre","WF","WF-5","South Leytonstone"]
["WF_LDP",43678,43679,"F86627",13894,787,8941,15,606,35,27,7,343,675,641,422,2943,514,464,267,629,146,8050,988,2841,11338,217,146,69,14,24,1870,985,511,441,1731,414,216,255,832,241,45,194,66,8,169,162,43,290,257,227,146,"Churchill Medical Centre","WF","WF-2","Chingford E4"]
["WF_LDP",43678,43679,"F86626",5404,208,3671,5,74,9,6,1,47,83,150,105,802,143,141,68,179,41,2868,249,1043,4276,37,26,8,0,2,446,257,125,126,400,69,46,53,215,18,5,16,5,0,13,11,1,46,27,23,15,"Dr Shantir Practice","WF","WF-1","Chingford/ Walthamstow"]
["WF_LDP",43678,43679,"F86689",4149,113,2879,14,81,5,2,1,61,87,52,39,569,77,75,44,121,34,2355,159,844,3200,28,17,6,0,5,287,160,101,67,261,54,35,43,120,33,1,29,9,1,23,20,6,43,21,20,10,"The Bailey Practice","WF","WF-1","Chingford/ Walthamstow"]
["WF_LDP",43678,43679,"Y02585",7917,167,5706,1,28,19,18,2,17,30,92,71,2440,125,101,71,201,47,3915,593,1281,6452,82,56,24,0,15,313,172,108,91,287,39,27,31,173,28,4,27,18,1,19,9,1,29,29,26,20]
["WF_LDP",43678,43679,"F86712",3115,187,2220,6,75,4,4,0,57,84,31,21,419,142,144,51,138,28,1841,166,821,2632,21,17,6,0,4,346,186,162,117,307,49,26,31,206,10,5,8,0,0,8,9,0,40,14,13,10,"Hampton Medical Centre","WF","WF-4","Forest Integrated Health"]
["WF_LDP",43678,43679,"Y01291",8772,400,5635,40,414,11,1,0,292,512,367,207,2273,367,320,144,397,80,4887,485,2180,7014,78,60,27,0,12,1174,695,273,240,997,200,123,141,427,114,30,110,31,0,76,69,21,166,123,105,78,"Chingford Medical Practice","WF","WF-2","Chingford E4"]
["WF_LDP",43678,43679,"Y01839",6505,346,4305,49,125,23,14,4,93,139,190,132,1155,302,234,90,190,76,3512,417,1046,5175,95,55,24,0,8,750,419,211,199,603,117,71,84,402,93,6,74,36,0,66,72,4,88,55,52,32,"Lime Tree & Sinnott Healthcare Ltd","WF","WF-1","Chingford/ Walthamstow"]
["WF_LDP",43678,43679,"F86708",2796,174,1700,22,64,9,8,2,38,72,122,68,907,129,104,60,150,47,1525,128,651,2196,31,20,7,0,4,376,193,125,82,335,61,34,41,193,14,2,14,5,0,9,8,4,44,33,29,16,"Claremont Medical Centre","WF","WF-6","Central Walthamstow"]
["WF_LDP",43678,43679,"F86700",3834,207,2500,29,258,8,8,3,207,291,170,107,602,193,158,50,166,30,2053,191,806,3104,47,32,11,2,7,780,540,178,136,696,138,63,80,220,121,19,110,42,5,102,89,45,102,87,70,54,"Kings Head Medical Practice","WF","WF-1","Chingford/ Walthamstow"]
["WF_LDP",43678,43679,"F86696",5164,292,3467,10,160,9,6,0,94,183,142,113,931,213,211,85,168,35,1717,236,1075,4152,49,29,12,0,6,549,309,243,167,486,93,69,80,325,33,7,30,4,0,24,13,2,71,39,35,25,"Francis Road Medical Centre","WF","WF-4","Forest Integrated Health"]
["WF_LDP",43678,43679,"F86705",3037,165,2122,28,51,5,4,2,36,58,116,80,1110,123,111,48,140,27,1686,191,813,2487,24,12,4,0,1,294,156,147,97,241,50,27,32,178,31,4,22,11,0,29,17,3,36,22,20,11,"The Langthorne Sharma Family Practice","WF","WF-5","South Leytonstone"]
["WF_LDP",43678,43679,"F86701",3320,212,2315,5,107,23,15,2,97,128,154,117,1013,180,160,45,153,23,1798,205,859,2721,73,52,28,0,10,424,277,188,122,373,58,37,45,225,19,4,17,5,0,19,19,2,37,30,26,19,"Kiyani Medical Practice","WF","WF-5","South Leytonstone"]
["WF_LDP",43678,43679,"F86030",8162,487,5296,24,179,14,7,3,138,191,389,299,4028,412,422,95,277,36,4387,338,1405,6404,52,32,10,0,4,737,467,424,298,654,170,136,149,537,44,5,41,12,0,32,32,2,133,56,49,36," Queens Road Medical Centre","WF","WF-7","Walthamstow West"]
["WF_LDP",43678,43679,"F86011",9200,683,3892,8,226,37,22,2,162,252,236,159,1296,563,468,142,335,88,5457,672,1803,7521,152,121,54,7,24,1194,705,487,383,1058,231,128,157,726,101,22,97,26,1,73,77,8,182,147,139,110,"The Manor Practice","WF","WF-3","Leyton Collaborative"]
["WF_LDP",43678,43679,"F86038",11108,720,6686,122,224,17,14,4,154,247,440,294,1842,522,474,158,395,77,5774,459,1663,8382,137,85,24,0,5,1099,613,518,373,976,252,158,191,788,39,4,37,7,0,28,19,10,185,111,101,72,"Sma Medical Centre","WF","WF-3","Leyton Collaborative"]
["WF_LDP",43678,43679,"F86036",16031,712,11206,17,332,39,19,5,244,375,218,136,2871,638,526,233,657,145,9575,925,3761,12956,239,155,63,2,36,1482,847,568,457,1212,244,151,176,825,123,31,101,48,0,88,95,30,186,119,103,70,"The Allum Medical Centre","WF","WF-4","Forest Integrated Health"]
["WF_LDP",43678,43679,"F86001",7927,456,5351,26,252,45,20,6,166,294,191,122,2224,352,273,131,279,64,4262,405,1510,6423,105,75,25,0,18,938,534,309,243,825,174,88,122,497,108,16,95,25,0,63,66,9,127,80,65,48," The Firs","WF","WF-6","Central Walthamstow"]
["WF_LDP",43678,43679,"Total",267014,13210,175711,881,6411,869,480,132,4396,7287,8073,5331,60277,10277,9091,3948,10117,2287,145302,15797,56398,213114,3208,2242,954,32,402,28717,16016,9735,7595,24745,4887,2848,3411,14478,2411,460,2110,740,31,1746,1613,351,3678,2463,2168,1511]
["WF_LDP",43678,43679,"F86006",6278,371,4151,1,149,3,3,0,71,168,71,40,1049,249,284,94,170,58,3341,367,1036,4986,50,28,13,0,7,798,346,223,219,702,103,58,71,410,55,23,51,23,0,28,24,4,71,58,52,33,"Seymour Medical Centre","WF","WF-7","Walthamstow West"]
["WF_LDP",43678,43679,"F86005",8370,303,5590,8,308,5,4,1,197,349,175,136,2507,242,215,104,291,67,4552,500,2000,6515,54,33,16,0,3,808,443,207,196,734,92,60,76,316,110,15,99,36,1,85,74,14,74,60,52,35," The Penryhn Surgery","WF","WF-1","Chingford/ Walthamstow"]
["WF_LDP",43678,43679,"F86044",8911,330,6345,10,148,29,25,10,96,167,262,165,1298,265,231,89,207,70,5174,676,1258,7387,107,86,36,0,11,751,404,229,195,653,89,45,55,369,38,10,33,16,0,25,23,7,58,50,46,29," Crawley Road Medical Centre","WF","WF-4","Forest Integrated Health"]
["WF_LDP",43678,43679,"F86088",4784,289,3315,13,151,12,6,0,102,171,83,55,870,223,216,71,187,46,2539,213,986,4007,46,36,9,0,7,664,367,226,173,523,101,66,74,346,43,11,37,9,0,35,37,7,68,36,29,20,"The Lyndhurst Surgery","WF","WF-4","Forest Integrated Health"]
["WF_LDP",43678,43679,"F86086",5943,248,3731,45,90,9,6,2,62,101,132,69,875,209,134,116,250,65,3163,412,1416,4504,79,61,28,0,11,498,278,174,123,419,94,37,54,280,34,4,29,6,0,26,19,2,80,30,28,19,"Dr Dhital Practice","WF","WF-6","Central Walthamstow"]
["WF_LDP",43678,43679,"F86616",6875,283,4490,9,249,9,4,1,193,270,290,180,1807,227,205,117,280,61,3677,392,1590,5391,48,33,20,0,4,804,518,210,177,735,187,110,125,294,59,13,47,16,0,46,41,4,157,73,70,53,"Old Church Surgery","WF","WF-2","Chingford E4"]
["WF_LDP",43678,43679,"F86607",14073,604,9264,35,170,52,22,7,127,189,481,317,4011,462,398,177,472,87,7491,791,3163,10782,182,148,61,3,24,1212,664,432,308,1073,198,112,134,630,92,19,89,43,5,69,68,26,154,102,89,70,"Addison Road Medical Practice","WF","WF-6","Central Walthamstow"]
["WF_LDP",43678,43679,"F86058",15424,713,10121,13,335,133,15,14,262,370,475,334,4076,571,513,265,795,168,8006,1024,4112,11974,191,133,68,0,32,1474,905,515,374,1260,219,152,174,733,103,19,91,30,1,80,81,8,192,113,105,82,"St James Medical Practice Ltd","WF","WF-7","Walthamstow West"]
["WF_LDP",43678,43679,"F86045",1955,130,1406,1,59,14,4,2,19,62,84,64,634,112,102,59,130,23,1213,157,607,1670,34,25,9,0,3,269,89,102,81,230,58,38,52,138,26,2,24,5,0,20,18,3,41,24,22,10,"High Road Surgery","WF","WF-5","South Leytonstone"]
["WF_LDP",43678,43679,"F86078",7338,335,4962,13,120,5,0,0,84,146,394,253,1991,254,219,113,262,51,4249,376,1326,6182,59,34,15,0,6,1197,675,236,201,981,183,92,112,367,93,10,74,24,0,69,56,4,124,108,90,58,"The Ridgeway Surgery","WF","WF-2","Chingford E4"]
["WF_LDP",43678,43679,"F86062",7132,414,4925,11,152,11,11,2,109,174,276,184,1510,303,271,129,377,72,4432,592,2280,5830,100,80,27,1,16,847,451,315,216,730,154,89,109,460,68,18,62,19,5,49,46,3,120,68,64,42,"Grove Surgery","WF","WF-7","Walthamstow West"]
["WF_LDP",43709,43721,"Total",266873,13189,175717,834,6399,873,484,137,4361,7313,8123,5315,60795,10190,9035,3912,10069,2285,145271,15669,56042,213035,3211,2234,951,29,402,28664,15917,0,7627,24585,4876,2840,3407,14455,2394,454,2076,743,33,0,1603,356,3592,2459,2149,1516]
["WF_LDP",43709,43721,"Y01839",6464,348,4282,44,125,22,13,4,92,141,190,134,1154,300,235,92,189,76,3499,408,1034,5142,95,53,23,0,8,752,422,0,198,603,117,70,84,402,91,6,73,33,0,0,71,4,81,55,52,35,"Lime Tree & Sinnott Healthcare Ltd","WF","WF-1","Chingford/ Walthamstow"]
["WF_LDP",43709,43721,"F86650",8301,429,5595,29,150,14,10,3,87,172,219,129,1503,290,261,105,307,76,4496,515,1917,6665,111,59,22,0,16,725,331,0,251,621,118,64,73,474,61,15,43,14,0,0,34,11,76,73,62,35,"Lime Tree Surgery","WF","WF-4","Forest Integrated Health"]
["WF_LDP",43709,43721,"F86644",10774,499,6923,110,252,110,64,19,168,277,295,185,2035,331,315,128,335,71,5649,613,1703,8389,146,121,56,0,24,1226,633,0,290,1007,207,116,146,563,114,19,97,35,2,0,79,12,140,74,65,45,"Waltham Forest Community & Family Health Services Ltd","WF","WF-6","Central Walthamstow"]
["WF_LDP",43709,43721,"F86666",14304,720,9709,40,332,93,74,18,214,385,621,367,4509,520,452,214,514,118,7455,898,2888,11543,230,162,79,1,16,1680,808,0,414,1358,199,119,140,840,110,29,90,41,0,0,81,7,140,111,87,56,"The Harrow Road Surgery","WF","WF-5","South Leytonstone"]
["WF_LDP",43709,43721,"F86664",8385,321,5326,37,152,25,22,6,130,191,192,92,1475,291,231,144,294,68,4493,424,1584,6616,98,64,38,0,8,888,485,0,186,653,184,80,98,400,107,21,98,33,0,0,68,15,127,90,72,52,"Larkshall Medical Centre","WF","WF-1","Chingford/ Walthamstow"]
["WF_LDP",43709,43721,"F86625",6172,377,4108,96,159,10,3,2,97,181,151,112,1076,267,275,97,212,62,3131,340,1203,4970,98,74,34,1,14,720,378,0,222,615,135,79,97,413,64,9,57,16,1,0,38,3,99,59,53,37,"LL Medical Care (Agarwal & Agrwal Practice)","WF","WF-5","South Leytonstone"]
["WF_LDP",43709,43721,"F86621",5728,297,4129,1,145,12,6,0,112,164,61,44,678,260,216,51,205,33,3476,325,1306,4832,73,56,17,0,12,615,422,0,200,549,101,60,71,312,29,4,26,12,0,0,27,23,80,49,46,39,"Green Man Medical Centre","WF","WF-5","South Leytonstone"]
["WF_LDP",43709,43721,"F86627",13815,776,8914,15,567,32,22,6,313,652,643,415,2974,497,449,273,627,146,7970,956,2803,11263,215,142,63,13,25,1840,969,0,436,1680,405,210,248,821,232,42,182,66,8,0,156,43,279,247,216,140,"Churchill Medical Centre","WF","WF-2","Chingford E4"]
["WF_LDP",43709,43721,"F86626",5461,208,3704,4,70,9,6,1,43,81,153,101,849,140,135,66,178,41,2922,261,1068,4321,38,26,8,0,2,448,249,0,127,393,69,47,53,216,18,5,17,5,0,0,11,1,45,26,22,14,"Dr Shantir Practice","WF","WF-1","Chingford/ Walthamstow"]
["WF_LDP",43709,43721,"F86679",5865,234,3717,14,73,13,10,2,49,81,127,99,1105,200,159,80,222,58,3091,350,1460,4392,31,27,10,0,5,474,297,0,139,420,52,36,40,240,39,10,36,12,0,0,16,8,44,37,30,26,"Higham Hill Medical Centre","WF","WF-7","Walthamstow West"]
["WF_LDP",43709,43721,"F86708",2794,175,1706,18,67,8,7,1,39,75,122,68,906,132,102,54,155,36,1522,129,641,2199,31,18,6,0,4,374,193,0,81,328,61,36,42,193,14,1,14,5,0,0,8,4,45,33,27,17,"Claremont Medical Centre","WF","WF-6","Central Walthamstow"]
["WF_LDP",43709,43721,"F86705",3057,168,2127,10,51,5,4,2,38,57,115,79,1113,125,110,44,141,25,1699,191,802,2503,26,12,4,0,2,297,158,0,100,240,53,30,37,181,30,4,21,11,0,0,16,2,37,22,20,12,"The Langthorne Sharma Family Practice","WF","WF-5","South Leytonstone"]
["WF_LDP",43709,43721,"Y01291",8747,397,5627,21,412,11,1,0,290,511,368,211,2319,363,311,146,406,80,4968,495,2215,6998,82,63,28,0,13,1175,687,0,238,995,195,122,136,428,116,30,108,29,0,0,71,20,159,120,103,81,"Chingford Medical Practice","WF","WF-2","Chingford E4"]
["WF_LDP",43709,43721,"F86712",3128,191,2234,5,76,4,4,0,55,85,30,21,424,146,140,50,144,27,1873,177,831,2639,21,16,6,0,3,344,187,0,119,306,50,28,34,205,12,5,10,3,0,0,10,0,39,14,13,11,"Hampton Medical Centre","WF","WF-4","Forest Integrated Health"]
["WF_LDP",43709,43721,"F86696",5212,293,3496,10,159,12,7,1,97,182,148,120,967,219,207,84,167,37,1811,233,1069,4184,48,30,12,0,5,549,315,0,168,488,93,66,77,322,27,6,22,4,0,0,12,2,69,38,35,27,"Francis Road Medical Centre","WF","WF-4","Forest Integrated Health"]
["WF_LDP",43709,43721,"F86689",4144,117,2870,15,86,5,2,1,71,90,52,43,577,82,79,42,123,33,2370,163,866,3192,28,16,6,0,4,289,174,0,69,267,54,34,42,120,33,1,29,9,1,0,20,7,40,22,20,12,"The Bailey Practice","WF","WF-1","Chingford/ Walthamstow"]
["WF_LDP",43709,43721,"F86701",3322,214,2320,6,104,21,14,3,92,129,155,113,1031,174,157,42,142,25,1793,205,847,2728,74,55,30,0,10,427,271,0,122,370,58,39,47,226,19,4,17,5,0,0,19,2,40,31,27,18,"Kiyani Medical Practice","WF","WF-5","South Leytonstone"]
["WF_LDP",43709,43721,"F86700",3850,207,2510,27,253,8,8,3,197,290,167,102,598,189,163,52,161,29,2052,187,787,3119,50,34,11,2,7,781,531,0,143,697,138,62,79,220,122,19,110,44,5,0,89,45,98,87,70,53,"Kings Head Medical Practice","WF","WF-1","Chingford/ Walthamstow"]
["WF_LDP",43709,43721,"F86030",8144,489,5291,27,183,14,7,3,142,196,385,294,4010,410,418,88,267,34,4348,318,1364,6395,52,31,10,0,4,735,465,0,312,648,170,133,147,538,44,5,41,12,0,0,32,2,127,55,48,33," Queens Road Medical Centre","WF","WF-7","Walthamstow West"]
["WF_LDP",43709,43721,"F86011",9217,681,3919,5,217,40,27,3,156,250,238,157,1294,548,450,145,329,87,5460,679,1811,7537,151,118,54,6,22,1190,695,0,373,1045,229,123,152,725,102,22,100,27,1,0,77,12,172,148,139,108,"The Manor Practice","WF","WF-3","Leyton Collaborative"]
["WF_LDP",43709,43721,"F86038",11150,711,6709,116,227,17,16,3,147,249,440,291,1845,517,473,154,406,83,5810,472,1695,8416,136,84,25,0,6,1096,588,0,375,965,252,157,193,787,39,5,37,7,0,0,19,12,187,112,104,70,"Sma Medical Centre","WF","WF-3","Leyton Collaborative"]
["WF_LDP",43709,43721,"F86036",15877,713,11092,17,333,40,20,6,248,380,226,144,2929,640,518,244,656,140,9449,881,3748,12826,234,153,59,1,34,1477,842,0,451,1204,243,152,177,820,122,30,100,47,0,0,95,30,183,118,103,72,"The Allum Medical Centre","WF","WF-4","Forest Integrated Health"]
["WF_LDP",43709,43721,"F86001",7914,455,5343,10,246,42,17,6,158,293,192,120,2259,334,281,129,279,71,4190,383,1514,6414,104,68,21,0,16,940,518,0,243,825,176,89,125,495,109,16,94,28,0,0,65,9,122,80,66,48," The Firs","WF","WF-6","Central Walthamstow"]
["WF_LDP",43709,43721,"Y02585",7617,156,5483,3,28,17,14,4,19,29,87,62,2315,120,95,64,197,50,3731,561,1219,6203,78,53,25,0,15,295,155,0,87,268,40,25,33,163,22,3,21,16,1,0,7,1,27,29,25,20]
["WF_LDP",43709,43721,"F86006",6283,371,4157,1,147,4,4,0,66,167,72,41,1066,245,274,91,178,59,3393,391,1043,4994,52,30,13,0,9,798,344,0,215,712,101,53,67,408,54,22,50,26,0,0,23,3,62,58,51,31,"Seymour Medical Centre","WF","WF-7","Walthamstow West"]
["WF_LDP",43709,43721,"F86005",8425,298,5638,9,307,6,5,1,199,347,174,133,2519,239,220,102,283,65,4602,488,1957,6565,55,32,17,1,3,806,435,0,196,714,91,61,75,317,111,16,102,36,1,0,73,14,73,58,46,31," The Penryhn Surgery","WF","WF-1","Chingford/ Walthamstow"]
["WF_LDP",43709,43721,"F86044",8941,325,6383,10,147,32,27,11,95,170,273,167,1341,265,235,88,202,66,5211,687,1228,7433,110,92,38,0,11,752,391,0,188,642,87,46,55,368,37,10,32,15,0,0,23,7,55,50,45,28," Crawley Road Medical Centre","WF","WF-4","Forest Integrated Health"]
["WF_LDP",43709,43721,"F86088",4781,284,3321,13,151,10,5,0,100,173,84,56,872,215,223,70,193,44,2526,211,977,4010,47,36,9,0,7,662,365,0,175,529,102,68,76,348,42,11,37,9,0,0,36,7,75,37,29,21,"The Lyndhurst Surgery","WF","WF-4","Forest Integrated Health"]
["WF_LDP",43709,43721,"F86086",5998,251,3771,42,86,9,6,2,61,100,131,71,879,213,137,109,253,68,3182,415,1419,4540,79,64,27,0,14,499,282,0,124,415,92,40,53,282,32,4,26,5,0,0,17,2,77,30,28,18,"Dr Dhital Practice","WF","WF-6","Central Walthamstow"]
["WF_LDP",43709,43721,"F86616",6937,286,4528,8,246,9,4,1,187,270,293,184,1828,229,208,122,287,62,3694,392,1604,5434,47,34,21,0,4,805,507,0,176,734,186,115,129,296,60,12,47,15,0,0,41,4,150,75,73,54,"Old Church Surgery","WF","WF-2","Chingford E4"]
["WF_LDP",43709,43721,"F86607",14054,604,9254,30,168,53,21,8,127,186,489,325,4078,466,403,171,474,90,7465,777,3118,10773,184,145,62,2,24,1213,698,0,305,1100,200,113,138,629,91,18,88,44,6,0,67,25,159,102,88,70,"Addison Road Medical Practice","WF","WF-6","Central Walthamstow"]
["WF_LDP",43709,43721,"F86058",15630,721,10271,15,341,136,18,14,257,378,477,338,4131,557,520,267,781,176,8101,1029,4125,12149,194,129,65,0,31,1484,885,0,395,1256,221,150,173,742,105,19,95,31,1,0,82,8,188,114,107,85,"St James Medical Practice Ltd","WF","WF-7","Walthamstow West"]
["WF_LDP",43709,43721,"F86045",1947,129,1401,1,58,13,5,1,22,61,86,63,626,113,95,62,130,24,1197,156,599,1664,35,26,9,0,4,273,105,0,84,233,58,35,49,139,26,4,23,5,0,0,18,4,42,25,23,12,"High Road Surgery","WF","WF-5","South Leytonstone"]
["WF_LDP",43709,43721,"F86078",7326,332,4945,12,124,6,0,0,83,148,394,252,1994,254,222,112,251,51,4230,362,1310,6173,59,34,15,0,6,1194,675,0,204,979,187,94,112,364,92,9,74,24,0,0,55,4,128,114,92,64,"The Ridgeway Surgery","WF","WF-2","Chingford E4"]
["WF_LDP",43709,43721,"F86062",7109,412,4914,13,157,11,11,2,110,172,273,182,1516,299,266,130,381,74,4412,597,2287,5814,99,77,28,2,14,841,457,0,221,726,152,88,109,458,68,18,59,19,6,0,47,3,127,66,62,41,"Grove Surgery","WF","WF-7","Walthamstow West"]
["WF_LDP",43739,43740,"F86679",5929,235,3759,6,76,13,10,2,54,84,130,107,1122,195,160,85,225,59,3166,366,1512,4443,32,28,10,0,5,482,294,4,143,431,50,33,37,242,39,10,35,11,0,2,15,8,40,36,29,22,"Higham Hill Medical Centre","WF","WF-7","Walthamstow West"]
["WF_LDP",43739,43740,"F86666",14355,718,9748,34,336,88,70,15,206,388,631,392,4515,520,475,219,495,121,7462,904,2840,11589,232,159,79,0,13,1682,822,227,429,1383,200,115,136,839,109,29,86,40,0,42,80,11,140,110,89,58,"The Harrow Road Surgery","WF","WF-5","South Leytonstone"]
["WF_LDP",43739,43740,"F86696",5303,304,3564,16,164,16,12,1,103,189,158,127,1024,223,213,84,171,36,1950,252,1082,4262,46,31,13,0,5,550,315,57,172,495,93,65,76,325,27,6,24,5,0,4,12,3,68,38,35,26,"Francis Road Medical Centre","WF","WF-4","Forest Integrated Health"]
["WF_LDP",43739,43740,"F86689",4177,117,2887,13,86,6,3,1,69,91,52,43,607,82,79,42,124,35,2413,174,884,3218,28,15,5,0,4,294,170,32,71,269,57,36,47,120,34,1,30,10,1,10,20,7,41,22,20,12,"The Bailey Practice","WF","WF-1","Chingford/ Walthamstow"]
["WF_LDP",43739,43740,"F86644",10808,499,6950,26,253,111,67,18,167,280,300,197,2090,339,319,134,337,71,5659,608,1719,8420,146,125,58,0,23,1232,666,45,293,1019,209,116,146,564,114,19,95,34,2,7,80,13,145,74,65,45,"Waltham Forest Community & Family Health Services Ltd","WF","WF-6","Central Walthamstow"]
["WF_LDP",43739,43740,"F86627",13802,774,8931,16,576,32,23,6,327,664,658,431,3013,501,464,275,651,148,8015,976,2834,11259,215,140,62,11,27,1847,976,109,438,1682,407,216,249,826,234,43,189,64,8,45,157,43,290,246,213,139,"Churchill Medical Centre","WF","WF-2","Chingford E4"]
["WF_LDP",43739,43740,"F86664",8426,326,5341,32,158,26,22,6,136,195,194,91,1539,300,231,149,303,71,4511,431,1634,6645,100,68,40,0,8,897,497,61,185,667,186,79,98,403,108,21,99,34,0,27,68,16,136,90,74,59,"Larkshall Medical Centre","WF","WF-1","Chingford/ Walthamstow"]
["WF_LDP",43739,43740,"F86650",8314,433,5612,12,152,14,10,3,92,178,221,126,1519,306,264,103,305,76,4527,507,1861,6685,111,64,22,0,18,727,341,62,248,628,118,66,76,476,62,15,47,15,0,18,34,11,83,72,62,38,"Lime Tree Surgery","WF","WF-4","Forest Integrated Health"]
["WF_LDP",43739,43740,"F86700",3857,210,2519,26,254,8,8,3,190,290,166,96,601,190,158,57,164,26,2054,186,790,3129,50,33,10,2,7,785,519,58,140,703,137,65,81,222,121,18,112,43,5,42,90,45,107,87,71,51,"Kings Head Medical Practice","WF","WF-1","Chingford/ Walthamstow"]
["WF_LDP",43739,43740,"Y01839",6459,345,4274,40,140,23,14,3,104,164,190,132,1182,294,231,99,202,83,3482,403,1089,5139,94,55,22,0,10,748,420,23,198,595,117,63,78,401,89,6,81,35,0,8,69,4,83,56,52,38,"Lime Tree & Sinnott Healthcare Ltd","WF","WF-1","Chingford/ Walthamstow"]
["WF_LDP",43739,43740,"Y01291",8762,395,5647,20,414,12,3,0,291,515,371,209,2333,358,317,147,395,80,5050,506,2186,7002,84,67,29,0,13,1178,683,125,241,999,193,121,135,428,116,29,109,31,0,38,72,20,157,121,104,85,"Chingford Medical Practice","WF","WF-2","Chingford E4"]
["WF_LDP",43739,43740,"Total",267781,13225,176488,483,6477,877,499,139,4376,7413,8200,5412,61518,10229,9124,3972,10133,2300,145950,15737,56275,213868,3226,2245,956,26,408,28726,15942,2817,7689,24742,4889,2840,3396,14501,2398,455,2101,744,34,605,1606,372,3694,2458,2152,1526]
["WF_LDP",43739,43740,"Y02585",7164,149,5174,18,39,15,12,2,30,39,81,55,2199,117,88,64,185,48,3462,517,1120,5851,74,50,25,0,13,284,143,3,84,255,37,23,30,155,19,3,17,12,1,1,5,1,23,28,25,22]
["WF_LDP",43739,43740,"F86705",3085,170,2148,12,55,6,5,3,40,62,114,75,1131,127,112,40,147,28,1718,192,825,2530,26,13,3,0,4,299,158,47,104,242,56,29,39,185,31,4,21,10,0,13,16,2,40,22,21,14,"The Langthorne Sharma Family Practice","WF","WF-5","South Leytonstone"]
["WF_LDP",43739,43740,"F86701",3352,209,2341,7,109,18,13,3,90,129,158,118,1077,173,154,47,152,24,1822,210,905,2752,73,54,29,0,10,429,266,50,121,377,58,39,47,225,19,5,18,6,0,11,19,2,44,31,27,18,"Kiyani Medical Practice","WF","WF-5","South Leytonstone"]
["WF_LDP",43739,43740,"F86712",3120,189,2231,7,78,2,2,0,56,89,30,18,426,142,143,52,153,31,1864,169,830,2631,22,17,6,0,3,341,187,23,118,299,50,27,33,205,12,5,10,3,0,0,10,0,38,14,13,11,"Hampton Medical Centre","WF","WF-4","Forest Integrated Health"]
["WF_LDP",43739,43740,"F86708",2810,174,1713,5,65,7,7,1,39,74,123,74,906,130,103,53,150,37,1513,124,637,2211,30,15,4,0,3,374,191,25,81,320,62,38,43,195,13,1,13,3,0,6,8,4,47,33,24,17,"Claremont Medical Centre","WF","WF-6","Central Walthamstow"]
["WF_LDP",43739,43740,"F86626",5543,208,3750,3,70,11,8,1,46,81,157,105,876,141,131,67,177,43,2964,265,1075,4388,42,29,8,0,4,451,259,31,123,402,70,43,50,220,20,6,19,6,0,5,13,1,50,26,22,13,"Dr Shantir Practice","WF","WF-1","Chingford/ Walthamstow"]
["WF_LDP",43739,43740,"F86038",11126,713,6697,13,225,18,16,3,150,250,433,285,1842,516,478,158,418,92,5826,468,1739,8404,135,85,25,0,6,1095,585,166,378,966,256,159,194,793,42,5,39,10,0,11,20,12,193,111,103,71,"Sma Medical Centre","WF","WF-3","Leyton Collaborative"]
["WF_LDP",43739,43740,"F86036",15894,720,11097,15,345,40,18,6,248,388,233,145,2994,638,529,246,662,141,9477,894,3749,12834,236,161,62,1,35,1489,845,174,457,1223,245,158,185,822,122,28,102,48,0,30,95,29,198,120,101,68,"The Allum Medical Centre","WF","WF-4","Forest Integrated Health"]
["WF_LDP",43739,43740,"F86045",1967,131,1413,0,57,14,6,1,24,61,87,65,632,110,96,62,132,26,1204,154,608,1675,36,26,10,0,4,275,110,24,87,236,57,35,49,139,25,4,23,5,0,2,17,4,42,25,23,11,"High Road Surgery","WF","WF-5","South Leytonstone"]
["WF_LDP",43739,43740,"F86044",9129,329,6516,13,148,33,28,12,89,173,280,177,1388,262,241,101,210,62,5307,712,1305,7577,110,91,38,0,10,759,367,41,194,629,86,39,48,371,37,9,35,15,0,6,24,7,56,52,45,24," Crawley Road Medical Centre","WF","WF-4","Forest Integrated Health"]
["WF_LDP",43739,43740,"F86030",8197,502,5341,28,183,13,7,3,136,197,380,299,3989,419,425,90,254,33,4379,319,1317,6441,52,31,10,0,4,732,458,165,321,654,170,138,153,538,43,5,40,12,0,5,32,2,133,54,48,33," Queens Road Medical Centre","WF","WF-7","Walthamstow West"]
["WF_LDP",43739,43740,"F86005",8429,295,5645,11,313,6,4,2,203,349,185,136,2582,228,219,100,289,63,4636,507,1978,6575,55,33,18,2,3,806,441,78,197,715,90,57,68,319,112,17,101,36,1,31,74,14,70,59,48,32," The Penryhn Surgery","WF","WF-1","Chingford/ Walthamstow"]
["WF_LDP",43739,43740,"F86001",7911,456,5345,3,243,44,21,8,159,291,194,119,2320,350,284,132,300,69,4185,376,1584,6412,104,63,20,0,16,944,529,124,247,830,175,88,124,491,109,17,92,26,0,30,66,9,133,79,65,48," The Firs","WF","WF-6","Central Walthamstow"]
["WF_LDP",43739,43740,"F86011",9259,687,3956,6,218,46,35,6,156,248,246,163,1309,559,447,148,325,91,5465,689,1806,7581,151,118,55,5,22,1189,682,273,373,1049,228,125,150,730,103,22,98,29,1,34,77,19,181,151,146,113,"The Manor Practice","WF","WF-3","Leyton Collaborative"]
["WF_LDP",43739,43740,"F86006",6294,365,4170,1,142,4,4,0,63,167,73,43,1076,251,273,87,172,61,3403,395,1036,5007,52,30,13,0,9,799,357,136,214,714,102,51,67,409,55,23,53,29,0,28,23,3,70,58,52,32,"Seymour Medical Centre","WF","WF-7","Walthamstow West"]
["WF_LDP",43739,43740,"F86616",6975,288,4548,8,249,7,3,0,183,268,295,182,1857,238,212,125,302,61,3729,393,1640,5449,47,33,20,0,5,807,518,56,180,750,185,117,128,297,60,13,50,15,0,24,42,4,147,74,72,52,"Old Church Surgery","WF","WF-2","Chingford E4"]
["WF_LDP",43739,43740,"F86607",14046,606,9271,21,168,53,21,10,124,186,490,338,4132,468,405,175,480,89,7491,801,3139,10775,184,142,59,2,24,1215,715,153,312,1124,200,108,134,628,91,16,89,45,6,36,67,26,160,103,89,72,"Addison Road Medical Practice","WF","WF-6","Central Walthamstow"]
["WF_LDP",43739,43740,"F86625",6156,376,4100,12,154,9,2,2,97,179,153,118,1081,268,279,95,209,61,3127,340,1180,4963,98,70,35,1,13,720,369,59,224,616,134,81,98,414,62,10,58,16,1,18,36,4,100,59,54,36,"LL Medical Care (Agarwal & Agrwal Practice)","WF","WF-5","South Leytonstone"]
["WF_LDP",43739,43740,"F86621",5736,301,4146,3,146,12,6,0,108,165,61,45,684,263,219,50,210,32,3526,334,1344,4845,72,56,17,0,11,614,412,101,203,549,101,63,75,316,29,4,27,12,1,11,27,23,79,49,49,40,"Green Man Medical Centre","WF","WF-5","South Leytonstone"]
["WF_LDP",43739,43740,"F86088",4904,291,3424,13,152,10,5,0,103,177,85,59,880,216,223,66,192,43,2575,209,971,4124,50,35,9,0,7,661,365,49,175,534,104,66,73,351,42,11,34,6,0,8,36,8,78,38,30,22,"The Lyndhurst Surgery","WF","WF-4","Forest Integrated Health"]
["WF_LDP",43739,43740,"F86062",7317,407,5094,11,157,11,11,2,105,174,269,184,1549,305,272,133,379,69,4516,597,2288,6010,102,83,31,2,15,842,460,62,220,732,151,90,109,458,68,18,60,18,6,12,47,3,122,65,62,45,"Grove Surgery","WF","WF-7","Walthamstow West"]
["WF_LDP",43739,43740,"F86058",15841,719,10407,13,345,135,17,14,257,384,481,339,4164,551,523,269,748,172,8077,995,4022,12316,197,125,65,0,32,1492,880,46,393,1253,226,155,175,749,106,19,90,30,1,12,82,8,189,116,105,87,"St James Medical Practice Ltd","WF","WF-7","Walthamstow West"]
["WF_LDP",43739,43740,"F86086",6061,244,3807,9,81,9,6,2,55,100,130,69,886,201,133,113,257,68,3195,416,1421,4594,80,66,29,0,15,503,279,32,122,413,93,39,50,281,33,4,27,5,0,5,18,2,81,30,27,18,"Dr Dhital Practice","WF","WF-6","Central Walthamstow"]
["WF_LDP",43739,43740,"F86078",7273,340,4922,10,126,5,0,0,76,144,391,250,1993,248,224,105,258,50,4200,348,1325,6132,60,34,15,0,7,1184,663,96,203,989,186,97,115,364,92,9,78,25,0,23,55,4,130,109,87,54,"The Ridgeway Surgery","WF","WF-2","Chingford E4"]
["WF_LDP",43770,43773,"F86679",5972,237,3786,8,79,12,10,2,56,85,129,107,1115,196,158,89,229,56,3182,367,1529,4480,32,28,10,0,5,481,298,68,146,436,50,31,36,242,37,10,34,12,0,13,15,8,42,37,30,22,"Higham Hill Medical Centre","WF","WF-7","Walthamstow West"]
["WF_LDP",43770,43773,"F86689",4192,118,2900,9,86,5,2,1,69,91,53,44,634,81,78,32,102,37,2446,183,856,3233,28,14,5,0,4,294,165,75,73,266,57,37,48,121,33,1,29,10,1,20,19,7,45,22,19,12,"The Bailey Practice","WF","WF-1","Chingford/ Walthamstow"]
["WF_LDP",43770,43773,"F86700",3855,211,2517,25,260,8,8,3,193,296,166,92,597,194,156,59,155,28,2045,196,756,3134,50,34,10,2,8,787,529,131,136,712,136,64,77,222,121,18,111,44,4,77,91,49,113,87,72,53,"Kings Head Medical Practice","WF","WF-1","Chingford/ Walthamstow"]
["WF_LDP",43770,43773,"F86696",5378,305,3612,11,166,15,12,1,114,189,164,135,1043,230,220,86,179,36,2117,285,1111,4325,46,32,12,0,4,556,333,182,181,503,95,69,78,325,27,5,23,5,0,15,13,5,70,39,36,28,"Francis Road Medical Centre","WF","WF-4","Forest Integrated Health"]
["WF_LDP",43770,43773,"F86666",14375,724,9781,39,341,81,64,18,207,394,642,410,4542,519,478,222,497,128,7446,884,2836,11608,230,154,74,0,16,1692,807,404,430,1392,198,113,135,842,112,31,86,39,0,58,80,15,141,108,87,58,"The Harrow Road Surgery","WF","WF-5","South Leytonstone"]
["WF_LDP",43770,43773,"F86644",10672,491,6885,27,252,113,68,18,162,282,316,212,2142,318,317,139,318,75,5614,593,1759,8328,145,123,59,0,21,1230,646,152,290,1006,205,113,142,560,114,19,98,34,2,42,80,14,137,75,65,46,"Waltham Forest Community & Family Health Services Ltd","WF","WF-6","Central Walthamstow"]
["WF_LDP",43770,43773,"F86627",13804,773,8941,13,593,33,22,6,344,675,675,432,3069,505,470,265,641,149,8020,1002,2856,11265,217,142,66,13,27,1857,983,291,448,1697,404,228,262,827,235,43,191,63,8,104,158,44,289,247,214,136,"Churchill Medical Centre","WF","WF-2","Chingford E4"]
["WF_LDP",43770,43773,"F86664",8419,328,5344,34,155,27,23,7,133,195,203,102,1605,307,232,146,312,77,4537,449,1665,6643,101,70,41,0,9,899,501,175,186,673,185,82,101,406,110,21,100,35,0,58,78,16,142,90,73,60,"Larkshall Medical Centre","WF","WF-1","Chingford/ Walthamstow"]
["WF_LDP",43770,43773,"F86650",8264,437,5597,22,170,16,11,3,99,198,222,129,1517,316,268,102,311,71,4535,502,1845,6664,111,69,23,0,18,725,331,159,240,624,118,62,73,475,63,15,49,14,0,37,34,14,89,73,63,37,"Lime Tree Surgery","WF","WF-4","Forest Integrated Health"]
["WF_LDP",43770,43773,"Y02585",6387,130,4591,15,32,16,13,3,22,34,78,53,2024,102,84,61,172,42,3009,462,1011,5183,71,51,24,0,13,271,139,49,74,243,33,21,27,142,18,3,15,10,1,7,5,1,22,27,25,20]
["WF_LDP",43770,43773,"Y01839",6420,347,4243,33,146,25,16,3,106,170,193,128,1231,288,235,106,201,77,3477,408,1111,5104,95,58,24,0,10,746,410,146,191,598,117,65,82,403,91,6,84,37,0,52,70,6,81,56,54,39,"Lime Tree & Sinnott Healthcare Ltd","WF","WF-1","Chingford/ Walthamstow"]
["WF_LDP",43770,43773,"F86005",8542,305,5727,14,323,8,6,2,210,355,186,138,2628,243,220,111,302,70,4696,508,2001,6671,56,38,19,2,3,816,467,171,197,729,92,58,73,323,112,19,103,37,2,70,77,14,71,60,51,38," The Penryhn Surgery","WF","WF-1","Chingford/ Walthamstow"]
["WF_LDP",43770,43773,"Total",267534,13241,176508,533,6607,882,507,147,4456,7542,8303,5515,62072,10211,9224,3967,10126,2312,146093,15781,56206,213801,3236,2264,968,28,421,28807,15929,6754,7743,24820,4888,2843,3392,14512,2410,460,2115,747,35,1281,1638,410,3748,2469,2164,1532]
["WF_LDP",43770,43773,"Y01291",8772,394,5656,22,418,13,4,0,294,516,376,220,2344,356,322,150,395,72,5125,530,2175,7009,84,71,30,0,13,1180,677,234,245,985,195,121,137,430,118,29,106,30,0,65,77,28,159,121,103,83,"Chingford Medical Practice","WF","WF-2","Chingford E4"]
["WF_LDP",43770,43773,"F86705",3110,168,2171,13,55,6,5,3,37,64,117,76,1151,118,109,40,144,31,1731,185,834,2554,26,12,2,0,4,303,156,103,102,245,55,27,37,185,31,4,20,9,0,21,16,2,37,22,19,14,"The Langthorne Sharma Family Practice","WF","WF-5","South Leytonstone"]
["WF_LDP",43770,43773,"F86701",3376,204,2351,7,114,21,18,4,93,132,159,116,1100,172,152,49,163,25,1843,222,930,2771,73,56,29,0,12,432,270,128,120,378,60,39,48,225,20,6,19,6,0,17,19,2,50,31,27,19,"Kiyani Medical Practice","WF","WF-5","South Leytonstone"]
["WF_LDP",43770,43773,"F86712",3144,191,2253,4,78,2,2,0,54,88,30,17,436,144,144,51,154,31,1886,181,833,2653,22,17,7,0,3,340,192,88,118,300,50,28,34,205,11,5,10,3,0,6,9,0,38,13,12,11,"Hampton Medical Centre","WF","WF-4","Forest Integrated Health"]
["WF_LDP",43770,43773,"F86708",2802,173,1714,6,71,6,5,1,38,77,123,71,898,129,102,50,139,40,1498,116,603,2208,29,13,3,0,3,373,189,56,81,313,62,38,43,196,13,1,13,3,0,8,8,4,46,33,25,15,"Claremont Medical Centre","WF","WF-6","Central Walthamstow"]
["WF_LDP",43770,43773,"F86626",5632,212,3812,5,68,11,9,1,47,83,160,101,948,146,125,65,186,48,3064,286,1122,4467,43,28,8,0,3,464,259,100,119,407,71,39,48,227,20,6,19,6,0,13,13,1,51,27,22,17,"Dr Shantir Practice","WF","WF-1","Chingford/ Walthamstow"]
["WF_LDP",43770,43773,"F86038",11354,718,6889,12,223,16,13,3,152,254,431,284,1874,512,498,152,408,92,5932,466,1713,8618,134,86,27,0,6,1107,575,374,384,973,261,163,196,798,45,4,40,9,1,21,22,13,198,111,103,72,"Sma Medical Centre","WF","WF-3","Leyton Collaborative"]
["WF_LDP",43770,43773,"F86036",15929,716,11134,18,346,43,19,6,238,389,244,164,3068,624,552,245,658,141,9465,891,3686,12873,239,161,65,1,38,1495,845,428,464,1231,244,154,180,822,122,28,104,51,0,61,96,30,195,121,98,67,"The Allum Medical Centre","WF","WF-4","Forest Integrated Health"]
["WF_LDP",43770,43773,"F86045",1966,129,1415,2,61,12,6,1,26,63,87,58,637,107,98,61,137,25,1201,153,608,1677,37,28,11,0,5,280,109,93,88,241,57,35,48,137,26,4,23,5,0,18,18,4,44,25,22,11,"High Road Surgery","WF","WF-5","South Leytonstone"]
["WF_LDP",43770,43773,"F86044",9370,338,6696,11,148,27,23,10,85,175,290,184,1442,270,255,100,213,64,5424,730,1350,7781,110,83,34,0,11,766,367,211,205,637,87,40,49,375,37,9,35,15,0,25,25,8,60,53,46,26," Crawley Road Medical Centre","WF","WF-4","Forest Integrated Health"]
["WF_LDP",43770,43773,"F86006",6317,364,4198,1,141,5,5,0,67,166,74,46,1092,245,270,84,189,64,3428,393,1069,5032,53,29,13,0,7,803,360,210,212,716,101,54,68,408,55,22,52,29,0,35,24,2,75,57,51,29,"Seymour Medical Centre","WF","WF-7","Walthamstow West"]
["WF_LDP",43770,43773,"F86001",7907,454,5350,4,243,42,23,7,165,292,197,126,2347,353,285,126,299,71,4190,381,1585,6416,104,67,22,0,17,945,522,224,248,827,175,89,120,490,105,16,88,24,0,51,64,9,134,79,70,50," The Firs","WF","WF-6","Central Walthamstow"]
["WF_LDP",43770,43773,"F86030",8170,507,5323,33,190,13,7,3,140,202,382,311,3968,428,434,92,244,28,4338,305,1273,6404,52,30,10,0,4,734,474,370,329,673,170,142,157,535,42,5,42,11,0,30,31,4,145,54,52,34," Queens Road Medical Centre","WF","WF-7","Walthamstow West"]
["WF_LDP",43770,43773,"F86011",9370,685,4066,8,220,50,40,8,154,252,252,168,1332,544,454,148,325,90,5481,684,1816,7687,154,119,56,5,22,1193,670,413,373,1049,229,126,151,729,106,23,100,32,1,55,81,19,166,154,148,108,"The Manor Practice","WF","WF-3","Leyton Collaborative"]
["WF_LDP",43770,43773,"F86058",15417,714,10117,16,342,136,16,14,257,381,477,335,4071,551,512,253,728,168,7862,980,3841,11990,196,123,63,0,33,1473,870,237,385,1245,225,149,173,742,104,20,92,32,1,40,80,8,197,115,103,84,"St James Medical Practice Ltd","WF","WF-7","Walthamstow West"]
["WF_LDP",43770,43773,"F86616",7051,291,4602,24,272,8,4,1,202,293,297,191,1913,245,217,133,318,67,3767,400,1697,5506,50,37,21,0,6,814,531,141,183,763,187,114,125,301,61,15,52,16,0,42,45,4,152,76,74,53,"Old Church Surgery","WF","WF-2","Chingford E4"]
["WF_LDP",43770,43773,"F86607",14019,607,9261,27,175,54,22,10,128,194,489,337,4188,465,411,180,486,89,7559,799,3129,10763,184,146,64,2,26,1228,722,326,322,1131,201,104,130,634,91,15,90,44,6,61,69,32,161,104,90,71,"Addison Road Medical Practice","WF","WF-6","Central Walthamstow"]
["WF_LDP",43770,43773,"F86625",6132,371,4087,9,151,9,2,2,100,181,153,113,1091,260,283,94,209,54,3110,330,1143,4948,100,72,37,1,13,717,370,181,237,607,134,77,93,415,63,11,56,16,1,29,36,6,100,60,53,35,"LL Medical Care (Agarwal & Agrwal Practice)","WF","WF-5","South Leytonstone"]
["WF_LDP",43770,43773,"F86621",5774,302,4173,16,160,12,6,0,117,175,63,47,694,265,227,56,209,34,3566,347,1385,4877,73,57,17,0,11,613,410,250,204,550,103,68,78,317,29,4,25,12,1,19,27,23,86,51,51,43,"Green Man Medical Centre","WF","WF-5","South Leytonstone"]
["WF_LDP",43770,43773,"F86078",7255,339,4925,13,131,6,0,0,80,148,391,248,1988,242,221,108,270,47,4179,344,1337,6120,60,33,16,0,7,1182,662,168,201,980,186,96,111,361,93,9,79,23,0,49,56,4,128,109,84,57,"The Ridgeway Surgery","WF","WF-2","Chingford E4"]
["WF_LDP",43770,43773,"F86062",7347,411,5114,9,154,12,12,4,106,171,270,196,1571,301,277,135,378,70,4518,589,2313,6026,101,83,29,2,17,841,444,190,232,733,147,91,108,459,71,18,66,20,6,28,48,4,125,64,61,44,"Grove Surgery","WF","WF-7","Walthamstow West"]
["WF_LDP",43770,43773,"F86088",4907,299,3426,12,158,10,5,0,105,180,85,57,877,225,227,63,198,46,2568,211,986,4127,51,36,9,0,7,665,369,141,176,545,104,67,73,349,42,11,34,6,0,21,36,8,77,37,31,23,"The Lyndhurst Surgery","WF","WF-4","Forest Integrated Health"]
["WF_LDP",43770,43773,"F86086",6133,248,3851,11,85,9,6,2,56,102,129,67,895,210,133,114,257,69,3234,419,1442,4656,79,64,28,0,15,505,277,85,123,412,94,39,51,284,32,4,27,5,0,13,18,2,82,31,30,17,"Dr Dhital Practice","WF","WF-6","Central Walthamstow"]
["WF_LDP",43800,43801,"F86679",6005,241,3813,7,78,13,10,2,57,86,130,107,1125,196,161,92,229,54,3205,373,1521,4514,32,28,11,0,5,482,291,108,149,427,50,30,34,245,37,10,34,12,0,16,15,8,46,37,30,25,"Higham Hill Medical Centre","WF","WF-7","Walthamstow West"]
["WF_LDP",43800,43801,"F86666",14414,731,9809,38,339,80,62,19,210,398,644,408,4570,521,484,221,500,134,7465,885,2854,11639,230,151,72,0,18,1697,804,473,429,1389,200,115,140,845,115,31,90,39,0,73,83,17,138,109,84,54,"The Harrow Road Surgery","WF","WF-5","South Leytonstone"]
["WF_LDP",43800,43801,"F86696",5396,310,3621,9,160,18,12,3,113,187,182,140,1135,240,225,74,150,33,2237,303,1009,4339,49,36,15,0,6,556,345,231,189,506,95,72,80,327,26,5,25,5,0,16,13,9,86,37,33,26,"Francis Road Medical Centre","WF","WF-4","Forest Integrated Health"]
["WF_LDP",43800,43801,"F86689",4194,119,2899,5,84,4,2,0,63,89,53,46,649,81,80,33,103,37,2447,191,842,3230,27,16,6,0,5,296,160,89,74,269,56,35,46,121,33,2,26,10,1,22,18,7,44,21,19,11,"The Bailey Practice","WF","WF-1","Chingford/ Walthamstow"]
["WF_LDP",43800,43801,"F86664",8393,329,5348,40,167,28,24,7,142,206,207,104,1679,310,232,150,319,81,4541,447,1738,6623,98,70,40,0,10,900,520,217,181,676,183,84,99,406,110,21,100,35,0,68,80,15,143,91,71,56,"Larkshall Medical Centre","WF","WF-1","Chingford/ Walthamstow"]
["WF_LDP",43800,43801,"F86627",13790,772,8940,13,592,32,21,6,348,684,677,438,3091,499,469,260,653,154,8047,1014,2864,11262,220,147,69,14,24,1865,971,378,441,1686,403,225,258,826,234,42,199,66,9,131,161,44,289,249,214,138,"Churchill Medical Centre","WF","WF-2","Chingford E4"]
["WF_LDP",43800,43801,"F86626",5709,215,3866,7,72,13,10,2,52,84,166,107,1019,152,125,72,203,51,3143,309,1194,4535,45,30,9,0,4,468,259,120,121,417,72,41,51,231,20,6,19,6,0,15,13,2,53,27,24,19,"Dr Shantir Practice","WF","WF-1","Chingford/ Walthamstow"]
["WF_LDP",43800,43801,"F86650",8263,439,5598,22,171,24,10,5,116,201,250,147,1597,321,272,105,324,71,4573,511,1858,6671,111,75,25,0,20,727,363,209,233,629,121,64,76,478,63,15,54,13,0,45,36,22,98,74,67,43,"Lime Tree Surgery","WF","WF-4","Forest Integrated Health"]
["WF_LDP",43800,43801,"F86644",10718,500,6912,31,257,113,67,18,170,290,350,247,2218,343,321,142,327,78,5640,584,1798,8368,146,123,59,0,21,1236,674,236,297,1028,208,112,137,565,114,19,98,35,2,60,81,19,150,76,68,49,"Waltham Forest Community & Family Health Services Ltd","WF","WF-6","Central Walthamstow"]
["WF_LDP",43800,43801,"Y01839",6408,343,4237,29,146,25,17,3,108,169,193,130,1248,283,241,115,210,86,3517,408,1135,5092,96,63,23,0,15,746,422,195,195,603,116,63,80,401,91,6,85,38,0,66,74,6,83,55,52,38,"Lime Tree & Sinnott Healthcare Ltd","WF","WF-1","Chingford/ Walthamstow"]
["WF_LDP",43800,43801,"Y01291",8793,403,5675,22,413,15,3,1,290,517,375,218,2354,363,325,155,383,74,5187,533,2162,7023,83,67,28,0,12,1183,678,283,247,988,197,123,139,438,118,29,106,31,0,86,78,36,158,121,101,82,"Chingford Medical Practice","WF","WF-2","Chingford E4"]
["WF_LDP",43800,43801,"Total",267739,13315,176726,547,6668,913,513,155,4501,7613,8460,5668,62922,10292,9339,4023,10156,2359,146688,15835,56452,214024,3243,2285,975,29,432,28827,15987,8343,7742,24852,4893,2847,3380,14553,2416,465,2133,751,35,1547,1664,487,3796,2480,2180,1543]
["WF_LDP",43800,43801,"Y02585",6001,117,4347,14,30,20,17,4,20,31,78,53,1898,93,77,54,159,40,2809,420,909,4904,69,52,25,0,13,258,127,61,67,224,31,18,25,128,19,4,17,12,0,12,5,1,19,24,21,17]
["WF_LDP",43800,43801,"F86712",3163,192,2262,4,77,2,2,0,54,87,31,16,452,143,144,51,155,28,1887,177,824,2669,22,17,6,0,4,341,183,114,116,298,51,29,34,206,11,5,10,3,0,7,10,0,38,13,12,12,"Hampton Medical Centre","WF","WF-4","Forest Integrated Health"]
["WF_LDP",43800,43801,"F86701",3387,204,2361,7,114,27,20,4,94,133,161,121,1119,174,159,56,161,26,1836,225,942,2779,73,52,27,0,12,427,265,169,122,368,59,37,46,224,20,6,18,5,0,17,19,6,48,31,26,20,"Kiyani Medical Practice","WF","WF-5","South Leytonstone"]
["WF_LDP",43800,43801,"F86700",3862,209,2517,13,266,8,8,3,194,296,166,95,595,191,159,58,154,31,2048,200,755,3133,50,33,10,1,8,792,536,159,134,722,135,67,79,221,122,18,115,46,4,96,93,68,120,87,78,57,"Kings Head Medical Practice","WF","WF-1","Chingford/ Walthamstow"]
["WF_LDP",43800,43801,"F86708",2802,167,1721,10,73,5,4,1,42,81,126,79,891,123,101,49,130,37,1488,106,588,2212,29,13,3,0,4,375,187,80,80,315,62,36,41,196,14,1,13,3,0,10,9,4,43,34,26,15,"Claremont Medical Centre","WF","WF-6","Central Walthamstow"]
["WF_LDP",43800,43801,"F86705",3126,172,2187,14,56,6,5,3,36,64,118,78,1165,121,112,43,145,30,1743,189,870,2568,26,12,2,0,4,306,155,140,105,243,55,31,41,189,30,3,19,9,0,24,16,1,37,22,19,14,"The Langthorne Sharma Family Practice","WF","WF-5","South Leytonstone"]
["WF_LDP",43800,43801,"F86038",11344,713,6875,13,223,19,15,4,147,253,438,287,1909,503,500,159,397,99,5912,457,1718,8620,134,87,28,0,6,1109,562,461,370,959,261,160,189,800,45,4,39,7,0,25,22,12,183,112,101,71,"Sma Medical Centre","WF","WF-3","Leyton Collaborative"]
["WF_LDP",43800,43801,"F86036",15920,739,11133,17,354,42,18,6,242,392,249,176,3120,643,554,240,658,141,9445,888,3676,12858,244,167,67,1,41,1494,875,476,457,1257,249,149,177,829,124,29,106,53,0,74,99,31,206,120,100,71,"The Allum Medical Centre","WF","WF-4","Forest Integrated Health"]
["WF_LDP",43800,43801,"F86045",1966,129,1413,3,60,13,7,2,24,63,85,60,644,105,101,62,134,25,1202,151,603,1678,37,30,12,0,5,279,109,103,90,239,58,36,49,136,26,4,23,4,0,22,18,4,46,25,22,10,"High Road Surgery","WF","WF-5","South Leytonstone"]
["WF_LDP",43800,43801,"F86044",9418,335,6726,9,150,24,20,10,89,176,293,188,1459,271,265,100,216,64,5395,730,1388,7806,110,77,31,0,10,763,358,234,211,621,86,41,49,376,37,9,34,17,1,25,24,9,59,53,45,26," Crawley Road Medical Centre","WF","WF-4","Forest Integrated Health"]
["WF_LDP",43800,43801,"F86030",8192,513,5330,36,202,11,5,2,145,211,381,315,3954,436,437,91,222,27,4334,296,1238,6417,51,30,9,0,4,735,478,411,341,672,171,144,159,539,42,5,42,11,0,31,31,5,146,55,53,32," Queens Road Medical Centre","WF","WF-7","Walthamstow West"]
["WF_LDP",43800,43801,"F86005",8566,306,5739,12,315,8,6,2,210,354,186,140,2649,245,222,109,306,71,4693,510,1958,6685,57,39,20,2,4,820,476,188,202,727,92,59,73,324,114,20,104,36,2,83,78,15,75,60,51,40," The Penryhn Surgery","WF","WF-1","Chingford/ Walthamstow"]
["WF_LDP",43800,43801,"F86001",7897,449,5341,7,248,41,25,7,167,293,197,127,2379,355,288,127,292,75,4234,417,1625,6407,104,68,21,0,19,945,513,250,242,822,173,95,124,487,106,16,92,20,0,56,65,9,132,79,72,50," The Firs","WF","WF-6","Central Walthamstow"]
["WF_LDP",43800,43801,"F86011",9403,686,4106,11,215,52,42,9,145,251,261,168,1381,553,459,149,327,91,5488,676,1826,7717,152,115,53,5,22,1192,667,459,371,1043,227,116,143,730,106,23,99,33,1,60,80,20,170,154,145,105,"The Manor Practice","WF","WF-3","Leyton Collaborative"]
["WF_LDP",43800,43801,"F86006",6352,366,4221,1,143,6,5,0,59,167,99,63,1161,240,269,91,195,63,3482,414,1089,5061,53,30,13,0,7,808,348,226,211,732,99,52,65,407,55,21,51,28,0,38,26,2,69,58,51,29,"Seymour Medical Centre","WF","WF-7","Walthamstow West"]
["WF_LDP",43800,43801,"F86616",7096,298,4633,26,280,13,4,1,209,297,300,196,1960,251,223,136,324,64,3798,399,1736,5540,51,38,22,0,6,822,547,200,183,784,187,117,129,310,63,17,55,17,0,48,47,6,166,77,76,58,"Old Church Surgery","WF","WF-2","Chingford E4"]
["WF_LDP",43800,43801,"F86607",14017,619,9246,28,180,56,27,9,130,199,483,339,4236,481,410,183,486,94,7689,800,3111,10759,183,151,67,3,25,1223,748,394,320,1131,205,109,135,645,89,15,87,42,5,66,68,34,161,106,96,75,"Addison Road Medical Practice","WF","WF-6","Central Walthamstow"]
["WF_LDP",43800,43801,"F86625",6118,375,4089,11,156,9,2,2,102,182,154,113,1104,272,297,96,217,54,3113,332,1133,4950,98,69,37,1,11,715,380,255,237,612,133,78,93,415,62,12,59,18,2,42,36,19,105,62,57,38,"LL Medical Care (Agarwal & Agrwal Practice)","WF","WF-5","South Leytonstone"]
["WF_LDP",43800,43801,"F86621",5842,301,4220,36,178,12,6,0,127,194,65,51,717,265,237,62,230,35,3630,350,1466,4936,74,57,18,0,10,610,416,287,205,551,103,71,82,311,29,4,24,11,1,22,27,23,85,51,50,39,"Green Man Medical Centre","WF","WF-5","South Leytonstone"]
["WF_LDP",43800,43801,"F86088",4893,307,3427,13,159,10,5,0,106,181,89,62,880,231,235,68,192,46,2558,212,991,4118,51,34,8,0,7,664,372,185,185,555,104,66,72,352,40,11,31,5,0,27,34,11,78,37,32,22,"The Lyndhurst Surgery","WF","WF-4","Forest Integrated Health"]
["WF_LDP",43800,43801,"F86062",7368,413,5120,2,156,11,11,3,106,170,275,201,1594,303,284,136,393,74,4550,594,2377,6049,100,81,29,2,16,843,438,243,234,739,147,90,107,461,71,18,63,18,6,33,49,8,123,63,60,42,"Grove Surgery","WF","WF-7","Walthamstow West"]
["WF_LDP",43800,43801,"F86058",15519,716,10200,17,345,138,15,15,256,379,482,339,4090,536,514,254,718,171,7933,972,3836,12088,198,130,63,0,35,1474,859,382,386,1247,225,144,167,740,105,21,93,33,1,58,80,8,197,116,106,81,"St James Medical Practice Ltd","WF","WF-7","Walthamstow West"]
["WF_LDP",43800,43801,"F86086",6159,250,3868,8,82,8,6,2,54,100,124,66,893,208,138,113,273,73,3252,421,1457,4662,80,64,30,0,13,496,259,135,120,403,92,40,48,280,31,4,26,6,0,16,19,2,77,32,30,19,"Dr Dhital Practice","WF","WF-6","Central Walthamstow"]
["WF_LDP",43800,43801,"F86078",7245,337,4926,12,127,7,0,0,74,148,392,243,1987,240,219,117,271,47,4167,341,1361,6112,60,33,17,0,6,1180,642,192,197,970,187,98,113,364,94,9,77,24,0,57,57,4,125,112,88,59,"The Ridgeway Surgery","WF","WF-2","Chingford E4"]
["WF_LDP",43831,43837,"F86001",7909,446,5354,9,246,42,27,7,163,295,195,123,2390,354,294,125,294,75,4261,438,1641,6418,105,76,27,0,21,945,503,263,245,815,174,93,122,490,105,16,96,21,0,57,64,9,128,79,70,50," The Firs","WF","WF-6","Central Walthamstow"]
["WF_LDP",43831,43837,"Y01839",6411,346,4231,25,149,24,15,3,113,170,189,131,1253,285,236,108,208,88,3536,407,1152,5084,95,62,23,0,15,739,428,207,193,601,116,61,76,398,89,6,82,37,0,69,74,8,88,55,51,40,"Lime Tree & Sinnott Healthcare Ltd","WF","WF-1","Chingford/ Walthamstow"]
["WF_LDP",43831,43837,"F86038",11366,710,6900,11,222,18,14,4,142,250,441,293,1920,511,499,171,397,99,5956,467,1741,8635,137,94,30,0,11,1109,574,494,370,962,259,158,186,800,44,5,40,8,0,26,23,12,181,112,99,70,"Sma Medical Centre","WF","WF-3","Leyton Collaborative"]
["WF_LDP",43831,43837,"F86664",8404,327,5357,46,174,31,27,7,151,209,208,104,1722,310,227,152,326,81,4547,448,1771,6634,101,71,38,0,12,905,514,238,184,668,183,84,99,407,109,20,100,34,0,72,79,15,136,89,69,56,"Larkshall Medical Centre","WF","WF-1","Chingford/ Walthamstow"]
["WF_LDP",43831,43837,"F86036",15932,739,11138,16,355,39,15,6,244,392,253,178,3137,642,555,248,653,135,9463,902,3623,12869,241,161,66,1,41,1495,873,505,456,1265,249,150,173,828,123,29,108,53,0,84,97,30,212,123,105,75,"The Allum Medical Centre","WF","WF-4","Forest Integrated Health"]
["WF_LDP",43831,43837,"F86045",1979,129,1422,4,59,13,7,2,24,63,85,61,654,106,102,60,144,26,1210,151,628,1686,37,28,11,0,5,275,108,102,90,239,58,34,46,135,26,4,25,4,0,23,18,6,46,25,24,12,"High Road Surgery","WF","WF-5","South Leytonstone"]
["WF_LDP",43831,43837,"F86058",15690,718,10340,18,344,138,16,15,251,381,488,345,4137,535,526,258,720,169,8003,968,3830,12250,201,127,63,0,35,1487,857,408,391,1247,226,146,170,748,108,21,95,34,1,65,83,12,194,117,107,81,"St James Medical Practice Ltd","WF","WF-7","Walthamstow West"]
["WF_LDP",43831,43837,"F86689",4214,120,2912,8,87,4,2,0,64,94,53,43,665,84,79,34,100,37,2478,193,847,3248,29,18,6,0,7,296,159,97,76,272,57,35,47,121,35,2,29,12,1,23,20,7,46,21,20,10,"The Bailey Practice","WF","WF-1","Chingford/ Walthamstow"]
["WF_LDP",43831,43837,"F86044",9488,344,6788,11,150,28,23,12,89,179,300,190,1500,278,276,107,222,69,5459,741,1446,7861,114,80,34,0,8,765,366,245,217,625,85,42,49,380,37,9,33,16,1,24,24,9,58,52,44,26," Crawley Road Medical Centre","WF","WF-4","Forest Integrated Health"]
["WF_LDP",43831,43837,"F86006",6390,367,4246,1,143,7,6,0,62,166,102,64,1176,256,278,95,199,65,3525,421,1143,5090,55,33,13,0,7,815,366,232,216,738,96,55,68,408,54,22,49,25,0,37,26,17,65,56,49,27,"Seymour Medical Centre","WF","WF-7","Walthamstow West"]
["WF_LDP",43831,43837,"F86679",6029,240,3825,8,76,15,12,2,58,84,130,110,1135,201,159,92,234,53,3221,376,1544,4540,34,29,10,0,6,481,305,127,142,428,49,32,37,245,37,10,33,11,0,19,17,8,47,37,31,26,"Higham Hill Medical Centre","WF","WF-7","Walthamstow West"]
["WF_LDP",43831,43837,"F86666",14471,746,9863,39,338,81,63,20,209,391,656,443,4598,538,504,229,526,135,7504,891,2989,11687,233,152,74,0,19,1697,816,506,451,1400,197,117,144,851,118,32,94,42,0,76,84,19,137,108,88,52,"The Harrow Road Surgery","WF","WF-5","South Leytonstone"]
["WF_LDP",43831,43837,"F86705",3137,176,2202,12,61,6,5,3,40,67,120,81,1166,125,113,49,149,30,1753,186,897,2583,26,12,2,0,4,309,156,151,105,249,56,31,40,190,29,3,19,9,0,26,16,1,37,23,20,14,"The Langthorne Sharma Family Practice","WF","WF-5","South Leytonstone"]
["WF_LDP",43831,43837,"F86701",3401,207,2374,9,117,28,21,4,96,132,160,117,1156,169,155,62,167,28,1819,239,971,2786,72,53,29,0,11,423,272,181,124,370,58,39,48,221,21,6,19,6,0,18,20,7,51,30,27,19,"Kiyani Medical Practice","WF","WF-5","South Leytonstone"]
["WF_LDP",43831,43837,"F86030",8251,518,5361,37,209,10,4,2,151,219,377,315,3942,447,443,91,219,28,4365,290,1199,6457,50,30,9,0,4,735,490,427,344,671,172,143,155,541,41,5,40,11,0,33,30,4,147,57,56,39," Queens Road Medical Centre","WF","WF-7","Walthamstow West"]
["WF_LDP",43831,43837,"F86011",9377,686,4112,19,224,55,46,10,147,260,265,172,1394,555,470,141,329,92,5446,665,1801,7706,151,114,55,5,22,1191,654,485,378,1035,227,117,145,725,107,23,100,33,1,65,79,20,166,154,144,106,"The Manor Practice","WF","WF-3","Leyton Collaborative"]
["WF_LDP",43831,43837,"F86650",8173,440,5539,13,171,24,9,5,113,198,252,152,1596,322,278,102,342,68,4566,515,1866,6608,111,76,26,0,19,717,357,236,230,626,120,63,76,479,62,15,57,15,0,46,37,25,101,71,64,41,"Lime Tree Surgery","WF","WF-4","Forest Integrated Health"]
["WF_LDP",43831,43837,"F86626",5758,221,3889,6,74,11,8,1,55,84,166,108,1079,157,122,75,211,52,3177,315,1253,4559,45,31,8,0,5,470,268,128,115,424,72,40,50,233,20,6,20,6,0,16,13,3,53,27,24,19,"Dr Shantir Practice","WF","WF-1","Chingford/ Walthamstow"]
["WF_LDP",43831,43837,"Y01291",8812,407,5692,21,420,15,4,1,293,518,372,213,2359,365,326,160,387,76,5199,540,2182,7039,83,69,28,0,12,1185,677,297,246,984,197,120,136,441,118,29,104,30,0,88,78,38,146,124,103,79,"Chingford Medical Practice","WF","WF-2","Chingford E4"]
["WF_LDP",43831,43837,"F86644",10519,486,6811,32,258,111,66,18,174,293,373,251,2288,344,312,145,331,81,5590,585,1808,8247,145,123,59,0,21,1218,674,278,290,1013,209,113,138,551,114,19,102,37,2,69,80,24,151,73,64,47,"Waltham Forest Community & Family Health Services Ltd","WF","WF-6","Central Walthamstow"]
["WF_LDP",43831,43837,"Total",267438,13340,176674,555,6730,950,527,166,4584,7633,8507,5727,63362,10402,9381,4112,10262,2384,146930,15851,57083,213911,3245,2307,976,29,448,28772,16153,8931,7772,24878,4874,2845,3368,14519,2408,463,2142,758,35,1645,1667,549,3786,2481,2198,1548]
["WF_LDP",43831,43837,"F86696",5503,319,3699,9,163,30,0,6,125,188,186,141,1211,249,230,77,159,40,2384,311,1083,4425,48,36,15,0,6,558,360,239,195,511,95,74,79,331,25,5,25,5,0,16,13,9,88,38,34,24,"Francis Road Medical Centre","WF","WF-4","Forest Integrated Health"]
["WF_LDP",43831,43837,"F86712",3188,192,2280,4,75,4,3,0,58,86,31,17,465,148,138,51,149,25,1913,176,828,2695,22,18,7,0,4,344,189,126,114,304,51,29,34,205,11,5,10,3,0,7,10,0,41,13,12,12,"Hampton Medical Centre","WF","WF-4","Forest Integrated Health"]
["WF_LDP",43831,43837,"F86005",8616,304,5775,10,317,7,5,2,214,351,185,144,2673,241,221,110,307,67,4725,531,1920,6712,57,40,21,2,5,817,479,203,209,727,92,58,73,325,112,18,96,33,1,90,78,22,79,58,51,40," The Penryhn Surgery","WF","WF-1","Chingford/ Walthamstow"]
["WF_LDP",43831,43837,"F86700",3851,208,2509,14,272,16,15,6,200,297,166,94,598,197,156,58,154,34,2050,199,777,3130,51,40,11,1,8,796,550,162,135,737,136,69,81,219,123,18,118,48,4,100,94,70,122,89,81,56,"Kings Head Medical Practice","WF","WF-1","Chingford/ Walthamstow"]
["WF_LDP",43831,43837,"Y02585",5230,78,3836,11,19,12,12,2,11,19,55,34,1618,58,47,41,119,35,2384,336,697,4325,52,32,11,0,10,203,94,41,44,171,22,11,15,87,14,1,12,8,0,8,4,1,14,18,17,15]
["WF_LDP",43831,43837,"F86708",2775,171,1708,14,77,4,3,1,45,84,124,80,887,131,100,50,134,37,1491,115,593,2191,29,15,4,0,4,372,191,98,77,316,61,36,40,194,14,1,13,3,0,11,9,5,43,34,29,19,"Claremont Medical Centre","WF","WF-6","Central Walthamstow"]
["WF_LDP",43831,43837,"F86625",6142,374,4104,11,159,11,4,2,106,182,157,114,1130,279,299,107,219,55,3124,337,1125,4969,98,72,37,1,12,716,398,276,238,619,133,79,94,414,63,16,59,18,2,47,37,31,105,63,59,41,"LL Medical Care (Agarwal & Agrwal Practice)","WF","WF-5","South Leytonstone"]
["WF_LDP",43831,43837,"F86078",7202,329,4904,7,122,8,0,1,70,146,387,235,1965,239,210,115,271,41,4124,315,1355,6083,58,32,16,0,7,1176,628,216,189,954,190,97,111,359,92,9,77,24,0,62,56,4,128,112,87,59,"The Ridgeway Surgery","WF","WF-2","Chingford E4"]
["WF_LDP",43831,43837,"F86086",6234,257,3919,16,92,10,8,2,61,109,124,67,895,218,146,114,283,74,3310,435,1515,4717,87,70,32,0,14,497,260,147,128,405,94,42,50,286,32,5,27,7,0,17,19,2,77,33,30,19,"Dr Dhital Practice","WF","WF-6","Central Walthamstow"]
["WF_LDP",43831,43837,"F86062",7373,416,5125,3,155,10,10,3,107,170,276,197,1611,300,282,136,393,73,4583,599,2412,6060,97,78,27,2,16,844,439,263,244,736,146,86,105,463,71,18,65,18,6,39,48,9,124,64,61,39,"Grove Surgery","WF","WF-7","Walthamstow West"]
["WF_LDP",43831,43837,"F86627",13746,779,8907,12,598,35,24,7,356,683,681,449,3115,511,477,273,664,164,8078,1032,2965,11239,220,152,70,14,26,1866,987,427,438,1699,400,227,259,824,232,39,204,71,10,143,161,45,292,250,218,136,"Churchill Medical Centre","WF","WF-2","Chingford E4"]
["WF_LDP",43831,43837,"F86616",7143,302,4660,26,281,13,4,2,212,295,304,203,1983,263,225,141,331,66,3716,346,1778,5570,53,34,20,0,7,823,575,213,186,792,183,118,129,313,63,17,47,15,0,49,47,6,162,79,77,57,"Old Church Surgery","WF","WF-2","Chingford E4"]
["WF_LDP",43831,43837,"F86621",5864,297,4239,37,179,13,6,0,133,194,66,53,722,267,238,64,237,37,3666,365,1507,4962,76,59,19,0,11,613,421,290,208,562,101,69,81,306,30,5,27,12,1,25,28,21,81,50,48,36,"Green Man Medical Centre","WF","WF-5","South Leytonstone"]
["WF_LDP",43831,43837,"F86607",13983,617,9232,26,183,67,38,10,134,203,488,341,4336,479,416,199,498,106,7748,810,3202,10738,182,153,67,3,26,1224,781,424,313,1148,205,107,134,644,90,14,88,44,5,68,68,39,164,109,102,81,"Addison Road Medical Practice","WF","WF-6","Central Walthamstow"]
["WF_LDP",43831,43837,"F86088",4877,324,3421,10,161,10,5,0,113,181,92,64,886,238,242,72,186,43,2556,206,994,4108,50,37,8,0,7,666,384,199,191,565,105,70,78,357,39,10,29,5,0,27,33,11,76,38,33,25,"The Lyndhurst Surgery","WF","WF-4","Forest Integrated Health"]
["WF_LDP",43862,43864,"F86006",6388,366,4243,2,141,5,4,0,67,163,101,64,1207,272,275,89,213,69,3526,424,1149,5082,55,34,12,0,9,810,392,239,220,739,94,56,70,405,54,22,51,26,1,37,26,29,76,54,48,28,"Seymour Medical Centre","WF","WF-7","Walthamstow West"]
["WF_LDP",43862,43864,"F86705",3156,172,2209,13,63,7,6,3,44,70,119,81,1169,122,111,51,151,31,1766,193,900,2597,27,12,2,0,5,311,151,152,100,245,57,33,41,190,29,3,18,9,0,26,16,11,39,23,21,16,"The Langthorne Sharma Family Practice","WF","WF-5","South Leytonstone"]
["WF_LDP",43862,43864,"F86005",8666,301,5812,11,305,7,5,2,208,348,186,142,2710,252,215,108,326,68,4757,526,1983,6747,58,39,21,2,5,817,487,208,204,719,92,57,71,322,112,16,94,34,1,90,81,25,79,59,51,39," The Penryhn Surgery","WF","WF-1","Chingford/ Walthamstow"]
["WF_LDP",43862,43864,"F86001",7912,438,5365,13,246,42,28,7,162,299,195,116,2396,350,285,113,281,71,4178,416,1534,6423,104,78,28,0,22,944,498,268,238,811,172,87,113,487,105,16,93,23,0,61,63,11,131,79,70,53," The Firs","WF","WF-6","Central Walthamstow"]
["WF_LDP",43862,43864,"Y01839",6423,341,4245,27,155,24,17,2,124,175,189,130,1257,289,233,108,221,85,3546,406,1151,5100,95,64,23,0,15,735,424,221,190,587,116,63,78,396,89,6,84,40,1,71,74,8,77,54,51,41,"Lime Tree & Sinnott Healthcare Ltd","WF","WF-1","Chingford/ Walthamstow"]
["WF_LDP",43862,43864,"Y02585",4019,40,3000,4,9,8,8,1,5,9,27,14,1184,29,21,24,71,17,1721,195,418,3383,38,20,6,0,6,121,50,20,19,97,11,3,5,43,8,1,7,5,0,4,0,0,6,13,11,10]
["WF_LDP",43862,43864,"Total",267052,13361,176481,600,6782,970,560,160,4669,7694,8561,5766,63941,10547,9413,4163,10399,2436,146874,15622,57536,213628,3250,2317,952,28,462,28717,16254,9281,7785,24841,4844,2850,3363,14509,2392,458,2119,744,39,1682,1663,651,3788,2476,2199,1567]
["WF_LDP",43862,43864,"F86708",2764,169,1705,16,82,6,4,1,46,86,126,81,884,128,104,53,138,38,1491,115,612,2182,30,16,4,0,4,370,191,104,80,317,59,37,42,194,14,1,13,3,0,11,9,5,45,33,29,16,"Claremont Medical Centre","WF","WF-6","Central Walthamstow"]
["WF_LDP",43862,43864,"F86712",3198,187,2287,8,83,4,3,0,63,90,30,17,485,154,145,52,133,26,1932,176,791,2707,22,19,7,0,4,344,195,143,124,304,51,31,36,204,11,5,9,3,0,7,10,0,45,13,12,10,"Hampton Medical Centre","WF","WF-4","Forest Integrated Health"]
["WF_LDP",43862,43864,"Y01291",8829,411,5695,27,424,17,6,1,288,527,375,209,2357,373,328,166,393,78,5266,555,2197,7045,83,72,29,0,13,1184,660,307,240,976,198,117,137,445,118,29,107,32,0,91,79,52,155,123,106,83,"Chingford Medical Practice","WF","WF-2","Chingford E4"]
["WF_LDP",43862,43864,"F86701",3448,209,2403,9,117,30,22,4,97,132,165,120,1201,181,159,66,175,31,1837,243,1006,2824,72,53,28,0,12,427,286,186,129,376,56,36,45,225,20,6,18,5,0,17,19,7,49,31,28,20,"Kiyani Medical Practice","WF","WF-5","South Leytonstone"]
["WF_LDP",43862,43864,"F86616",7192,303,4683,20,276,15,5,2,213,295,302,195,2021,269,219,140,335,67,3707,351,1786,5600,53,31,18,0,7,821,586,225,190,785,182,117,128,314,62,17,45,14,1,49,46,11,165,78,75,60,"Old Church Surgery","WF","WF-2","Chingford E4"]
["WF_LDP",43862,43864,"F86621",5918,300,4278,44,182,12,5,0,140,200,72,58,734,268,241,64,249,39,3700,368,1551,5008,77,57,17,0,13,617,427,291,219,569,102,71,83,308,33,5,30,14,1,28,30,23,85,53,51,40,"Green Man Medical Centre","WF","WF-5","South Leytonstone"]
["WF_LDP",43862,43864,"F86625",6141,376,4106,14,161,10,5,1,106,181,156,113,1144,288,299,112,220,58,3131,333,1125,4967,99,72,37,1,13,711,399,284,236,623,133,79,93,409,64,18,60,17,2,51,37,48,103,65,60,42,"LL Medical Care (Agarwal & Agrwal Practice)","WF","WF-5","South Leytonstone"]
["WF_LDP",43862,43864,"F86086",6305,268,3974,13,94,12,10,2,65,108,127,73,879,226,150,123,285,76,3355,433,1567,4764,86,68,30,0,14,498,260,157,130,413,94,41,51,290,32,5,27,8,0,17,19,2,75,33,29,19,"Dr Dhital Practice","WF","WF-6","Central Walthamstow"]
["WF_LDP",43862,43864,"F86088",4901,333,3437,12,168,12,5,1,120,184,100,74,901,247,247,77,188,47,2594,210,1012,4125,50,37,8,0,6,665,389,213,196,574,104,70,79,363,39,9,30,4,0,28,33,16,81,39,35,25,"The Lyndhurst Surgery","WF","WF-4","Forest Integrated Health"]
["WF_LDP",43862,43864,"F86607",13943,622,9198,36,198,72,44,9,144,220,492,342,4458,489,428,197,527,109,7737,775,3279,10702,185,161,65,3,30,1228,777,436,323,1147,201,109,133,647,90,14,88,43,8,69,68,48,165,107,100,79,"Addison Road Medical Practice","WF","WF-6","Central Walthamstow"]
["WF_LDP",43862,43864,"F86650",8200,441,5562,13,173,26,10,6,116,198,250,153,1602,328,271,107,345,71,4616,533,1868,6636,113,81,27,0,21,720,356,250,230,622,122,64,76,481,62,15,58,15,0,46,37,26,108,71,64,40,"Lime Tree Surgery","WF","WF-4","Forest Integrated Health"]
["WF_LDP",43862,43864,"F86664",8404,327,5363,44,170,34,31,7,148,206,209,103,1781,314,228,155,330,86,4541,441,1819,6644,102,74,38,0,12,901,513,254,181,660,183,85,100,407,108,20,96,31,0,74,78,15,133,87,69,59,"Larkshall Medical Centre","WF","WF-1","Chingford/ Walthamstow"]
["WF_LDP",43862,43864,"F86666",14556,762,9904,39,341,79,60,20,214,396,658,458,4659,546,526,244,559,139,7545,890,3078,11752,233,145,72,0,18,1704,814,520,448,1418,199,116,147,858,117,31,93,42,0,76,85,20,137,111,90,54,"The Harrow Road Surgery","WF","WF-5","South Leytonstone"]
["WF_LDP",43862,43864,"F86626",5898,220,3991,5,70,10,6,2,50,87,175,104,1177,151,131,74,215,50,3301,347,1315,4680,49,35,9,0,6,479,261,133,114,419,73,42,52,243,21,6,20,6,0,16,13,4,54,27,24,18,"Dr Shantir Practice","WF","WF-1","Chingford/ Walthamstow"]
["WF_LDP",43862,43864,"F86627",13676,771,8883,12,607,36,28,7,360,687,677,457,3134,510,489,285,671,166,8023,1020,3028,11195,221,157,74,15,26,1858,1007,444,440,1711,400,239,273,815,228,38,197,68,9,146,161,46,301,243,203,131,"Churchill Medical Centre","WF","WF-2","Chingford E4"]
["WF_LDP",43862,43864,"F86644",10468,489,6782,30,261,109,68,17,189,294,376,253,2327,355,309,153,339,90,5572,574,1836,8211,141,118,52,0,22,1211,688,296,288,1011,208,109,133,548,113,19,102,37,2,73,80,24,150,71,61,48,"Waltham Forest Community & Family Health Services Ltd","WF","WF-6","Central Walthamstow"]
["WF_LDP",43862,43864,"F86078",7203,334,4910,6,121,7,0,0,70,144,390,227,1967,238,204,115,271,44,4147,332,1357,6087,58,34,16,0,8,1169,614,223,186,945,189,93,105,357,92,9,76,24,0,62,57,5,128,112,90,58,"The Ridgeway Surgery","WF","WF-2","Chingford E4"]
["WF_LDP",43862,43864,"F86679",6046,232,3844,25,95,17,14,3,73,101,128,105,1138,188,160,94,222,54,3231,378,1549,4556,35,31,11,0,5,480,302,143,140,426,49,30,35,241,35,10,32,10,0,22,16,8,44,36,33,25,"Higham Hill Medical Centre","WF","WF-7","Walthamstow West"]
["WF_LDP",43862,43864,"F86011",9428,688,4161,21,222,63,53,12,147,260,269,175,1453,551,469,141,323,91,5331,579,1823,7737,153,109,51,4,20,1192,645,507,382,1029,221,112,135,728,105,23,96,32,1,68,77,19,163,152,141,103,"The Manor Practice","WF","WF-3","Leyton Collaborative"]
["WF_LDP",43862,43864,"F86030",8260,519,5371,34,213,9,3,1,158,220,380,319,3940,458,446,91,216,27,4363,277,1164,6467,50,30,6,0,6,736,507,436,353,676,172,142,157,546,41,5,40,11,0,33,30,7,146,58,58,43," Queens Road Medical Centre","WF","WF-7","Walthamstow West"]
["WF_LDP",43862,43864,"F86700",3887,210,2525,15,270,14,13,4,200,297,169,100,629,199,161,56,155,33,2055,200,787,3149,52,39,11,1,7,797,551,168,142,732,137,72,83,222,122,18,117,47,4,100,93,71,119,90,83,58,"Kings Head Medical Practice","WF","WF-1","Chingford/ Walthamstow"]
["WF_LDP",43862,43864,"F86696",5492,328,3696,8,164,30,2,6,124,186,197,151,1284,260,231,76,172,44,2508,323,1137,4440,49,37,15,0,6,564,362,243,190,518,96,72,77,337,26,5,25,5,0,16,13,9,86,41,37,25,"Francis Road Medical Centre","WF","WF-4","Forest Integrated Health"]
["WF_LDP",43862,43864,"F86689",4245,121,2935,10,90,5,3,0,75,96,54,44,688,88,81,37,99,34,2520,186,869,3274,30,20,6,0,9,298,171,103,73,280,57,35,47,123,36,2,32,10,1,23,20,17,43,21,20,9,"The Bailey Practice","WF","WF-1","Chingford/ Walthamstow"]
["WF_LDP",43862,43864,"F86036",15951,749,11145,14,349,39,15,5,239,388,256,181,3179,657,565,243,653,137,9563,903,3625,12876,241,159,63,1,41,1493,888,529,452,1260,247,160,179,824,121,28,106,47,0,87,97,31,209,124,108,79,"The Allum Medical Centre","WF","WF-4","Forest Integrated Health"]
["WF_LDP",43862,43864,"F86044",9595,346,6851,13,148,29,25,10,85,179,301,200,1545,277,275,112,250,80,5529,753,1526,7932,114,81,34,0,8,771,363,249,219,635,84,44,50,380,38,9,34,16,1,24,24,9,58,56,48,28," Crawley Road Medical Centre","WF","WF-4","Forest Integrated Health"]
["WF_LDP",43862,43864,"F86045",1992,132,1430,5,62,16,9,2,22,65,88,66,666,117,103,60,141,27,1215,150,626,1697,37,31,11,0,6,276,112,106,89,243,57,35,45,137,26,4,26,4,0,23,18,6,45,25,24,12,"High Road Surgery","WF","WF-5","South Leytonstone"]
["WF_LDP",43862,43864,"F86062",7341,420,5112,7,155,9,9,2,108,173,280,202,1646,309,291,135,405,77,4603,607,2474,6035,97,79,26,1,18,844,456,284,248,742,145,93,111,464,70,17,64,16,5,42,48,12,123,64,60,37,"Grove Surgery","WF","WF-7","Walthamstow West"]
["WF_LDP",43862,43864,"F86058",15641,708,10321,17,342,136,18,15,254,380,489,342,4135,536,522,258,709,170,7926,936,3756,12199,199,127,62,0,34,1485,868,419,395,1246,224,141,164,744,107,21,90,35,1,65,83,13,181,116,107,85,"St James Medical Practice Ltd","WF","WF-7","Walthamstow West"]
["WF_LDP",43862,43864,"F86038",11566,728,7055,13,225,19,16,5,145,250,453,297,2004,528,491,184,418,106,6041,474,1838,8805,142,97,33,0,11,1136,604,520,377,986,259,159,189,812,44,5,41,8,0,29,23,13,184,114,102,74,"Sma Medical Centre","WF","WF-3","Leyton Collaborative"]
["WF_LDP",43891,43892,"F86616",7243,311,4715,14,280,17,6,2,212,295,305,193,2065,274,226,136,348,72,3748,361,1835,5637,56,35,19,0,7,822,592,228,193,789,182,120,131,318,63,17,44,14,0,51,47,12,163,82,80,63,"Old Church Surgery","WF","WF-2","Chingford E4"]
["WF_LDP",43891,43892,"F86088",4896,329,3443,12,174,11,4,1,122,186,117,84,912,251,245,79,203,50,2632,218,1049,4130,51,39,10,0,6,671,397,213,194,578,106,70,79,361,39,9,31,6,0,29,33,18,79,39,36,26,"The Lyndhurst Surgery","WF","WF-4","Forest Integrated Health"]
["WF_LDP",43891,43892,"F86607",13990,634,9236,96,257,75,45,9,180,284,499,344,4585,476,428,201,569,109,7878,805,3414,10750,188,164,66,3,30,1240,769,438,330,1149,202,111,136,655,91,15,89,43,10,70,69,49,163,108,101,81,"Addison Road Medical Practice","WF","WF-6","Central Walthamstow"]
["WF_LDP",43891,43892,"F86621",5930,297,4283,46,181,15,9,0,142,201,75,63,746,272,240,72,247,41,3725,368,1575,5018,76,61,18,0,13,616,424,291,219,565,103,70,82,308,33,3,31,13,1,28,30,24,88,53,50,41,"Green Man Medical Centre","WF","WF-5","South Leytonstone"]
["WF_LDP",43891,43892,"F86626",5988,230,4064,7,75,13,11,2,56,88,178,110,1200,164,135,77,230,56,3392,364,1384,4773,50,39,11,1,6,482,261,142,123,413,74,40,51,249,21,6,20,6,0,16,13,4,53,26,24,19,"Dr Shantir Practice","WF","WF-1","Chingford/ Walthamstow"]
["WF_LDP",43891,43892,"F86627",13635,764,8854,13,607,40,33,9,362,688,680,460,3180,512,488,283,693,165,7973,1013,3084,11170,222,153,74,16,26,1866,1025,454,439,1718,402,241,276,812,230,40,207,75,13,152,165,58,302,240,202,134,"Churchill Medical Centre","WF","WF-2","Chingford E4"]
["WF_LDP",43891,43892,"F86625",6160,378,4118,44,192,10,6,2,121,215,159,116,1150,302,298,115,219,59,3131,327,1124,4985,99,75,38,1,14,709,392,289,236,618,133,76,94,410,63,17,59,16,2,50,37,47,95,66,61,41,"LL Medical Care (Agarwal & Agrwal Practice)","WF","WF-5","South Leytonstone"]
["WF_LDP",43891,43892,"F86045",2001,134,1438,7,66,17,11,3,27,68,90,69,678,121,107,61,143,30,1209,138,632,1709,37,30,10,0,6,277,115,107,91,248,58,35,47,138,25,4,25,3,0,22,17,7,48,26,25,12,"High Road Surgery","WF","WF-5","South Leytonstone"]
["WF_LDP",43891,43892,"F86044",9649,350,6892,12,144,30,27,10,83,176,302,199,1561,280,277,119,256,84,5547,746,1512,7980,118,85,34,0,7,773,364,261,220,636,81,44,50,383,38,9,34,17,1,24,23,8,59,56,48,29," Crawley Road Medical Centre","WF","WF-4","Forest Integrated Health"]
["WF_LDP",43891,43892,"F86038",11640,736,7107,13,226,26,21,7,160,250,460,309,2066,571,494,203,446,109,6032,461,1923,8863,142,98,29,0,13,1140,650,529,386,991,244,151,181,808,43,6,41,8,0,30,23,14,183,114,100,74,"Sma Medical Centre","WF","WF-3","Leyton Collaborative"]
["WF_LDP",43891,43892,"F86058",15643,713,10328,13,339,125,16,14,253,381,486,340,4117,550,524,251,689,167,7864,899,3632,12207,196,122,63,0,28,1483,875,460,400,1243,223,139,159,747,106,20,90,37,0,68,83,18,168,120,110,88,"St James Medical Practice Ltd","WF","WF-7","Walthamstow West"]
["WF_LDP",43891,43892,"F86086",6328,270,3992,12,93,10,9,2,62,108,128,75,869,232,151,124,288,85,3354,425,1577,4786,86,65,29,0,13,499,269,168,136,411,94,40,50,294,32,5,26,7,0,20,19,3,73,35,32,19,"Dr Dhital Practice","WF","WF-6","Central Walthamstow"]
["WF_LDP",43891,43892,"F86078",7162,334,4883,7,119,8,0,0,73,142,388,222,1961,241,207,118,276,44,4120,324,1350,6054,58,32,16,0,8,1161,618,230,186,931,188,96,108,354,89,7,73,22,0,63,56,8,130,112,91,61,"The Ridgeway Surgery","WF","WF-2","Chingford E4"]
["WF_LDP",43891,43892,"F86062",7351,422,5109,9,159,11,8,2,113,175,280,199,1650,320,292,144,418,78,4622,615,2517,6050,96,76,27,2,16,847,481,296,245,746,146,99,116,456,70,18,66,17,5,46,48,27,121,65,62,39,"Grove Surgery","WF","WF-7","Walthamstow West"]
["WF_LDP",43891,43892,"F86644",10381,498,6734,28,261,107,71,17,190,289,374,253,2349,359,308,161,332,92,5517,562,1827,8143,138,121,52,0,24,1200,694,321,293,1016,205,106,132,543,110,18,103,39,2,76,78,24,148,69,63,48,"Waltham Forest Community & Family Health Services Ltd","WF","WF-6","Central Walthamstow"]
["WF_LDP",43891,43892,"F86701",3467,213,2414,10,118,29,21,4,99,134,165,126,1230,185,166,72,184,33,1866,251,1056,2841,73,54,28,0,12,429,302,192,135,383,60,39,48,227,21,7,19,5,0,17,20,7,51,32,29,20,"Kiyani Medical Practice","WF","WF-5","South Leytonstone"]
["WF_LDP",43891,43892,"F86705",3222,178,2255,25,72,9,7,3,45,82,123,79,1193,122,114,53,152,31,1805,196,928,2656,29,13,2,0,6,316,141,154,100,249,58,32,40,198,29,3,16,6,0,27,17,12,37,23,19,12,"The Langthorne Sharma Family Practice","WF","WF-5","South Leytonstone"]
["WF_LDP",43891,43892,"F86700",3901,209,2534,14,267,14,13,4,198,295,166,95,621,196,158,60,152,31,2055,197,778,3155,50,38,11,1,7,796,555,167,145,728,136,72,85,221,120,17,116,46,4,99,92,70,110,88,82,57,"Kings Head Medical Practice","WF","WF-1","Chingford/ Walthamstow"]
["WF_LDP",43891,43892,"F86001",7949,444,5389,17,247,40,26,7,156,306,197,105,2411,350,285,114,277,73,4177,407,1498,6449,105,78,27,0,24,947,495,273,236,801,171,87,109,490,106,16,92,23,0,62,63,13,140,77,71,53," The Firs","WF","WF-6","Central Walthamstow"]
["WF_LDP",43891,43892,"F86696",5567,326,3748,8,162,32,3,6,120,183,200,154,1331,265,235,82,170,42,2571,327,1141,4513,50,35,17,0,4,558,367,247,190,514,96,74,79,329,26,5,25,6,0,16,13,10,83,41,36,24,"Francis Road Medical Centre","WF","WF-4","Forest Integrated Health"]
["WF_LDP",43891,43892,"Y01291",8838,412,5697,31,433,17,9,2,302,533,372,211,2359,369,321,176,401,80,5302,552,2234,7048,84,74,31,0,13,1203,689,316,246,1004,200,118,138,448,117,29,97,32,0,89,78,61,160,120,108,80,"Chingford Medical Practice","WF","WF-2","Chingford E4"]
["WF_LDP",43891,43892,"Y01839",6419,350,4246,29,159,22,15,1,129,177,192,123,1255,301,229,113,232,85,3578,406,1172,5097,93,64,23,0,13,733,424,237,195,587,116,63,78,396,86,6,81,39,1,68,71,9,77,54,52,42,"Lime Tree & Sinnott Healthcare Ltd","WF","WF-1","Chingford/ Walthamstow"]
["WF_LDP",43891,43892,"F86712",3195,194,2282,8,84,4,3,0,67,90,30,15,487,169,143,55,143,26,1936,172,789,2702,22,19,7,0,4,342,203,152,123,310,50,32,38,204,10,4,9,3,0,7,9,0,45,14,13,11,"Hampton Medical Centre","WF","WF-4","Forest Integrated Health"]
["WF_LDP",43891,43892,"Total",263727,13432,174019,687,6926,981,584,167,4824,7833,8614,5792,63483,10734,9439,4258,10520,2486,145728,15443,57669,210885,3224,2331,966,32,451,28663,16590,9561,7872,24872,4825,2850,3371,14495,2370,455,2099,749,44,1706,1659,732,3739,2466,2206,1575]
["WF_LDP",43891,43892,"F86708",2773,171,1720,14,82,6,4,1,48,87,128,80,877,132,106,53,128,39,1498,116,604,2193,30,17,6,0,4,368,192,106,81,311,60,36,43,195,14,1,10,3,0,11,9,5,50,33,29,16,"Claremont Medical Centre","WF","WF-6","Central Walthamstow"]
["WF_LDP",43891,43892,"F86689",4280,123,2945,8,93,4,4,0,73,96,53,40,700,86,78,35,98,34,2512,181,858,3284,30,21,6,0,10,302,178,104,75,288,55,35,46,124,35,2,31,9,1,25,21,17,39,21,20,9,"The Bailey Practice","WF","WF-1","Chingford/ Walthamstow"]
["WF_LDP",43891,43892,"F86650",8191,442,5561,11,173,27,11,6,115,197,255,151,1625,345,266,111,346,71,4608,519,1908,6634,112,85,26,0,19,722,370,267,234,618,123,61,71,483,62,15,58,15,0,47,37,27,106,71,64,39,"Lime Tree Surgery","WF","WF-4","Forest Integrated Health"]
["WF_LDP",43891,43892,"F86664",8412,335,5378,25,171,35,32,8,148,209,214,108,1824,321,222,150,332,86,4552,436,1813,6662,104,78,40,1,14,906,515,264,179,660,184,80,97,415,107,20,93,28,0,73,77,15,126,88,71,61,"Larkshall Medical Centre","WF","WF-1","Chingford/ Walthamstow"]
["WF_LDP",43891,43892,"F86679",6091,233,3872,26,95,13,9,3,74,102,128,108,1130,200,163,94,233,55,3300,408,1567,4585,36,32,12,0,5,480,318,160,141,431,51,34,41,239,34,9,31,10,0,22,16,8,45,36,33,26,"Higham Hill Medical Centre","WF","WF-7","Walthamstow West"]
["WF_LDP",43891,43892,"F86666",14621,759,9948,33,336,80,62,21,216,395,659,466,4693,549,542,255,580,150,7565,908,3141,11791,230,143,76,0,18,1713,791,530,467,1397,202,122,154,858,117,32,95,47,0,78,86,21,140,110,87,54,"The Harrow Road Surgery","WF","WF-5","South Leytonstone"]
["WF_LDP",43891,43892,"F86011",9445,681,4198,24,226,70,57,13,148,260,265,171,1477,545,470,136,335,95,5326,590,1845,7760,154,116,55,3,20,1196,663,509,385,1026,220,108,130,728,103,23,91,31,1,68,74,23,160,150,138,101,"The Manor Practice","WF","WF-3","Leyton Collaborative"]
["WF_LDP",43891,43892,"F86006",6444,377,4289,16,165,7,5,0,94,183,110,71,1276,299,279,93,203,74,3600,435,1145,5140,56,34,10,0,11,822,451,247,225,762,95,57,71,414,55,23,52,27,1,38,26,32,86,58,54,35,"Seymour Medical Centre","WF","WF-7","Walthamstow West"]
["WF_LDP",43891,43892,"F86030",8258,516,5381,30,210,11,5,1,164,221,382,318,3934,455,446,97,217,29,4362,265,1154,6478,51,32,9,1,6,735,532,437,350,686,171,143,157,542,42,6,41,11,0,34,30,13,143,57,57,43," Queens Road Medical Centre","WF","WF-7","Walthamstow West"]
["WF_LDP",43891,43892,"F86005",8687,309,5825,11,309,6,4,2,218,349,187,143,2712,254,217,110,334,64,4775,523,1966,6764,61,42,20,2,6,819,509,212,209,727,91,58,72,323,112,15,91,35,2,91,82,30,73,59,50,39," The Penryhn Surgery","WF","WF-1","Chingford/ Walthamstow"]
["WF_LDP",43891,43892,"F86036",15970,760,11141,14,351,40,17,5,254,388,267,192,3259,666,579,255,646,147,9596,928,3637,12878,241,161,64,1,38,1490,969,560,465,1338,245,161,182,825,121,28,112,50,0,89,97,38,195,123,108,78,"The Allum Medical Centre","WF","WF-4","Forest Integrated Health"]
["WF_LDP",43922,43923,"F86006",6435,381,4285,16,167,7,5,0,99,183,111,70,1274,310,284,94,212,72,3599,446,1131,5138,57,35,11,0,10,821,456,246,226,756,96,56,70,417,54,23,49,25,1,37,26,31,84,59,55,36,"Seymour Medical Centre","WF","WF-7","Walthamstow West"]
["WF_LDP",43922,43923,"F86011",9916,691,4542,20,229,79,56,15,154,261,266,170,1598,557,466,136,320,98,5509,596,1835,8158,150,125,60,3,22,1210,658,521,388,1015,219,106,127,735,103,23,92,30,1,68,74,26,159,155,142,106,"The Manor Practice","WF","WF-3","Leyton Collaborative"]
["WF_LDP",43922,43923,"F86030",8299,521,5422,31,212,10,5,1,166,223,383,321,3939,457,449,93,217,34,4392,274,1134,6528,49,32,9,1,6,737,525,438,352,689,170,144,156,547,42,6,41,11,0,34,30,13,130,58,58,44," Queens Road Medical Centre","WF","WF-7","Walthamstow West"]
["WF_LDP",43922,43923,"F86088",4878,327,3439,11,168,11,4,1,124,184,119,86,907,257,245,83,200,48,2629,216,1036,4124,49,37,10,0,6,665,403,212,197,567,102,66,77,358,38,9,32,7,0,28,32,19,63,39,36,26,"The Lyndhurst Surgery","WF","WF-4","Forest Integrated Health"]
["WF_LDP",43922,43923,"F86001",7976,442,5414,16,243,34,23,7,149,304,196,102,2405,351,268,114,261,74,4186,402,1430,6472,106,76,27,0,24,942,487,276,220,778,168,78,99,487,106,16,93,25,0,63,64,15,136,77,70,52," The Firs","WF","WF-6","Central Walthamstow"]
["WF_LDP",43922,43923,"F86005",8743,312,5861,9,312,6,4,2,219,348,191,146,2751,254,218,111,340,66,4820,533,1982,6807,62,42,21,2,7,819,521,214,209,730,93,57,71,325,114,15,95,36,3,93,83,31,72,59,50,38," The Penryhn Surgery","WF","WF-1","Chingford/ Walthamstow"]
["WF_LDP",43922,43923,"F86078",7154,330,4885,10,125,7,0,0,75,146,390,218,1957,248,204,116,282,48,4111,308,1358,6049,60,33,15,0,7,1161,685,230,179,963,189,93,106,354,89,7,73,22,0,64,57,11,129,112,93,61,"The Ridgeway Surgery","WF","WF-2","Chingford E4"]
["WF_LDP",43922,43923,"F86062",7356,419,5107,9,156,12,9,2,112,176,280,194,1636,315,291,142,406,74,4589,597,2460,6056,96,78,29,2,16,852,483,299,239,743,150,97,113,456,70,19,65,17,2,46,48,29,124,67,64,43,"Grove Surgery","WF","WF-7","Walthamstow West"]
["WF_LDP",43922,43923,"F86086",6384,277,4024,13,96,6,5,1,78,111,127,74,848,235,148,112,285,81,3402,446,1533,4830,86,68,32,0,14,500,280,174,142,414,94,39,50,298,32,5,28,7,0,20,19,6,71,37,33,21,"Dr Dhital Practice","WF","WF-6","Central Walthamstow"]
["WF_LDP",43922,43923,"F86616",7278,310,4743,21,283,18,6,2,221,307,309,178,2076,277,227,138,335,62,3737,353,1777,5668,58,38,21,1,8,821,590,227,194,783,182,117,129,317,62,16,41,14,0,50,46,12,161,82,80,61,"Old Church Surgery","WF","WF-2","Chingford E4"]
["WF_LDP",43922,43923,"F86607",14051,640,9275,124,277,74,44,10,195,311,498,337,4653,484,428,204,574,108,7886,805,3406,10808,186,167,66,4,30,1240,765,441,331,1132,201,110,135,656,90,14,88,43,9,69,68,49,157,109,102,81,"Addison Road Medical Practice","WF","WF-6","Central Walthamstow"]
["WF_LDP",43922,43923,"F86038",12240,739,7566,12,226,32,27,10,158,253,467,312,2279,598,496,217,456,109,6296,487,1978,9408,154,105,32,0,15,1168,666,533,385,996,245,149,179,811,45,6,42,8,0,32,24,15,182,114,99,75,"Sma Medical Centre","WF","WF-3","Leyton Collaborative"]
["WF_LDP",43922,43923,"F86036",15888,751,11087,13,344,70,14,23,258,380,523,409,3747,660,567,247,632,147,9472,910,3560,12814,238,156,60,0,39,1492,1002,555,459,1353,236,152,172,815,116,26,109,49,0,85,92,41,182,121,107,79,"The Allum Medical Centre","WF","WF-4","Forest Integrated Health"]
["WF_LDP",43922,43923,"F86044",9698,350,6918,8,143,27,25,10,85,176,298,196,1567,274,279,116,252,84,5451,719,1481,8021,115,82,34,0,7,774,349,261,222,618,81,45,50,389,38,9,33,17,1,24,23,8,53,59,47,28," Crawley Road Medical Centre","WF","WF-4","Forest Integrated Health"]
["WF_LDP",43922,43923,"F86058",15610,714,10292,15,339,125,15,13,262,383,484,333,4080,590,522,238,660,166,7793,875,3519,12181,196,137,71,0,29,1481,914,471,403,1241,224,139,161,747,101,19,85,37,0,68,82,31,165,120,111,93,"St James Medical Practice Ltd","WF","WF-7","Walthamstow West"]
["WF_LDP",43922,43923,"F86045",1991,133,1419,7,66,19,11,2,36,68,92,68,685,123,107,59,138,29,1184,130,630,1693,37,30,9,0,7,279,126,107,91,250,60,37,48,137,24,4,24,3,0,21,17,7,50,26,25,14,"High Road Surgery","WF","WF-5","South Leytonstone"]
["WF_LDP",43922,43923,"F86696",6128,329,4209,1,167,33,4,6,119,184,202,153,1502,267,236,83,180,42,2849,347,1197,5014,53,37,16,0,4,567,372,249,189,519,97,73,79,331,27,5,26,6,0,17,14,10,77,41,36,24,"Francis Road Medical Centre","WF","WF-4","Forest Integrated Health"]
["WF_LDP",43922,43923,"F86700",3916,211,2543,16,266,14,13,4,200,294,167,96,626,197,156,60,156,31,2065,202,781,3169,50,37,12,1,6,800,556,169,146,727,134,72,84,224,120,17,116,47,4,99,91,69,102,87,80,55,"Kings Head Medical Practice","WF","WF-1","Chingford/ Walthamstow"]
["WF_LDP",43922,43923,"F86689",4293,123,2961,8,92,4,4,0,69,96,53,38,703,86,76,35,95,33,2505,180,806,3302,29,19,5,0,9,301,177,104,75,282,54,35,43,124,35,2,30,9,1,25,21,17,39,21,20,9,"The Bailey Practice","WF","WF-1","Chingford/ Walthamstow"]
["WF_LDP",43922,43923,"Total",266163,13496,175944,687,6937,1017,582,189,4925,7882,8894,5958,64792,10973,9428,4230,10419,2468,146219,15312,56953,213103,3228,2352,988,19,454,28734,17010,9687,7871,24893,4806,2790,3293,14532,2353,452,2084,745,34,1703,1652,789,3643,2468,2202,1580]
["WF_LDP",43922,43923,"F86679",6104,233,3888,24,93,14,10,3,75,102,129,108,1127,202,163,96,230,50,3310,406,1552,4603,36,31,12,0,5,481,331,177,137,440,51,33,40,238,34,9,30,10,0,22,16,8,41,36,33,27,"Higham Hill Medical Centre","WF","WF-7","Walthamstow West"]
["WF_LDP",43922,43923,"F86701",3528,216,2465,9,118,29,21,4,100,133,167,132,1281,188,172,75,188,35,1899,242,1085,2890,71,55,29,0,12,436,309,193,139,391,61,40,49,231,21,7,19,5,0,17,20,8,49,33,30,21,"Kiyani Medical Practice","WF","WF-5","South Leytonstone"]
["WF_LDP",43922,43923,"Y01291",8872,418,5720,34,436,19,11,3,307,534,369,204,2366,375,323,169,397,83,5302,538,2180,7077,84,68,30,0,13,1203,704,322,247,1021,198,113,129,451,113,28,96,31,0,88,76,73,159,118,105,78,"Chingford Medical Practice","WF","WF-2","Chingford E4"]
["WF_LDP",43922,43923,"Y01839",6457,351,4278,23,161,23,17,2,131,181,188,119,1272,307,225,110,228,84,3587,403,1149,5135,95,69,25,0,13,733,424,237,196,582,116,60,76,395,86,6,80,39,1,68,71,9,79,53,51,43,"Lime Tree & Sinnott Healthcare Ltd","WF","WF-1","Chingford/ Walthamstow"]
["WF_LDP",43922,43923,"F86712",3344,191,2410,4,85,3,2,0,65,89,29,12,545,164,148,54,134,23,1961,163,754,2841,22,19,7,0,4,342,207,153,121,310,50,33,38,198,9,4,8,2,0,7,8,2,43,14,14,11,"Hampton Medical Centre","WF","WF-4","Forest Integrated Health"]
["WF_LDP",43922,43923,"F86705",3262,182,2291,20,70,8,6,2,45,83,125,79,1203,129,117,50,142,35,1831,197,930,2696,27,15,3,0,6,319,143,156,101,250,59,34,40,201,28,3,14,4,0,26,17,12,40,24,19,11,"The Langthorne Sharma Family Practice","WF","WF-5","South Leytonstone"]
["WF_LDP",43922,43923,"F86708",2822,170,1754,14,76,6,4,1,46,86,124,75,886,134,100,50,127,35,1508,118,587,2230,30,19,6,0,4,367,197,108,80,312,61,39,46,190,14,1,10,3,0,11,9,7,52,32,28,14,"Claremont Medical Centre","WF","WF-6","Central Walthamstow"]
["WF_LDP",43922,43923,"F86625",6145,386,4111,47,193,7,5,2,142,220,159,118,1148,344,304,112,217,57,3101,318,1081,4980,98,75,39,1,14,709,462,294,236,618,134,75,92,414,63,17,58,16,2,50,37,48,97,66,61,43,"LL Medical Care (Agarwal & Agrwal Practice)","WF","WF-5","South Leytonstone"]
["WF_LDP",43922,43923,"F86626",6022,240,4094,6,76,13,11,2,56,88,178,116,1186,183,139,77,235,57,3413,367,1395,4808,51,40,12,1,6,483,291,156,127,443,73,38,48,250,21,6,20,6,0,16,13,5,57,26,23,19,"Dr Shantir Practice","WF","WF-1","Chingford/ Walthamstow"]
["WF_LDP",43922,43923,"F86666",14758,758,10074,34,332,86,68,21,214,394,662,468,4725,569,551,261,604,154,7654,927,3190,11927,229,144,80,0,18,1727,835,541,477,1393,200,120,149,864,116,33,97,48,0,78,86,23,137,107,86,50,"The Harrow Road Surgery","WF","WF-5","South Leytonstone"]
["WF_LDP",43922,43923,"F86621",5974,298,4308,43,181,16,10,0,145,199,73,60,756,276,241,70,239,41,3748,370,1556,5061,74,57,17,0,13,611,442,292,221,559,100,72,84,309,33,3,31,13,1,28,30,24,87,53,50,41,"Green Man Medical Centre","WF","WF-5","South Leytonstone"]
["WF_LDP",43922,43923,"F86650",8181,454,5568,10,173,27,10,6,113,198,258,150,1622,353,275,111,331,71,4582,509,1856,6622,113,90,29,0,19,719,371,275,241,618,121,60,68,488,62,16,58,15,0,47,38,27,101,70,63,42,"Lime Tree Surgery","WF","WF-4","Forest Integrated Health"]
["WF_LDP",43922,43923,"F86664",8433,329,5389,20,171,29,26,7,149,210,215,102,1845,316,213,152,313,82,4515,413,1741,6673,104,70,35,1,13,907,524,265,174,649,182,73,87,413,106,20,94,28,0,73,78,16,123,88,72,63,"Larkshall Medical Centre","WF","WF-1","Chingford/ Walthamstow"]
["WF_LDP",43922,43923,"F86627",13615,767,8846,13,601,42,35,9,365,686,686,465,3218,520,482,279,701,167,7837,977,3064,11152,222,147,74,2,24,1860,1026,458,435,1713,400,234,273,813,231,40,204,74,6,153,163,61,294,236,197,126,"Churchill Medical Centre","WF","WF-2","Chingford E4"]
["WF_LDP",43922,43923,"F86644",10412,503,6756,26,260,107,72,18,193,291,376,249,2379,373,308,166,332,88,5496,538,1799,8168,141,119,50,0,24,1207,729,333,292,1038,205,101,125,549,110,18,103,38,2,76,79,26,148,69,62,45,"Waltham Forest Community & Family Health Services Ltd","WF","WF-6","Central Walthamstow"]
["WF_LDP",43952,43970,"F86038",12646,718,7885,10,219,31,27,10,153,251,465,288,2403,584,465,210,442,105,6083,465,1925,9752,151,101,31,0,14,1169,691,529,369,971,246,136,166,808,48,6,45,10,0,33,24,15,164,113,98,73,"Sma Medical Centre","WF","WF-3","Leyton Collaborative"]
["WF_LDP",43952,43970,"F86044",9629,339,6870,8,140,27,25,10,82,174,293,180,1545,266,254,107,237,79,5140,661,1399,7953,112,79,31,0,10,771,374,259,203,598,81,36,41,385,32,8,27,15,1,21,19,7,46,59,44,26," Crawley Road Medical Centre","WF","WF-4","Forest Integrated Health"]
["WF_LDP",43952,43970,"F86030",8337,504,5459,27,205,9,5,1,156,223,378,280,3930,441,401,88,208,30,4422,271,1081,6568,46,25,9,1,7,731,517,435,319,665,169,130,140,542,41,5,40,11,0,34,30,13,123,57,57,43," Queens Road Medical Centre","WF","WF-7","Walthamstow West"]
["WF_LDP",43952,43970,"F86036",15812,718,11030,9,330,70,14,23,244,376,513,366,3688,625,511,233,599,138,9324,853,3325,12756,236,143,55,0,34,1487,973,553,449,1306,234,135,155,812,118,26,109,47,0,86,95,41,163,119,103,75,"The Allum Medical Centre","WF","WF-4","Forest Integrated Health"]
["WF_LDP",43952,43970,"F86045",1988,131,1410,5,63,19,11,2,34,66,87,59,685,119,105,57,125,27,1154,122,590,1690,34,28,8,0,7,277,184,106,88,244,60,39,49,137,24,3,24,3,0,21,18,6,46,26,24,14,"High Road Surgery","WF","WF-5","South Leytonstone"]
["WF_LDP",43952,43970,"F86696",6090,325,4181,3,164,32,4,5,118,183,195,138,1476,264,229,78,175,41,3310,326,1149,4984,49,33,13,0,5,565,361,248,182,505,97,71,76,330,25,4,24,6,0,16,14,10,65,41,36,23,"Francis Road Medical Centre","WF","WF-4","Forest Integrated Health"]
["WF_LDP",43952,43970,"F86700",3907,208,2514,11,237,14,13,4,174,292,162,81,624,195,148,62,153,28,2025,184,751,3164,47,35,12,1,6,794,456,170,142,672,131,71,80,227,123,16,115,48,3,100,91,67,75,85,71,48,"Kings Head Medical Practice","WF","WF-1","Chingford/ Walthamstow"]
["WF_LDP",43952,43970,"F86701",3529,213,2461,9,116,27,19,4,98,134,164,122,1274,185,163,73,179,34,1884,234,1038,2890,67,49,28,0,9,434,287,191,134,385,60,38,47,228,22,7,20,7,0,17,20,7,39,32,29,21,"Kiyani Medical Practice","WF","WF-5","South Leytonstone"]
["WF_LDP",43952,43970,"F86664",8408,300,5364,19,153,20,17,3,134,203,210,81,1824,289,189,131,272,73,4483,364,1518,6653,99,59,32,1,9,891,445,257,156,597,177,63,76,406,106,19,89,26,0,73,76,17,105,87,70,61,"Larkshall Medical Centre","WF","WF-1","Chingford/ Walthamstow"]
["WF_LDP",43952,43970,"F86666",14769,744,10073,23,325,85,67,21,211,387,652,445,4670,564,535,256,592,154,7609,898,3105,11938,225,139,80,0,18,1721,894,536,463,1360,198,114,142,861,117,34,96,48,0,78,86,23,112,106,83,49,"The Harrow Road Surgery","WF","WF-5","South Leytonstone"]
["WF_LDP",43952,43970,"F86679",6103,232,3886,22,90,15,11,3,76,101,128,100,1121,203,156,95,228,51,3275,398,1492,4602,34,29,10,0,5,480,331,178,135,427,50,31,36,240,35,9,31,11,0,22,16,9,40,36,32,27,"Higham Hill Medical Centre","WF","WF-7","Walthamstow West"]
["WF_LDP",43952,43970,"Y01291",8849,405,5694,29,405,18,11,3,288,522,359,183,2342,363,313,161,376,83,5223,509,2053,7058,84,68,30,0,12,1194,651,320,241,977,197,103,118,450,121,27,94,31,0,92,80,73,106,115,100,74,"Chingford Medical Practice","WF","WF-2","Chingford E4"]
["WF_LDP",43952,43970,"Y01839",6443,327,4274,17,148,18,13,1,118,175,183,104,1300,284,207,98,215,82,3588,387,1068,5131,89,61,21,0,12,730,389,234,184,546,114,52,67,395,84,6,75,35,1,66,68,9,63,53,48,40,"Lime Tree & Sinnott Healthcare Ltd","WF","WF-1","Chingford/ Walthamstow"]
["WF_LDP",43952,43970,"Total",266115,13056,177851,582,6616,949,549,176,4690,7769,8820,5506,65267,10606,8833,4032,9850,2356,144394,14380,53649,213080,3131,2151,914,17,425,28547,16342,9591,7485,23919,4770,2582,3058,14424,2366,441,2041,729,32,1702,1641,791,3009,2426,2104,1507]
["WF_LDP",43952,43970,"F86705",3376,180,2386,17,70,7,5,1,44,83,121,71,1220,128,108,52,137,33,1883,200,903,2808,26,14,3,0,5,318,155,155,97,246,59,33,39,199,27,3,14,4,0,25,16,12,39,23,19,11,"The Langthorne Sharma Family Practice","WF","WF-5","South Leytonstone"]
["WF_LDP",43952,43970,"F86708",2823,161,1756,13,70,5,3,1,43,85,120,62,861,125,97,50,116,35,1507,116,558,2234,30,18,6,0,4,365,209,106,73,300,61,37,41,189,14,1,10,3,0,11,9,7,43,32,26,13,"Claremont Medical Centre","WF","WF-6","Central Walthamstow"]
["WF_LDP",43952,43970,"F86712",3329,189,2401,2,80,3,2,0,60,86,31,14,566,159,145,54,124,23,1907,148,712,2828,20,15,5,0,4,341,194,151,115,306,49,28,33,197,9,4,8,2,0,7,8,2,34,14,13,9,"Hampton Medical Centre","WF","WF-4","Forest Integrated Health"]
["WF_LDP",43952,43970,"F86650",8194,440,5577,7,169,24,10,6,113,198,257,134,1623,344,253,103,316,68,4519,477,1736,6637,110,85,27,0,18,723,400,274,226,595,122,54,61,489,62,16,57,15,0,47,38,27,83,71,62,42,"Lime Tree Surgery","WF","WF-4","Forest Integrated Health"]
["WF_LDP",43952,43970,"F86086",6385,266,4025,10,91,6,5,1,74,109,124,67,834,225,139,108,275,76,3350,426,1448,4832,83,60,29,0,13,498,277,173,137,402,93,35,45,297,34,5,30,9,0,22,20,6,62,37,33,21,"Dr Dhital Practice","WF","WF-6","Central Walthamstow"]
["WF_LDP",43952,43970,"F86088",4858,314,3428,10,159,11,4,1,121,183,119,80,903,246,221,82,189,44,2567,205,985,4105,47,32,9,0,5,665,376,212,183,542,102,60,71,357,39,9,33,8,0,28,32,19,65,39,33,24,"The Lyndhurst Surgery","WF","WF-4","Forest Integrated Health"]
["WF_LDP",43952,43970,"F86607",14097,614,9316,114,265,71,42,9,190,306,483,307,4675,459,401,201,551,106,7822,778,3269,10842,182,158,61,4,31,1230,734,432,312,1089,198,103,127,641,89,14,85,43,9,68,68,49,124,107,96,76,"Addison Road Medical Practice","WF","WF-6","Central Walthamstow"]
["WF_LDP",43952,43970,"F86058",15555,703,10241,9,329,100,12,10,254,382,478,319,4055,575,492,228,621,164,7761,788,3317,12125,196,119,64,0,23,1475,887,469,383,1200,225,126,148,744,102,18,86,38,0,67,82,31,157,120,109,91,"St James Medical Practice Ltd","WF","WF-7","Walthamstow West"]
["WF_LDP",43952,43970,"F86062",7326,396,5080,9,140,12,9,2,99,174,272,167,1594,296,257,123,363,66,4399,539,2177,6024,97,72,26,2,18,843,453,294,211,695,150,91,105,449,71,19,65,18,3,46,48,27,100,67,60,41,"Grove Surgery","WF","WF-7","Walthamstow West"]
["WF_LDP",43952,43970,"F86078",7140,320,4860,7,119,6,0,0,73,142,382,195,1936,243,191,103,256,46,4025,280,1254,6040,58,31,12,0,6,1153,591,230,169,926,185,82,92,352,89,8,67,17,1,63,58,11,90,108,84,56,"The Ridgeway Surgery","WF","WF-2","Chingford E4"]
["WF_LDP",43952,43970,"F86626",6018,238,4090,4,75,13,11,2,54,88,172,109,1179,182,132,76,228,56,3368,351,1335,4801,48,37,12,1,6,487,277,155,123,436,73,35,45,249,23,6,22,6,0,17,13,5,48,25,22,17,"Dr Shantir Practice","WF","WF-1","Chingford/ Walthamstow"]
["WF_LDP",43952,43970,"F86627",13556,745,8778,11,579,39,32,9,353,673,655,432,3193,507,456,266,665,157,7576,894,2891,11101,206,124,65,1,22,1837,965,451,418,1648,397,219,261,799,231,39,202,76,7,150,161,65,227,228,190,121,"Churchill Medical Centre","WF","WF-2","Chingford E4"]
["WF_LDP",43952,43970,"F86644",10296,478,6673,24,251,100,67,17,187,289,364,226,2338,351,292,157,304,80,5315,486,1674,8075,131,107,47,0,22,1191,619,330,278,987,203,95,118,537,108,18,87,27,0,75,77,26,112,64,54,39,"Waltham Forest Community & Family Health Services Ltd","WF","WF-6","Central Walthamstow"]
["WF_LDP",43952,43970,"F86616",7274,295,4737,15,264,18,6,2,205,296,300,159,2066,266,208,141,337,66,3720,335,1763,5654,56,35,19,1,8,809,478,221,189,738,175,103,115,311,68,15,40,13,0,53,47,12,116,79,75,56,"Old Church Surgery","WF","WF-2","Chingford E4"]
["WF_LDP",43952,43970,"F86621",5946,294,4275,29,174,14,9,0,140,198,71,56,764,272,233,69,232,40,3645,361,1460,5036,73,54,16,0,13,610,413,290,212,548,100,72,82,307,34,3,31,14,1,28,30,24,73,54,49,40,"Green Man Medical Centre","WF","WF-5","South Leytonstone"]
["WF_LDP",43952,43970,"F86625",6139,371,4090,47,183,9,5,4,130,220,156,107,1139,328,287,107,200,56,3013,286,995,4978,97,65,34,0,12,704,430,293,226,587,133,69,87,412,64,17,58,18,1,50,37,47,88,65,59,42,"LL Medical Care (Agarwal & Agrwal Practice)","WF","WF-5","South Leytonstone"]
["WF_LDP",43952,43970,"F86001",7962,431,5400,14,232,34,23,6,142,298,191,95,2371,343,249,105,242,69,4191,373,1328,6467,105,71,25,0,25,935,512,275,218,745,167,74,93,494,102,16,91,23,0,60,61,14,110,76,68,50," The Firs","WF","WF-6","Central Walthamstow"]
["WF_LDP",43952,43970,"F86689",4295,121,2964,6,91,3,3,0,66,96,53,36,710,86,75,34,88,31,2469,176,734,3301,30,17,5,0,7,298,167,102,74,268,54,34,41,122,37,2,28,9,1,27,22,17,30,21,20,9,"The Bailey Practice","WF","WF-1","Chingford/ Walthamstow"]
["WF_LDP",43952,43970,"F86005",8769,305,5873,5,299,5,3,1,210,344,186,134,2747,251,213,111,312,61,4722,506,1863,6818,61,38,19,2,7,817,524,213,203,699,92,57,68,323,115,15,100,35,2,95,83,37,63,59,49,37," The Penryhn Surgery","WF","WF-1","Chingford/ Walthamstow"]
["WF_LDP",43952,43970,"F86011",9839,663,6512,19,219,77,56,14,151,254,388,242,2336,540,432,127,297,91,5462,575,1709,8099,149,123,61,3,21,1186,639,509,354,961,221,101,122,722,98,21,89,30,1,67,69,25,135,150,135,103,"The Manor Practice","WF","WF-3","Leyton Collaborative"]
["WF_LDP",43952,43970,"F86006",6428,368,4288,18,162,7,5,0,95,178,108,67,1275,298,276,86,196,63,3653,408,1044,5136,53,27,9,0,7,818,489,240,219,748,97,55,71,413,54,22,49,23,1,37,25,31,63,58,53,35,"Seymour Medical Centre","WF","WF-7","Walthamstow West"]
["WF_LDP",43983,43984,"F86689",4305,119,2972,6,89,3,3,0,64,95,53,31,702,85,70,33,79,29,2459,169,686,3303,30,18,5,0,8,297,164,102,71,259,54,33,40,122,37,2,26,9,1,27,22,17,30,21,19,9,"The Bailey Practice","WF","WF-1","Chingford/ Walthamstow"]
["WF_LDP",43983,43984,"F86701",3543,213,2471,7,111,26,18,3,93,134,164,114,1286,183,157,72,174,34,1881,229,1012,2900,69,46,27,0,8,437,281,191,127,380,60,34,42,230,22,7,22,9,0,17,20,7,38,32,27,19,"Kiyani Medical Practice","WF","WF-5","South Leytonstone"]
["WF_LDP",43983,43984,"F86700",3926,202,2524,9,214,12,11,3,160,291,161,71,625,188,141,57,141,26,2011,181,708,3186,47,33,12,1,4,793,422,169,134,617,131,63,71,227,123,16,115,46,2,100,91,69,69,84,67,48,"Kings Head Medical Practice","WF","WF-1","Chingford/ Walthamstow"]
["WF_LDP",43983,43984,"F86679",6084,222,3885,21,84,15,11,3,72,101,128,90,1114,189,147,88,207,45,3214,384,1364,4591,34,31,11,0,1,480,309,178,131,408,50,30,35,240,35,9,31,12,0,22,16,9,38,37,30,25,"Higham Hill Medical Centre","WF","WF-7","Walthamstow West"]
["WF_LDP",43983,43984,"F86650",8217,431,5599,4,162,23,9,6,108,198,257,126,1618,336,245,98,304,63,4478,455,1639,6649,110,84,25,0,18,722,388,274,214,578,121,54,61,489,62,16,55,13,0,47,38,27,79,71,60,42,"Lime Tree Surgery","WF","WF-4","Forest Integrated Health"]
["WF_LDP",43983,43984,"F86644",10277,461,6673,16,238,82,41,12,175,286,359,212,2339,339,275,145,288,75,5181,432,1549,8065,132,90,41,0,18,1187,584,330,271,939,202,96,116,538,107,18,77,24,0,74,76,26,107,64,51,37,"Waltham Forest Community & Family Health Services Ltd","WF","WF-6","Central Walthamstow"]
["WF_LDP",43983,43984,"F86666",14793,734,10096,20,317,86,69,20,202,387,652,416,4626,552,508,245,566,150,7572,861,2987,11952,228,140,80,0,18,1724,879,536,446,1334,199,107,136,862,118,35,95,48,0,78,86,23,110,106,82,48,"The Harrow Road Surgery","WF","WF-5","South Leytonstone"]
["WF_LDP",43983,43984,"F86664",8432,281,5366,8,138,16,14,2,120,204,209,72,1809,269,170,118,243,68,4435,336,1394,6672,99,56,30,1,10,891,415,256,139,554,177,54,66,406,105,19,82,25,0,73,76,17,99,91,71,61,"Larkshall Medical Centre","WF","WF-1","Chingford/ Walthamstow"]
["WF_LDP",43983,43984,"F86005",8785,300,5894,6,288,5,3,1,211,343,186,127,2745,246,209,106,287,56,4683,485,1738,6836,60,38,19,2,7,818,496,215,203,665,92,56,66,328,114,15,100,35,2,95,83,38,60,59,43,32," The Penryhn Surgery","WF","WF-1","Chingford/ Walthamstow"]
["WF_LDP",43983,43984,"Total",266336,12666,178109,558,6367,865,494,155,4490,7799,8800,4988,64934,10209,8198,3808,9259,2211,142584,13553,50444,213248,3140,2043,856,18,396,28537,15628,9576,7046,22957,4767,2420,2865,14438,2368,443,2007,704,32,1704,1643,807,2891,2431,2023,1454]
["WF_LDP",43983,43984,"F86696",6105,316,4193,4,155,32,4,5,109,178,195,133,1471,255,233,75,164,35,3299,301,1065,4993,50,33,13,0,6,563,337,248,174,481,96,67,72,331,25,4,24,4,0,16,14,10,64,41,35,22,"Francis Road Medical Centre","WF","WF-4","Forest Integrated Health"]
["WF_LDP",43983,43984,"F86001",7967,419,5408,10,225,32,21,6,141,296,189,85,2344,335,228,103,225,63,4182,357,1299,6473,105,67,22,0,25,933,503,276,203,726,168,69,88,494,102,17,90,22,0,60,61,14,111,76,67,49," The Firs","WF","WF-6","Central Walthamstow"]
["WF_LDP",43983,43984,"Y01839",6452,307,4279,17,141,15,11,0,111,175,184,88,1284,265,189,95,205,78,3545,374,1020,5133,89,60,20,0,12,731,367,234,166,522,114,53,63,394,84,6,76,34,1,66,68,9,62,54,48,40,"Lime Tree & Sinnott Healthcare Ltd","WF","WF-1","Chingford/ Walthamstow"]
["WF_LDP",43983,43984,"F86708",2818,158,1754,10,70,5,3,1,44,86,120,58,845,122,93,50,105,32,1502,110,525,2231,30,18,6,0,4,365,200,106,69,289,62,36,41,189,14,1,10,3,0,11,9,7,44,32,24,12,"Claremont Medical Centre","WF","WF-6","Central Walthamstow"]
["WF_LDP",43983,43984,"F86705",3390,177,2399,16,67,6,5,1,42,81,120,69,1220,126,105,52,136,32,1887,190,892,2819,26,14,3,0,5,319,151,154,94,242,59,32,38,198,27,3,13,4,0,25,16,12,37,22,18,10,"The Langthorne Sharma Family Practice","WF","WF-5","South Leytonstone"]
["WF_LDP",43983,43984,"Y01291",8897,396,5722,24,393,17,11,3,275,526,363,176,2342,356,309,154,367,79,5192,493,1984,7099,88,66,28,0,12,1207,621,324,244,942,198,103,118,456,123,28,96,31,0,95,81,76,104,122,99,74,"Chingford Medical Practice","WF","WF-2","Chingford E4"]
["WF_LDP",43983,43984,"F86712",3334,188,2409,0,76,3,2,0,57,86,30,15,563,159,145,54,118,21,1885,138,672,2834,20,15,5,0,4,343,189,151,112,298,50,27,32,198,9,4,8,2,0,7,8,2,35,15,13,9,"Hampton Medical Centre","WF","WF-4","Forest Integrated Health"]
["WF_LDP",43983,43984,"F86058",15562,682,10250,9,316,67,11,4,239,382,478,278,4054,549,434,209,568,150,7525,699,3039,12132,197,99,51,0,18,1480,840,469,348,1144,227,113,134,744,102,18,77,35,0,67,81,31,144,121,102,86,"St James Medical Practice Ltd","WF","WF-7","Walthamstow West"]
["WF_LDP",43983,43984,"F86045",1993,127,1412,5,63,17,9,2,34,68,88,57,682,115,99,52,115,23,1134,113,553,1691,33,26,6,0,7,278,181,105,82,241,60,38,48,136,24,3,23,3,0,21,18,6,46,26,24,15,"High Road Surgery","WF","WF-5","South Leytonstone"]
["WF_LDP",43983,43984,"F86078",7136,302,4847,7,116,6,0,0,72,141,373,167,1920,225,172,95,241,42,4032,277,1199,6029,54,30,12,0,5,1142,566,226,161,880,187,79,87,351,86,7,68,18,1,61,57,11,90,107,84,60,"The Ridgeway Surgery","WF","WF-2","Chingford E4"]
["WF_LDP",43983,43984,"F86062",7294,381,5062,9,127,11,8,2,91,172,271,144,1576,285,226,106,319,61,4257,482,1902,5996,99,70,24,2,16,835,428,293,186,648,149,82,93,449,71,20,65,18,3,45,48,28,95,66,54,37,"Grove Surgery","WF","WF-7","Walthamstow West"]
["WF_LDP",43983,43984,"F86044",9649,329,6899,82,161,26,24,9,90,225,291,164,1534,254,230,103,234,74,5049,618,1332,7965,111,76,31,0,8,765,344,257,189,565,81,37,40,382,32,8,31,9,2,21,20,12,45,59,43,25," Crawley Road Medical Centre","WF","WF-4","Forest Integrated Health"]
["WF_LDP",43983,43984,"F86030",8331,475,5467,19,194,7,3,0,146,223,377,220,3924,404,332,81,188,28,4403,262,980,6570,46,23,9,1,5,729,483,437,275,628,168,110,118,549,41,5,38,10,0,34,30,13,114,57,55,43," Queens Road Medical Centre","WF","WF-7","Walthamstow West"]
["WF_LDP",43983,43984,"F86011",9844,646,6522,15,211,78,56,14,141,252,384,218,2311,523,398,122,282,86,5419,553,1632,8112,150,120,59,3,21,1186,613,505,330,928,223,94,113,718,97,21,88,29,1,66,68,25,128,148,128,94,"The Manor Practice","WF","WF-3","Leyton Collaborative"]
["WF_LDP",43983,43984,"F86038",12635,691,7884,8,210,28,24,10,146,248,463,266,2392,567,441,203,420,97,6007,431,1818,9735,151,94,27,0,14,1167,667,526,348,935,241,124,152,804,49,6,47,11,0,33,24,15,154,112,93,69,"Sma Medical Centre","WF","WF-3","Leyton Collaborative"]
["WF_LDP",43983,43984,"F86036",15799,663,11039,7,312,70,13,23,233,376,516,322,3666,570,447,216,554,127,9129,785,3049,12751,235,128,46,0,31,1483,911,547,410,1231,230,118,138,807,119,26,105,45,0,86,95,41,154,118,95,69,"The Allum Medical Centre","WF","WF-4","Forest Integrated Health"]
["WF_LDP",43983,43984,"F86626",6045,238,4110,3,73,12,11,2,54,88,171,98,1174,182,119,73,221,56,3337,334,1269,4821,48,37,12,1,6,490,263,155,113,417,73,30,40,251,23,6,22,5,0,18,14,5,47,25,21,17,"Dr Shantir Practice","WF","WF-1","Chingford/ Walthamstow"]
["WF_LDP",43983,43984,"F86625",6146,362,4092,45,179,10,5,4,123,221,156,104,1131,302,272,102,186,48,2982,264,955,4984,97,63,34,0,10,703,403,293,218,560,133,61,78,413,64,17,59,17,1,50,37,47,78,65,57,40,"LL Medical Care (Agarwal & Agrwal Practice)","WF","WF-5","South Leytonstone"]
["WF_LDP",43983,43984,"F86006",6431,364,4287,17,163,7,5,0,96,179,109,64,1272,297,268,79,188,61,3632,392,975,5140,53,28,10,0,7,822,483,242,212,740,98,53,68,417,55,22,50,22,1,38,25,33,63,60,53,35,"Seymour Medical Centre","WF","WF-7","Walthamstow West"]
["WF_LDP",43983,43984,"F86627",13566,735,8780,10,558,39,30,9,337,671,655,400,3195,498,429,250,625,156,7415,844,2763,11107,209,121,63,2,21,1839,954,449,400,1608,400,215,253,797,232,39,200,76,8,151,162,68,221,228,186,119,"Churchill Medical Centre","WF","WF-2","Chingford E4"]
["WF_LDP",43983,43984,"F86621",5950,287,4291,10,173,11,7,0,139,198,71,51,757,264,219,66,214,36,3616,348,1372,5039,73,53,15,0,13,608,401,290,198,537,99,70,80,308,34,3,31,14,1,28,30,24,71,54,48,39,"Green Man Medical Centre","WF","WF-5","South Leytonstone"]
["WF_LDP",43983,43984,"F86086",6406,260,4040,10,87,6,5,1,71,109,124,63,825,219,132,102,265,73,3287,391,1362,4850,83,52,23,0,13,500,266,174,128,388,93,31,41,298,34,5,29,9,0,22,20,6,59,37,33,21,"Dr Dhital Practice","WF","WF-6","Central Walthamstow"]
["WF_LDP",43983,43984,"F86607",14101,606,9318,102,262,66,38,6,190,306,485,280,4637,452,373,193,528,102,7755,747,3109,10844,181,150,58,4,30,1228,717,431,299,1067,199,101,126,642,90,14,81,40,8,68,69,49,121,106,94,72,"Addison Road Medical Practice","WF","WF-6","Central Walthamstow"]
["WF_LDP",43983,43984,"F86088",4846,299,3424,9,146,8,3,1,108,183,118,69,891,233,192,74,181,42,2522,192,915,4097,47,29,9,0,3,667,348,211,163,505,102,55,64,356,38,8,31,8,0,27,31,18,61,39,29,21,"The Lyndhurst Surgery","WF","WF-4","Forest Integrated Health"]
["WF_LDP",43983,43984,"F86616",7277,295,4741,13,248,18,6,2,196,290,300,140,2060,265,191,137,321,63,3677,326,1686,5649,56,35,20,1,8,805,454,222,188,701,171,95,107,314,70,15,42,14,0,55,49,12,113,76,70,55,"Old Church Surgery","WF","WF-2","Chingford E4"]
["WF_LDP",44013,44014,"F86086",6340,250,4000,3,84,6,5,1,72,111,124,61,821,213,125,93,249,68,3183,355,1255,4791,84,61,22,0,6,500,256,174,117,370,90,27,36,298,34,5,28,9,0,22,20,6,55,38,31,22,"Dr Dhital Practice","WF","WF-6","Central Walthamstow"]
["WF_LDP",44013,44014,"F86062",7290,367,5063,6,121,11,7,2,89,168,269,134,1563,275,202,97,288,55,4216,455,1738,5989,98,83,24,3,10,831,408,291,168,617,147,73,83,446,71,20,61,16,2,45,49,28,90,66,51,38,"Grove Surgery","WF","WF-7","Walthamstow West"]
["WF_LDP",44013,44014,"F86058",15571,651,10257,8,309,60,12,3,235,381,472,246,4022,524,391,206,564,151,7515,682,2911,12134,195,146,46,0,7,1478,814,464,336,1116,229,106,125,750,105,18,81,32,0,69,83,31,139,122,100,82,"St James Medical Practice Ltd","WF","WF-7","Walthamstow West"]
["WF_LDP",44013,44014,"F86621",5936,280,4285,26,185,9,6,0,151,214,71,48,753,258,201,59,203,37,3554,331,1286,5025,73,65,15,0,7,604,385,288,190,514,100,69,77,308,34,3,29,13,1,28,30,24,70,53,49,41,"Green Man Medical Centre","WF","WF-5","South Leytonstone"]
["WF_LDP",44013,44014,"F86088",4840,277,3418,11,137,7,3,1,102,184,118,61,895,212,172,66,165,40,2486,178,835,4096,47,37,8,0,1,668,307,210,152,457,102,51,61,357,38,8,30,8,0,27,31,18,50,38,25,17,"The Lyndhurst Surgery","WF","WF-4","Forest Integrated Health"]
["WF_LDP",44013,44014,"F86607",14019,588,9261,96,247,65,37,8,184,306,484,262,4609,439,364,190,512,100,7720,741,2996,10783,179,155,58,4,16,1224,721,431,298,1035,200,94,120,642,91,14,83,41,8,69,70,51,117,104,90,70,"Addison Road Medical Practice","WF","WF-6","Central Walthamstow"]
["WF_LDP",44013,44014,"F86078",7119,293,4839,8,110,5,0,0,67,141,367,154,1909,218,165,93,231,43,4005,270,1172,6024,54,41,13,0,0,1135,547,225,159,845,184,72,78,345,87,7,66,17,1,62,58,13,84,103,80,60,"The Ridgeway Surgery","WF","WF-2","Chingford E4"]
["WF_LDP",44013,44014,"F86616",7314,292,4760,12,238,16,5,1,191,290,299,133,2050,262,183,130,315,61,3652,309,1671,5687,58,42,18,1,2,805,433,222,188,676,176,83,95,317,72,14,42,14,0,55,55,11,113,78,73,59,"Old Church Surgery","WF","WF-2","Chingford E4"]
["WF_LDP",44013,44014,"F86045",1995,117,1415,4,61,18,8,2,32,68,88,53,681,104,87,51,110,22,1116,109,513,1694,34,30,6,0,3,277,173,103,76,234,61,38,46,136,24,3,22,3,0,21,18,6,43,26,24,16,"High Road Surgery","WF","WF-5","South Leytonstone"]
["WF_LDP",44013,44014,"F86006",6437,354,4290,16,162,7,4,0,92,179,107,60,1256,290,264,77,180,59,3555,362,906,5155,55,45,11,0,4,825,461,242,205,728,100,55,69,417,56,22,50,23,1,38,25,33,60,61,53,34,"Seymour Medical Centre","WF","WF-7","Walthamstow West"]
["WF_LDP",44013,44014,"F86005",8811,290,5910,14,292,5,3,1,218,367,187,121,2734,235,192,105,271,52,4615,455,1622,6849,60,49,18,2,3,816,470,215,192,639,93,52,63,328,117,15,103,36,2,95,84,40,59,60,42,31," The Penryhn Surgery","WF","WF-1","Chingford/ Walthamstow"]
["WF_LDP",44013,44014,"F86696",6116,304,4203,4,130,32,4,5,96,156,194,119,1468,241,213,70,164,32,3284,283,1019,4996,52,43,14,0,1,563,333,247,168,470,96,60,65,332,26,4,26,8,0,15,15,12,60,41,33,21,"Francis Road Medical Centre","WF","WF-4","Forest Integrated Health"]
["WF_LDP",44013,44014,"F86011",9853,612,6538,11,199,77,55,16,130,253,383,194,2296,485,349,115,265,81,5374,528,1553,8120,152,146,58,3,17,1181,579,502,299,878,224,82,99,716,97,21,85,27,2,66,70,26,121,145,119,86,"The Manor Practice","WF","WF-3","Leyton Collaborative"]
["WF_LDP",44013,44014,"F86038",12581,671,7860,9,203,30,25,11,141,247,463,251,2387,553,430,198,403,98,5950,412,1753,9701,152,131,27,0,9,1171,661,525,339,919,243,121,147,803,48,6,43,12,0,32,24,15,151,113,89,69,"Sma Medical Centre","WF","WF-3","Leyton Collaborative"]
["WF_LDP",44013,44014,"F86044",9687,305,6932,96,161,23,21,8,91,240,289,152,1524,232,220,90,226,75,4977,581,1266,7989,110,90,28,0,3,761,308,254,177,503,82,33,36,383,31,8,30,10,3,20,22,12,39,58,39,22," Crawley Road Medical Centre","WF","WF-4","Forest Integrated Health"]
["WF_LDP",44013,44014,"F86001",7968,406,5411,19,244,32,19,6,151,339,190,86,2339,328,224,98,209,60,4147,340,1252,6473,106,84,21,0,10,932,487,275,202,698,170,67,88,493,101,17,87,21,0,59,60,14,109,75,63,46," The Firs","WF","WF-6","Central Walthamstow"]
["WF_LDP",44013,44014,"F86036",15783,625,11031,5,297,67,13,24,221,374,515,291,3649,531,413,194,518,119,8984,731,2833,12743,232,176,42,0,12,1481,850,546,390,1160,232,112,133,807,118,26,104,37,1,85,95,46,148,118,91,65,"The Allum Medical Centre","WF","WF-4","Forest Integrated Health"]
["WF_LDP",44013,44014,"F86705",3392,172,2404,13,67,5,4,1,44,80,119,64,1225,123,99,51,131,31,1880,189,872,2824,27,17,3,0,1,322,147,153,90,238,59,32,39,198,27,3,13,4,0,25,16,12,36,23,19,11,"The Langthorne Sharma Family Practice","WF","WF-5","South Leytonstone"]
["WF_LDP",44013,44014,"F86708",2813,154,1755,6,71,5,3,1,46,87,119,55,826,120,90,47,100,30,1493,102,491,2230,30,27,6,0,1,366,199,106,67,285,62,36,40,188,15,1,11,3,0,11,9,7,45,32,24,12,"Claremont Medical Centre","WF","WF-6","Central Walthamstow"]
["WF_LDP",44013,44014,"F86700",3925,200,2522,9,203,12,11,3,150,286,160,61,621,187,136,53,133,22,1987,158,686,3180,47,38,11,1,1,788,399,167,131,582,131,61,67,225,121,15,101,38,1,99,89,72,76,82,65,48,"Kings Head Medical Practice","WF","WF-1","Chingford/ Walthamstow"]
["WF_LDP",44013,44014,"F86701",3543,210,2469,5,109,28,20,4,89,134,163,109,1293,174,156,74,173,34,1874,220,989,2899,68,49,27,0,1,440,270,190,129,376,60,32,36,231,22,7,22,9,0,17,20,7,36,33,28,19,"Kiyani Medical Practice","WF","WF-5","South Leytonstone"]
["WF_LDP",44013,44014,"Y01839",6449,292,4277,15,134,13,9,0,103,172,183,83,1269,250,180,91,196,77,3486,352,967,5124,89,70,19,0,4,729,352,233,159,499,113,49,59,393,84,6,79,37,1,67,68,9,63,53,45,38,"Lime Tree & Sinnott Healthcare Ltd","WF","WF-1","Chingford/ Walthamstow"]
["WF_LDP",44013,44014,"Total",266328,12231,178171,593,6228,837,469,162,4406,7927,8773,4668,64632,9810,7821,3614,8861,2152,140957,12817,48068,213268,3148,2571,829,19,184,28515,15067,9546,6813,22086,4784,2310,2732,14457,2381,441,1986,686,32,1704,1662,841,2802,2436,1961,1415]
["WF_LDP",44013,44014,"F86712",3339,183,2413,0,75,6,5,2,55,85,32,19,563,150,147,50,109,21,1863,125,634,2840,20,18,5,0,4,342,186,151,111,291,50,26,31,198,10,4,8,2,0,8,9,2,31,15,13,8,"Hampton Medical Centre","WF","WF-4","Forest Integrated Health"]
["WF_LDP",44013,44014,"Y01291",8902,393,5716,20,377,18,11,4,265,519,359,167,2326,356,308,140,345,78,5039,449,1869,7100,87,72,27,0,3,1203,606,320,247,919,199,99,114,457,124,29,105,32,0,96,82,90,103,121,96,71,"Chingford Medical Practice","WF","WF-2","Chingford E4"]
["WF_LDP",44013,44014,"F86689",4328,118,2986,7,88,3,3,0,62,105,52,25,695,82,71,32,76,26,2441,158,666,3318,31,24,3,0,5,301,162,103,71,249,55,33,39,124,40,1,26,7,0,28,24,17,30,22,19,10,"The Bailey Practice","WF","WF-1","Chingford/ Walthamstow"]
["WF_LDP",44013,44014,"F86627",13563,729,8790,12,541,38,28,9,332,671,661,395,3208,501,419,234,614,156,7304,793,2727,11107,209,160,65,2,9,1839,944,451,398,1562,399,216,254,801,233,39,201,73,8,151,163,70,224,229,182,115,"Churchill Medical Centre","WF","WF-2","Chingford E4"]
["WF_LDP",44013,44014,"F86644",10322,452,6693,14,235,73,31,10,174,288,358,210,2345,339,268,139,280,78,5102,404,1499,8099,134,102,37,0,7,1189,571,330,266,909,204,94,115,542,108,18,78,25,0,74,76,27,105,68,54,40,"Waltham Forest Community & Family Health Services Ltd","WF","WF-6","Central Walthamstow"]
["WF_LDP",44013,44014,"F86625",6151,359,4093,41,173,11,5,5,118,220,158,94,1140,273,258,105,182,52,2957,245,976,4990,96,85,34,0,4,705,358,293,212,535,134,57,73,415,64,17,59,18,1,50,37,47,74,70,57,40,"LL Medical Care (Agarwal & Agrwal Practice)","WF","WF-5","South Leytonstone"]
["WF_LDP",44013,44014,"F86626",6084,236,4146,19,87,11,10,2,65,116,172,87,1175,179,114,71,216,50,3329,320,1242,4862,48,41,9,1,3,494,262,155,108,409,73,29,38,255,23,6,21,5,0,17,14,5,46,25,21,18,"Dr Shantir Practice","WF","WF-1","Chingford/ Walthamstow"]
["WF_LDP",44013,44014,"F86666",14835,723,10119,14,314,87,70,22,203,388,654,400,4587,558,499,231,560,143,7512,827,2862,11984,231,192,77,0,12,1728,895,534,426,1308,201,105,131,863,118,35,91,47,0,78,86,23,113,108,82,46,"The Harrow Road Surgery","WF","WF-5","South Leytonstone"]
["WF_LDP",44013,44014,"F86679",6081,216,3896,23,86,13,8,2,73,103,127,87,1106,183,136,81,199,42,3173,366,1267,4593,34,30,10,0,1,478,306,178,117,399,50,27,32,240,35,9,32,12,0,22,16,9,36,37,30,25,"Higham Hill Medical Centre","WF","WF-7","Walthamstow West"]
["WF_LDP",44013,44014,"F86650",8175,413,5571,33,179,22,8,6,117,228,255,117,1601,320,237,94,280,64,4382,426,1526,6616,110,92,26,0,9,719,373,271,211,557,121,49,55,484,62,16,55,13,0,47,38,27,77,68,59,42,"Lime Tree Surgery","WF","WF-4","Forest Integrated Health"]
["WF_LDP",44013,44014,"F86664",8449,269,5381,3,130,15,13,2,114,203,205,64,1788,259,161,110,226,66,4417,318,1295,6692,99,88,32,1,6,894,391,260,131,521,177,55,67,414,104,19,77,24,0,72,76,18,94,94,66,57,"Larkshall Medical Centre","WF","WF-1","Chingford/ Walthamstow"]
["WF_LDP",44013,44014,"F86030",8317,430,5467,11,179,7,3,0,133,224,376,205,3908,356,347,79,168,29,4385,243,919,6561,47,42,9,1,2,726,453,437,283,588,167,115,121,551,41,5,37,10,0,34,30,13,105,57,49,36," Queens Road Medical Centre","WF","WF-7","Walthamstow West"]
["WF_LDP",44044,44046,"F86700",3948,189,2529,13,213,12,11,3,172,293,159,55,621,177,128,54,135,16,1981,147,671,3198,49,38,10,0,1,785,384,167,121,559,129,61,67,224,120,14,89,36,0,99,88,71,76,83,62,45,"Kings Head Medical Practice","WF","WF-1","Chingford/ Walthamstow"]
["WF_LDP",44044,44046,"F86696",6121,290,4215,29,142,32,4,5,97,178,196,116,1451,230,213,65,158,32,3251,260,960,4999,52,42,12,0,1,563,306,246,163,435,96,62,68,333,25,4,25,8,0,15,14,11,63,42,32,18,"Francis Road Medical Centre","WF","WF-4","Forest Integrated Health"]
["WF_LDP",44044,44046,"F86705",3416,168,2419,13,68,7,6,1,46,82,119,60,1223,118,96,52,125,29,1890,190,844,2844,26,20,4,0,3,322,143,153,84,232,59,31,38,198,27,3,19,8,0,25,16,13,36,23,18,9,"The Langthorne Sharma Family Practice","WF","WF-5","South Leytonstone"]
["WF_LDP",44044,44046,"F86701",3560,210,2477,4,111,27,18,4,95,135,162,107,1300,177,159,68,170,33,1872,212,975,2908,69,49,26,0,1,440,264,191,130,367,60,32,36,233,23,7,22,9,0,17,20,8,35,32,29,20,"Kiyani Medical Practice","WF","WF-5","South Leytonstone"]
["WF_LDP",44044,44046,"F86679",6094,197,3915,8,84,12,7,2,71,105,127,79,1105,167,134,75,190,41,3141,349,1195,4612,33,30,10,0,1,481,304,177,120,395,50,27,33,238,34,9,33,13,0,22,16,9,35,37,29,24,"Higham Hill Medical Centre","WF","WF-7","Walthamstow West"]
["WF_LDP",44044,44046,"F86666",14862,704,10138,8,305,88,67,24,197,387,652,384,4575,544,478,227,540,141,7464,778,2744,12000,232,193,78,0,11,1736,879,532,402,1278,203,103,129,861,116,35,89,48,0,78,85,24,117,106,79,45,"The Harrow Road Surgery","WF","WF-5","South Leytonstone"]
["WF_LDP",44044,44046,"F86664",8449,244,5380,3,113,13,12,2,100,198,203,52,1772,234,143,98,205,64,4393,309,1219,6695,98,86,30,1,6,892,352,260,122,462,178,52,63,413,104,19,76,26,0,73,75,18,87,97,57,50,"Larkshall Medical Centre","WF","WF-1","Chingford/ Walthamstow"]
["WF_LDP",44044,44046,"F86689",4339,115,2992,3,83,3,3,0,56,105,53,25,696,78,71,29,72,22,2400,143,610,3325,31,23,2,0,5,304,150,104,69,233,55,34,39,126,39,1,22,6,0,27,23,17,28,23,20,11,"The Bailey Practice","WF","WF-1","Chingford/ Walthamstow"]
["WF_LDP",44044,44046,"F86708",2821,147,1758,8,73,5,3,1,47,89,121,54,808,112,88,45,89,33,1487,97,466,2231,30,27,6,0,1,366,194,105,66,276,61,34,38,188,15,1,11,3,0,11,9,7,43,30,21,10,"Claremont Medical Centre","WF","WF-6","Central Walthamstow"]
["WF_LDP",44044,44046,"F86005",8868,276,5944,11,278,5,3,1,210,368,189,113,2720,222,192,95,254,50,4564,429,1530,6895,60,49,18,2,2,817,453,217,192,616,92,51,61,330,116,15,98,34,2,95,84,43,56,61,42,32," The Penryhn Surgery","WF","WF-1","Chingford/ Walthamstow"]
["WF_LDP",44044,44046,"F86006",6468,343,4312,16,155,7,4,0,85,177,106,61,1254,276,265,76,171,54,3495,338,848,5183,55,45,12,0,4,822,447,241,193,711,99,54,67,413,56,22,48,22,1,38,25,35,59,60,53,34,"Seymour Medical Centre","WF","WF-7","Walthamstow West"]
["WF_LDP",44044,44046,"F86011",9859,585,6548,8,198,78,52,17,141,254,385,185,2290,464,337,110,263,80,5336,496,1483,8130,153,146,55,3,18,1183,553,500,282,840,228,84,101,716,100,22,89,26,3,68,73,28,117,149,118,87,"The Manor Practice","WF","WF-3","Leyton Collaborative"]
["WF_LDP",44044,44046,"F86001",7962,379,5399,13,233,30,20,7,148,336,192,81,2318,304,229,93,193,57,4106,322,1176,6469,103,83,19,0,11,928,462,276,197,668,170,71,92,494,98,16,83,21,0,57,58,13,97,76,61,43," The Firs","WF","WF-6","Central Walthamstow"]
["WF_LDP",44044,44046,"Y01291",8917,380,5727,13,373,17,10,4,266,520,359,163,2312,345,309,137,331,79,4905,431,1772,7118,87,73,28,0,2,1205,591,320,248,905,199,100,115,457,125,29,111,35,0,96,86,103,97,121,92,69,"Chingford Medical Practice","WF","WF-2","Chingford E4"]
["WF_LDP",44044,44046,"F86712",3331,175,2410,1,75,5,4,2,53,85,32,19,554,141,143,49,104,21,1825,113,597,2831,20,18,4,0,4,341,176,151,103,277,49,23,27,198,10,4,8,2,0,8,9,2,30,15,13,8,"Hampton Medical Centre","WF","WF-4","Forest Integrated Health"]
["WF_LDP",44044,44046,"Total",266600,11650,178337,545,6017,795,439,161,4278,7966,8783,4426,64433,9267,7600,3389,8383,2056,139363,12131,45427,213499,3145,2550,801,18,178,28499,14272,9526,6552,21025,4783,2274,2698,14460,2368,439,1950,686,31,1697,1654,874,2685,2454,1878,1333]
["WF_LDP",44044,44046,"Y01839",6452,276,4281,19,137,12,8,0,103,194,183,72,1261,234,185,87,184,71,3434,335,911,5132,88,69,19,0,4,727,311,234,161,451,113,49,59,395,84,6,77,34,1,66,69,10,57,54,41,32,"Lime Tree & Sinnott Healthcare Ltd","WF","WF-1","Chingford/ Walthamstow"]
["WF_LDP",44044,44046,"F86062",7313,347,5077,2,115,12,6,2,84,169,268,119,1561,261,194,90,253,52,4196,449,1577,6009,97,83,26,3,11,827,377,290,160,579,147,76,83,447,71,20,61,16,2,45,49,28,80,66,46,35,"Grove Surgery","WF","WF-7","Walthamstow West"]
["WF_LDP",44044,44046,"F86058",15587,605,10273,6,295,44,8,2,230,376,471,213,3974,488,337,176,508,138,7527,689,2575,12153,197,150,51,0,6,1475,754,461,295,1032,229,92,112,747,103,18,74,30,0,68,80,31,132,124,87,71,"St James Medical Practice Ltd","WF","WF-7","Walthamstow West"]
["WF_LDP",44044,44046,"F86086",6311,235,3987,3,80,3,3,0,68,111,126,58,815,196,117,81,231,62,3118,324,1145,4784,84,60,21,0,5,500,233,173,107,347,90,25,35,297,33,5,28,8,0,22,19,8,55,38,30,21,"Dr Dhital Practice","WF","WF-6","Central Walthamstow"]
["WF_LDP",44044,44046,"F86078",7107,270,4830,4,99,6,0,0,62,138,365,143,1894,199,159,82,212,40,3946,254,1060,6010,54,41,13,0,0,1133,500,224,155,783,182,70,74,346,85,7,66,17,1,61,56,13,75,103,79,58,"The Ridgeway Surgery","WF","WF-2","Chingford E4"]
["WF_LDP",44044,44046,"F86045",1994,103,1414,3,53,18,8,2,28,66,90,46,680,90,75,43,99,20,1096,100,458,1686,34,29,5,0,3,274,157,101,63,213,60,33,42,134,23,3,20,3,0,20,17,5,38,26,23,16,"High Road Surgery","WF","WF-5","South Leytonstone"]
["WF_LDP",44044,44046,"F86038",12582,650,7854,9,195,29,24,11,133,249,462,236,2421,536,430,198,399,105,5887,395,1775,9696,151,128,24,0,9,1171,648,525,327,887,244,124,152,803,49,6,45,13,0,32,24,15,150,113,87,64,"Sma Medical Centre","WF","WF-3","Leyton Collaborative"]
["WF_LDP",44044,44046,"F86044",9749,265,6976,95,138,21,19,6,75,241,290,117,1520,194,191,82,192,65,4874,521,1138,8033,110,83,21,0,2,762,259,255,149,437,83,26,29,384,32,8,30,11,3,19,22,12,35,59,38,20," Crawley Road Medical Centre","WF","WF-4","Forest Integrated Health"]
["WF_LDP",44044,44046,"F86030",8331,446,5479,11,183,8,4,2,138,224,383,232,3900,371,372,82,187,35,4400,242,1022,6577,47,42,9,1,2,724,449,436,301,592,167,126,136,554,40,5,38,10,0,33,29,12,107,58,50,37," Queens Road Medical Centre","WF","WF-7","Walthamstow West"]
["WF_LDP",44044,44046,"F86036",15799,571,11036,5,283,68,14,24,213,371,515,270,3647,480,394,171,442,103,8806,675,2539,12752,233,175,38,0,12,1479,784,544,374,1076,231,111,133,806,118,26,106,41,1,85,95,58,139,118,90,64,"The Allum Medical Centre","WF","WF-4","Forest Integrated Health"]
["WF_LDP",44044,44046,"F86627",13552,706,8782,9,512,36,24,10,315,664,667,400,3231,489,419,228,615,149,7191,743,2702,11096,208,158,62,2,8,1841,912,450,399,1506,401,216,252,801,232,39,197,72,7,151,163,70,218,229,173,104,"Churchill Medical Centre","WF","WF-2","Chingford E4"]
["WF_LDP",44044,44046,"F86626",6127,222,4171,16,81,10,9,2,58,116,169,88,1162,160,120,67,201,45,3291,300,1174,4886,47,39,9,1,3,492,243,155,117,383,75,30,43,257,22,6,19,2,0,17,13,4,45,25,20,15,"Dr Shantir Practice","WF","WF-1","Chingford/ Walthamstow"]
["WF_LDP",44044,44046,"F86650",8143,392,5551,33,167,20,7,5,119,226,255,108,1589,307,228,83,255,55,4189,361,1380,6598,112,90,23,0,5,713,356,272,206,522,120,44,50,485,62,16,54,15,0,47,38,28,75,70,55,38,"Lime Tree Surgery","WF","WF-4","Forest Integrated Health"]
["WF_LDP",44044,44046,"F86644",10253,431,6648,13,226,59,30,6,168,289,358,197,2337,314,255,134,250,76,5026,391,1418,8052,132,99,36,0,7,1182,532,327,247,860,202,87,107,539,107,17,73,23,0,73,75,27,102,69,50,36,"Waltham Forest Community & Family Health Services Ltd","WF","WF-6","Central Walthamstow"]
["WF_LDP",44044,44046,"F86625",6141,354,4085,40,172,11,5,5,108,220,157,93,1121,256,235,99,194,59,2920,222,968,4981,95,84,34,0,5,701,327,292,204,514,134,55,75,417,63,17,56,18,1,49,36,47,75,70,53,34,"LL Medical Care (Agarwal & Agrwal Practice)","WF","WF-5","South Leytonstone"]
["WF_LDP",44044,44046,"F86616",7364,283,4802,9,229,14,2,1,178,292,298,131,2054,250,177,125,326,61,3709,293,1700,5731,59,41,17,1,1,810,433,222,186,676,177,82,93,319,72,14,45,15,0,55,56,11,104,78,67,55,"Old Church Surgery","WF","WF-2","Chingford E4"]
["WF_LDP",44044,44046,"F86607",13999,560,9234,89,240,69,36,9,174,309,482,243,4640,415,363,178,496,98,7676,737,2851,10768,180,155,57,4,16,1224,680,428,289,987,199,99,124,641,92,14,81,41,8,70,71,51,108,107,89,69,"Addison Road Medical Practice","WF","WF-6","Central Walthamstow"]
["WF_LDP",44044,44046,"F86088",4832,262,3409,9,129,5,2,1,93,186,118,56,881,193,170,55,151,34,2450,165,735,4090,46,36,6,0,1,674,287,209,145,430,102,46,54,357,38,8,30,8,0,27,31,18,47,39,27,19,"The Lyndhurst Surgery","WF","WF-4","Forest Integrated Health"]
["WF_LDP",44044,44046,"F86621",5949,270,4285,19,179,9,6,0,147,213,71,50,746,245,194,55,188,36,3517,321,1209,5027,73,66,16,0,7,605,372,288,175,496,99,64,71,309,34,3,27,12,1,28,30,24,67,53,47,40,"Green Man Medical Centre","WF","WF-5","South Leytonstone"]
["WF_LDP",44075,44076,"F86679",6090,200,3915,14,91,9,5,1,76,113,127,80,1103,168,140,68,181,44,3101,332,1128,4614,34,31,11,0,1,481,293,0,130,385,50,29,36,239,34,9,33,13,0,0,16,9,35,36,28,23,"Higham Hill Medical Centre","WF","WF-7","Walthamstow West"]
["WF_LDP",44075,44076,"F86689",4349,109,3005,3,80,3,3,0,51,105,53,23,689,71,72,28,73,21,2393,135,592,3338,31,24,4,0,5,304,144,0,66,220,55,35,39,126,39,1,25,8,0,0,22,16,26,23,20,11,"The Bailey Practice","WF","WF-1","Chingford/ Walthamstow"]
["WF_LDP",44075,44076,"F86696",6162,290,4245,36,151,34,4,5,114,188,203,122,2119,226,212,89,245,38,3239,253,1658,5030,52,43,13,0,1,564,308,0,157,426,96,61,67,335,25,4,25,8,0,0,14,11,61,43,32,19,"Francis Road Medical Centre","WF","WF-4","Forest Integrated Health"]
["WF_LDP",44075,44076,"F86666",14880,686,10155,7,308,89,69,25,202,390,651,385,4579,523,468,221,522,139,7458,769,2711,12022,231,194,77,0,9,1743,862,0,397,1263,203,104,126,865,117,36,90,49,0,0,85,26,112,111,85,49,"The Harrow Road Surgery","WF","WF-5","South Leytonstone"]
["WF_LDP",44075,44076,"F86644",10207,417,6615,14,221,55,27,5,162,290,356,191,2325,304,241,138,243,75,4971,381,1368,8019,138,97,32,0,7,1178,525,0,229,844,199,93,113,534,105,16,71,23,0,0,73,27,100,69,50,37,"Waltham Forest Community & Family Health Services Ltd","WF","WF-6","Central Walthamstow"]
["WF_LDP",44075,44076,"F86650",8137,372,5541,33,162,18,6,5,113,225,255,106,1587,288,230,77,241,53,4079,327,1280,6589,113,89,21,0,5,710,333,0,194,496,120,40,46,486,62,16,55,16,0,0,38,28,74,70,49,34,"Lime Tree Surgery","WF","WF-4","Forest Integrated Health"]
["WF_LDP",44075,44076,"F86664",8459,224,5389,2,106,11,10,2,92,198,203,48,1769,214,137,82,196,58,4368,300,1101,6706,98,86,31,1,5,895,328,0,112,433,178,47,54,414,104,19,74,26,0,0,75,21,73,98,53,46,"Larkshall Medical Centre","WF","WF-1","Chingford/ Walthamstow"]
["WF_LDP",44075,44076,"F86700",3931,185,2517,13,225,12,11,3,187,292,157,52,619,172,119,50,129,16,1959,144,647,3180,47,37,10,0,1,780,383,0,113,560,128,57,63,218,118,14,89,36,0,0,86,71,75,84,63,51,"Kings Head Medical Practice","WF","WF-1","Chingford/ Walthamstow"]
["WF_LDP",44075,44076,"Y01291",8930,371,5739,8,367,17,10,4,261,521,359,159,2304,332,308,134,311,78,4782,407,1661,7130,85,70,27,0,2,1214,579,0,253,881,198,101,116,458,122,29,107,35,0,0,84,102,93,121,95,71,"Chingford Medical Practice","WF","WF-2","Chingford E4"]
["WF_LDP",44075,44076,"Y01839",6447,264,4280,14,125,11,7,0,92,191,182,73,1255,222,178,86,185,70,3415,322,897,5128,87,67,18,0,3,723,292,0,152,424,112,50,58,395,83,6,74,32,1,0,68,10,55,53,36,27,"Lime Tree & Sinnott Healthcare Ltd","WF","WF-1","Chingford/ Walthamstow"]
["WF_LDP",44075,44076,"Total",266707,11310,178463,439,5940,771,421,158,4222,8023,8807,4299,64941,8929,7536,3257,8085,1978,138012,11594,44058,213607,3163,2550,792,19,169,28514,13747,2,6424,20342,4778,2261,2662,14485,2364,437,1915,679,31,0,1650,882,2593,2463,1827,1300]
["WF_LDP",44075,44076,"F86712",3345,160,2422,1,70,5,4,2,48,85,32,17,553,125,142,45,89,21,1784,94,534,2843,20,18,4,0,4,341,164,0,100,262,49,24,26,199,10,4,7,1,0,0,9,2,26,15,13,8,"Hampton Medical Centre","WF","WF-4","Forest Integrated Health"]
["WF_LDP",44075,44076,"F86701",3560,213,2484,2,108,27,18,4,91,134,163,109,1301,181,160,66,165,34,1863,207,944,2912,70,49,25,0,1,440,256,0,131,356,58,31,33,235,23,7,22,9,0,0,20,8,35,33,29,20,"Kiyani Medical Practice","WF","WF-5","South Leytonstone"]
["WF_LDP",44075,44076,"F86705",3399,170,2417,2,67,8,7,1,47,82,118,59,1219,126,103,57,124,29,1888,189,833,2840,26,22,6,0,3,320,151,0,91,228,59,31,39,201,27,3,21,10,0,0,16,14,38,23,17,9,"The Langthorne Sharma Family Practice","WF","WF-5","South Leytonstone"]
["WF_LDP",44075,44076,"F86708",2811,143,1745,9,72,6,4,1,51,90,123,55,789,111,85,40,77,35,1476,99,427,2220,32,30,7,0,1,368,189,0,63,267,62,32,36,188,15,1,12,3,0,0,9,7,42,30,21,10,"Claremont Medical Centre","WF","WF-6","Central Walthamstow"]
["WF_LDP",44075,44076,"F86627",13572,694,8780,6,502,39,26,11,310,664,678,398,3234,487,418,228,596,144,7098,718,2664,11107,209,157,59,2,9,1853,891,2,395,1476,404,219,253,803,233,37,192,69,8,0,166,73,213,229,167,102,"Churchill Medical Centre","WF","WF-2","Chingford E4"]
["WF_LDP",44075,44076,"F86038",12560,641,7837,7,192,26,21,10,127,248,466,228,2453,526,419,188,400,102,5848,386,1748,9676,149,124,22,0,8,1170,615,0,322,851,246,125,149,807,50,6,46,14,0,0,26,15,140,113,82,62,"Sma Medical Centre","WF","WF-3","Leyton Collaborative"]
["WF_LDP",44075,44076,"F86036",15769,520,11022,3,262,67,13,23,198,369,517,240,3643,431,379,147,392,98,8675,641,2323,12730,233,177,37,0,13,1476,726,0,352,1008,231,108,134,803,119,26,103,41,1,0,96,59,130,116,79,58,"The Allum Medical Centre","WF","WF-4","Forest Integrated Health"]
["WF_LDP",44075,44076,"F86045",1999,100,1416,1,50,16,6,2,26,65,89,43,684,85,77,37,86,17,1075,91,414,1694,34,29,5,0,2,276,139,0,60,191,59,32,39,134,23,3,17,3,0,0,17,5,33,26,19,12,"High Road Surgery","WF","WF-5","South Leytonstone"]
["WF_LDP",44075,44076,"F86044",9769,262,6991,94,131,19,16,5,71,240,291,110,1509,188,189,86,185,64,4776,485,1098,8037,110,80,19,0,2,763,254,0,150,422,82,26,29,384,32,7,30,11,3,0,22,12,33,60,33,17," Crawley Road Medical Centre","WF","WF-4","Forest Integrated Health"]
["WF_LDP",44075,44076,"F86030",8311,483,5479,10,186,8,4,2,138,222,384,255,3887,412,384,86,205,35,4406,243,1092,6562,47,42,9,1,2,722,462,0,301,604,163,125,135,550,39,5,37,10,0,0,28,11,114,57,53,42," Queens Road Medical Centre","WF","WF-7","Walthamstow West"]
["WF_LDP",44075,44076,"F86005",8890,266,5954,7,265,4,2,1,201,364,187,106,2690,207,188,87,246,47,4484,408,1435,6908,60,49,18,0,3,809,430,0,185,595,91,46,56,327,116,15,92,31,2,0,84,43,53,62,46,36," The Penryhn Surgery","WF","WF-1","Chingford/ Walthamstow"]
["WF_LDP",44075,44076,"F86001",7950,357,5388,11,225,30,21,7,144,337,192,71,2285,288,217,91,164,49,4044,290,1092,6462,105,86,19,0,11,928,437,0,189,640,170,68,86,495,98,16,79,18,0,0,58,13,91,75,58,42," The Firs","WF","WF-6","Central Walthamstow"]
["WF_LDP",44075,44076,"F86011",9862,565,6539,9,204,73,45,18,144,258,381,176,2277,442,346,106,251,74,5277,470,1383,8136,156,144,53,3,13,1189,527,0,279,817,230,89,105,718,102,23,80,24,3,0,73,31,120,151,120,87,"The Manor Practice","WF","WF-3","Leyton Collaborative"]
["WF_LDP",44075,44076,"F86006",6472,340,4322,2,154,6,3,0,85,179,106,59,1248,272,255,74,165,52,3424,309,812,5192,57,45,11,0,4,822,462,0,186,702,99,54,67,413,57,22,46,20,1,0,26,35,61,61,52,32,"Seymour Medical Centre","WF","WF-7","Walthamstow West"]
["WF_LDP",44075,44076,"F86058",15642,560,10326,3,285,32,5,2,221,372,469,202,3927,447,346,163,484,127,7557,683,2411,12202,195,151,57,0,6,1478,701,0,301,979,229,92,111,749,105,18,78,31,0,0,81,29,125,123,82,65,"St James Medical Practice Ltd","WF","WF-7","Walthamstow West"]
["WF_LDP",44075,44076,"F86621",5942,260,4286,18,170,8,6,0,136,213,71,45,746,235,191,51,165,36,3462,298,1116,5023,74,66,15,0,6,605,352,0,164,473,98,63,68,311,34,3,27,12,1,0,30,24,64,53,46,38,"Green Man Medical Centre","WF","WF-5","South Leytonstone"]
["WF_LDP",44075,44076,"F86616",7357,282,4802,29,258,14,2,1,194,321,299,124,2050,245,183,122,309,55,3731,283,1684,5728,59,41,17,1,1,811,435,0,189,692,178,76,88,324,71,14,51,15,0,0,57,11,104,78,67,51,"Old Church Surgery","WF","WF-2","Chingford E4"]
["WF_LDP",44075,44076,"F86626",6192,224,4210,13,82,10,9,2,62,120,171,84,1170,158,121,59,187,43,3263,281,1116,4938,48,40,10,1,3,495,226,0,123,360,76,32,42,260,23,6,18,2,0,0,13,4,41,26,19,14,"Dr Shantir Practice","WF","WF-1","Chingford/ Walthamstow"]
["WF_LDP",44075,44076,"F86625",6106,347,4059,8,173,14,7,6,103,221,161,97,1112,240,230,92,212,64,2895,220,998,4958,96,84,34,1,5,699,313,0,199,505,135,48,68,422,61,17,53,18,1,0,34,46,73,69,53,34,"LL Medical Care (Agarwal & Agrwal Practice)","WF","WF-5","South Leytonstone"]
["WF_LDP",44075,44076,"F86607",14021,545,9251,46,241,73,39,7,180,322,491,244,4690,402,367,172,473,96,7646,707,2731,10777,185,158,58,6,15,1227,643,0,290,948,196,98,123,640,91,14,78,41,7,0,70,53,107,108,87,68,"Addison Road Medical Practice","WF","WF-6","Central Walthamstow"]
["WF_LDP",44075,44076,"F86078",7107,271,4832,5,99,6,0,0,63,141,364,132,1884,203,158,81,209,37,3932,253,1018,6009,54,41,13,0,1,1135,483,0,147,755,183,73,79,349,85,7,63,18,1,0,56,13,75,104,76,55,"The Ridgeway Surgery","WF","WF-2","Chingford E4"]
["WF_LDP",44075,44076,"F86062",7331,329,5097,0,106,13,6,2,78,166,268,110,1556,242,208,84,230,43,4148,428,1431,6018,97,84,26,3,11,824,353,0,175,544,147,77,83,449,71,20,62,17,2,0,49,27,74,66,42,32,"Grove Surgery","WF","WF-7","Walthamstow West"]
["WF_LDP",44075,44076,"F86088",4834,236,3412,7,125,5,2,1,88,186,117,46,879,167,159,50,137,29,2430,154,678,4093,46,36,6,0,1,673,264,0,134,400,103,52,60,357,37,8,30,8,0,0,30,18,42,39,26,18,"The Lyndhurst Surgery","WF","WF-4","Forest Integrated Health"]
["WF_LDP",44075,44076,"F86086",6314,224,3991,2,77,3,3,0,66,111,123,50,806,189,106,72,208,55,3065,287,1033,4786,85,59,18,0,5,498,227,0,95,335,91,23,35,297,33,5,28,7,0,0,19,8,55,38,29,20,"Dr Dhital Practice","WF","WF-6","Central Walthamstow"]
["WF_LDP",44105,44106,"F86679",6060,205,3901,16,94,10,6,1,77,115,128,86,1090,178,140,58,172,44,3034,306,1044,4599,34,31,10,0,1,477,289,67,128,377,50,31,36,237,34,9,33,12,0,10,16,9,35,36,29,24,"Higham Hill Medical Centre","WF","WF-7","Walthamstow West"]
["WF_LDP",44105,44106,"F86666",14859,680,10144,5,303,92,74,24,203,391,650,374,4544,522,470,215,534,141,7427,734,2703,12010,233,193,76,0,11,1758,836,45,396,1246,203,110,131,863,117,38,88,45,0,10,85,27,111,113,83,53,"The Harrow Road Surgery","WF","WF-5","South Leytonstone"]
["WF_LDP",44105,44106,"F86696",6207,292,4282,34,149,34,6,5,125,187,204,130,2118,234,215,87,231,33,3194,224,1578,5063,52,41,10,0,2,567,300,135,169,416,96,58,64,335,25,4,24,8,0,8,14,11,58,42,30,21,"Francis Road Medical Centre","WF","WF-4","Forest Integrated Health"]
["WF_LDP",44105,44106,"F86689",4352,107,3002,1,79,2,2,0,47,105,53,23,684,65,79,26,70,22,2384,131,564,3331,31,24,5,0,5,304,142,54,65,220,55,34,37,127,39,1,29,9,0,21,23,16,31,23,18,13,"The Bailey Practice","WF","WF-1","Chingford/ Walthamstow"]
["WF_LDP",44105,44106,"F86664",8477,205,5404,2,105,12,11,2,92,199,203,49,1788,194,135,73,183,53,4360,291,1030,6729,99,87,32,1,5,895,299,13,108,393,177,47,56,413,104,19,78,28,0,8,75,21,63,99,44,38,"Larkshall Medical Centre","WF","WF-1","Chingford/ Walthamstow"]
["WF_LDP",44105,44106,"F86627",13536,671,8764,6,467,39,26,11,284,662,674,371,3216,480,408,219,549,143,6912,662,2539,11087,210,154,55,2,9,1851,860,155,376,1408,405,211,250,804,232,37,184,67,7,80,166,73,207,224,159,99,"Churchill Medical Centre","WF","WF-2","Chingford E4"]
["WF_LDP",44105,44106,"F86626",6255,230,4250,12,99,9,8,2,78,120,171,83,1186,165,126,58,194,43,3265,280,1130,4978,49,40,10,1,3,497,233,66,122,376,77,32,40,263,22,6,17,2,0,11,14,5,45,26,21,16,"Dr Shantir Practice","WF","WF-1","Chingford/ Walthamstow"]
["WF_LDP",44105,44106,"F86650",8127,348,5528,31,149,20,6,6,104,224,256,98,1575,273,224,73,235,53,3978,303,1215,6581,112,85,18,0,2,712,311,86,195,459,120,39,44,485,62,16,53,16,0,17,40,28,68,71,45,30,"Lime Tree Surgery","WF","WF-4","Forest Integrated Health"]
["WF_LDP",44105,44106,"F86644",10223,402,6626,13,216,55,25,5,161,292,355,186,2338,290,231,138,234,76,4952,369,1333,8034,139,96,32,0,6,1184,513,119,219,823,198,89,107,533,105,16,69,21,0,33,74,26,95,69,46,33,"Waltham Forest Community & Family Health Services Ltd","WF","WF-6","Central Walthamstow"]
["WF_LDP",44105,44106,"Y01839",6427,262,4269,13,139,8,5,0,105,195,183,77,1247,223,181,80,170,60,3345,304,818,5111,86,66,18,0,2,723,288,63,151,416,112,50,58,399,83,6,74,33,1,31,68,10,56,53,34,23,"Lime Tree & Sinnott Healthcare Ltd","WF","WF-1","Chingford/ Walthamstow"]
["WF_LDP",44105,44106,"Y01291",8921,364,5742,8,362,17,8,4,266,513,355,155,2292,327,306,129,308,76,4689,384,1606,7123,87,71,27,0,2,1206,561,159,242,853,194,101,118,456,122,29,106,35,0,47,89,103,90,120,90,65,"Chingford Medical Practice","WF","WF-2","Chingford E4"]
["WF_LDP",44105,44106,"F86001",7941,325,5391,9,207,25,16,5,129,334,193,70,2267,264,209,75,140,46,3964,248,980,6454,104,82,16,0,10,923,384,130,181,571,169,69,85,493,97,16,71,16,0,27,59,13,77,75,57,42," The Firs","WF","WF-6","Central Walthamstow"]
["WF_LDP",44105,44106,"Total",266262,11014,178217,417,5888,760,406,155,4177,8077,8832,4256,64636,8687,7655,3065,7714,1895,136340,10981,41836,213229,3173,2538,770,19,162,28490,13244,3113,6429,19679,4775,2315,2708,14496,2354,439,1887,669,30,747,1663,883,2508,2467,1771,1268]
["WF_LDP",44105,44106,"F86712",3335,156,2412,1,65,5,4,2,43,85,33,19,535,122,137,41,77,17,1757,95,485,2834,20,19,4,0,4,340,155,58,100,247,49,28,30,200,10,4,6,1,0,4,9,2,26,16,13,9,"Hampton Medical Centre","WF","WF-4","Forest Integrated Health"]
["WF_LDP",44105,44106,"F86701",3572,211,2493,3,110,27,19,3,92,135,164,102,1312,184,165,58,155,32,1853,205,876,2928,69,47,22,0,0,439,244,74,133,337,58,32,33,235,23,7,21,10,0,11,20,8,33,33,29,22,"Kiyani Medical Practice","WF","WF-5","South Leytonstone"]
["WF_LDP",44105,44106,"F86700",3927,188,2515,11,236,12,11,3,194,292,158,62,617,170,124,44,124,14,1966,137,608,3175,47,37,10,0,2,779,426,113,113,619,128,58,66,218,118,14,91,36,0,69,88,71,72,83,64,52,"Kings Head Medical Practice","WF","WF-1","Chingford/ Walthamstow"]
["WF_LDP",44105,44106,"F86708",2786,135,1733,9,67,6,4,1,46,88,124,51,768,107,83,36,66,29,1468,98,385,2200,31,29,9,0,1,367,183,7,59,254,62,32,36,187,15,1,12,2,0,3,9,7,39,30,21,10,"Claremont Medical Centre","WF","WF-6","Central Walthamstow"]
["WF_LDP",44105,44106,"F86705",3415,169,2434,2,66,7,6,0,50,82,120,60,1234,124,108,56,118,27,1886,184,815,2857,26,22,6,1,3,320,155,58,93,226,58,32,39,202,26,3,20,10,1,12,16,13,39,23,16,9,"The Langthorne Sharma Family Practice","WF","WF-5","South Leytonstone"]
["WF_LDP",44105,44106,"F86038",12204,641,7577,10,192,31,24,14,125,255,475,241,2439,528,432,192,406,103,5700,389,1799,9370,150,125,21,0,8,1166,605,214,322,842,246,128,151,807,47,7,45,12,0,18,26,15,142,112,81,62,"Sma Medical Centre","WF","WF-3","Leyton Collaborative"]
["WF_LDP",44105,44106,"F86036",15777,477,11016,2,238,64,11,23,175,368,518,223,3615,395,371,127,351,93,8529,595,2101,12727,235,178,36,0,11,1479,675,162,341,938,234,109,133,801,119,26,103,43,1,41,96,59,113,117,68,47,"The Allum Medical Centre","WF","WF-4","Forest Integrated Health"]
["WF_LDP",44105,44106,"F86045",1993,102,1412,0,46,15,7,2,23,64,90,36,681,81,80,32,79,17,1063,85,372,1694,34,28,5,0,1,276,118,46,57,171,58,32,37,133,22,3,14,2,0,15,16,5,30,25,18,12,"High Road Surgery","WF","WF-5","South Leytonstone"]
["WF_LDP",44105,44106,"F86044",9769,253,6993,93,134,17,14,4,73,240,289,111,1491,173,191,76,168,60,4662,443,987,8026,108,79,18,0,2,762,259,55,151,438,82,26,29,386,32,7,30,11,3,4,22,12,33,60,31,15," Crawley Road Medical Centre","WF","WF-4","Forest Integrated Health"]
["WF_LDP",44105,44106,"F86006",6483,341,4325,1,152,6,3,0,70,178,106,55,1246,254,262,73,167,49,3368,295,758,5197,58,48,14,0,4,824,443,159,198,689,99,57,68,418,58,22,45,20,1,28,27,36,54,62,53,32,"Seymour Medical Centre","WF","WF-7","Walthamstow West"]
["WF_LDP",44105,44106,"F86005",8928,268,5988,4,280,5,4,0,200,363,189,110,2674,203,193,84,218,45,4468,406,1280,6942,61,51,20,1,3,806,419,109,180,599,91,50,60,330,115,15,99,33,3,51,84,44,53,62,46,35," The Penryhn Surgery","WF","WF-1","Chingford/ Walthamstow"]
["WF_LDP",44105,44106,"F86030",8313,489,5483,8,183,9,4,2,132,223,386,266,3876,418,393,83,207,30,4416,236,1081,6568,47,42,9,0,2,723,444,0,304,584,163,132,142,551,39,5,37,10,0,0,28,11,113,57,50,39," Queens Road Medical Centre","WF","WF-7","Walthamstow West"]
["WF_LDP",44105,44106,"F86011",9869,540,6554,13,202,66,34,17,146,260,382,162,2267,437,351,95,225,72,5216,431,1263,8152,159,141,48,3,12,1188,504,163,289,778,236,97,112,722,103,23,76,21,3,29,74,32,126,153,116,87,"The Manor Practice","WF","WF-3","Leyton Collaborative"]
["WF_LDP",44105,44106,"F86058",15508,533,10238,1,276,28,4,1,215,366,471,209,3856,419,366,150,458,115,7475,655,2273,12085,194,152,56,0,7,1461,659,109,322,923,226,91,111,743,104,17,77,32,0,28,80,27,125,120,84,68,"St James Medical Practice Ltd","WF","WF-7","Walthamstow West"]
["WF_LDP",44105,44106,"F86616",7403,273,4828,29,275,15,2,2,213,345,297,120,2047,232,185,112,299,56,3713,270,1647,5758,60,42,18,1,1,807,430,131,188,676,178,80,93,326,71,14,50,14,0,25,58,11,102,79,66,51,"Old Church Surgery","WF","WF-2","Chingford E4"]
["WF_LDP",44105,44106,"F86607",14018,525,9259,42,259,75,37,7,200,352,494,239,4700,393,358,160,451,96,7595,660,2581,10781,185,161,59,5,17,1226,617,152,278,921,195,100,123,638,92,14,78,40,7,40,70,53,107,110,85,66,"Addison Road Medical Practice","WF","WF-6","Central Walthamstow"]
["WF_LDP",44105,44106,"F86625",6087,352,4050,7,175,12,7,5,104,223,157,95,1091,249,235,94,221,63,2881,219,986,4947,95,84,33,1,5,699,324,93,201,507,136,51,74,425,60,17,49,16,0,21,33,45,75,69,52,37,"LL Medical Care (Agarwal & Agrwal Practice)","WF","WF-5","South Leytonstone"]
["WF_LDP",44105,44106,"F86621",5953,263,4300,19,167,10,7,1,114,213,85,62,754,231,210,54,167,36,3424,290,1103,5031,74,64,13,0,5,604,334,113,173,467,98,65,69,312,33,3,26,12,0,11,30,24,59,55,49,36,"Green Man Medical Centre","WF","WF-5","South Leytonstone"]
["WF_LDP",44105,44106,"F86078",7081,256,4821,3,94,6,0,0,64,142,362,124,1869,195,164,80,197,35,3896,239,957,5985,54,41,13,0,1,1137,460,17,152,711,182,78,82,348,84,7,61,16,1,4,56,13,69,104,73,55,"The Ridgeway Surgery","WF","WF-2","Chingford E4"]
["WF_LDP",44105,44106,"F86062",7332,327,5094,4,118,13,6,2,90,170,270,120,1544,239,251,75,226,41,4107,414,1383,6014,97,82,24,3,10,825,336,99,205,527,146,85,94,449,71,20,62,19,2,17,49,27,71,67,46,30,"Grove Surgery","WF","WF-7","Walthamstow West"]
["WF_LDP",44105,44106,"F86088",4826,219,3407,4,113,5,2,1,77,183,117,45,878,150,173,48,130,26,2398,139,629,4084,47,35,5,0,1,672,240,4,131,366,102,59,66,358,37,8,31,9,0,0,30,18,42,40,27,19,"The Lyndhurst Surgery","WF","WF-4","Forest Integrated Health"]
["WF_LDP",44105,44106,"F86086",6298,205,3982,1,71,3,3,0,60,113,120,42,797,168,99,64,184,49,2995,260,927,4774,86,61,18,0,4,493,198,85,87,301,92,22,34,299,33,5,28,8,0,13,19,8,49,39,27,18,"Dr Dhital Practice","WF","WF-6","Central Walthamstow"]
["WF_LDP",44136,44137,"F86679",6057,207,3898,15,91,9,6,1,73,114,123,84,1077,186,141,54,164,48,3002,289,1003,4595,34,31,10,0,1,474,284,157,133,368,50,32,38,236,33,9,32,12,0,20,16,9,36,36,31,27,"Higham Hill Medical Centre","WF","WF-7","Walthamstow West"]
["WF_LDP",44136,44137,"F86666",14863,666,10169,9,309,90,73,23,199,399,651,365,4543,505,472,220,534,134,7402,699,2668,12026,229,188,71,0,9,1787,839,364,397,1259,203,112,131,869,118,39,87,42,0,59,87,27,110,114,84,47,"The Harrow Road Surgery","WF","WF-5","South Leytonstone"]
["WF_LDP",44136,44137,"F86626",6302,236,4281,12,105,10,10,2,93,121,174,88,1218,175,137,54,192,41,3246,271,1079,5019,51,42,11,1,3,501,240,146,132,367,77,33,39,265,23,6,19,3,0,16,14,5,45,26,22,20,"Dr Shantir Practice","WF","WF-1","Chingford/ Walthamstow"]
["WF_LDP",44136,44137,"F86689",4351,104,2996,1,89,2,2,0,69,104,53,26,677,71,82,24,63,18,2338,117,515,3323,31,25,6,0,5,303,158,89,65,221,53,31,33,126,39,1,33,9,1,24,24,16,31,23,18,14,"The Bailey Practice","WF","WF-1","Chingford/ Walthamstow"]
["WF_LDP",44136,44137,"F86644",10196,388,6612,12,204,58,23,5,147,296,350,167,2341,280,231,126,232,77,4878,369,1243,8018,143,102,34,0,9,1180,477,234,214,762,199,91,107,531,105,16,65,25,0,55,76,26,90,69,41,30,"Waltham Forest Community & Family Health Services Ltd","WF","WF-6","Central Walthamstow"]
["WF_LDP",44136,44137,"F86627",13571,645,8770,8,443,40,26,11,267,663,672,335,3217,462,389,208,538,137,6755,604,2430,11099,211,157,54,2,7,1854,808,307,368,1335,405,209,251,805,230,37,178,66,7,108,165,72,194,221,153,93,"Churchill Medical Centre","WF","WF-2","Chingford E4"]
["WF_LDP",44136,44137,"F86664",8519,247,5429,24,161,10,9,1,143,219,206,55,1821,236,146,72,168,49,4345,273,954,6762,100,85,31,1,5,899,353,183,116,482,179,51,59,413,102,19,78,29,0,57,82,23,84,98,59,50,"Larkshall Medical Centre","WF","WF-1","Chingford/ Walthamstow"]
["WF_LDP",44136,44137,"F86650",8132,330,5533,30,154,18,5,6,111,224,258,91,1570,251,216,68,225,53,3917,294,1155,6578,113,88,21,0,2,714,298,169,193,433,122,41,49,487,62,16,39,13,0,37,40,28,64,73,45,30,"Lime Tree Surgery","WF","WF-4","Forest Integrated Health"]
["WF_LDP",44136,44137,"Y01291",8877,355,5723,13,359,17,7,4,256,516,358,150,2282,312,293,118,305,68,4540,340,1514,7087,85,72,28,0,3,1213,539,270,238,835,192,99,112,457,120,29,101,33,0,69,90,102,91,122,91,63,"Chingford Medical Practice","WF","WF-2","Chingford E4"]
["WF_LDP",44136,44137,"F86712",3339,154,2421,6,70,5,4,2,40,90,34,19,532,117,132,37,73,18,1752,94,477,2833,19,18,4,0,4,339,151,108,99,239,49,25,27,202,10,4,6,1,0,9,9,2,23,16,14,9,"Hampton Medical Centre","WF","WF-4","Forest Integrated Health"]
["WF_LDP",44136,44137,"F86045",1985,103,1412,0,44,16,8,2,20,63,94,40,676,79,86,30,76,15,1055,77,362,1688,34,28,5,0,1,276,114,83,63,170,58,36,42,129,22,3,13,2,0,18,17,5,31,24,19,10,"High Road Surgery","WF","WF-5","South Leytonstone"]
["WF_LDP",44136,44137,"Y01839",6407,261,4264,17,159,7,3,0,138,198,183,82,1242,225,176,71,151,59,3270,281,746,5107,86,63,13,0,2,723,288,113,154,418,112,51,59,402,82,6,70,31,0,38,68,10,56,53,33,25,"Lime Tree & Sinnott Healthcare Ltd","WF","WF-1","Chingford/ Walthamstow"]
["WF_LDP",44136,44137,"F86708",2778,136,1733,8,62,5,4,0,42,88,125,46,761,109,82,31,60,28,1454,92,363,2195,31,28,8,0,0,369,172,99,57,244,62,32,37,190,15,1,12,2,0,12,10,7,39,30,16,7,"Claremont Medical Centre","WF","WF-6","Central Walthamstow"]
["WF_LDP",44136,44137,"F86700",3925,190,2512,12,239,11,10,2,194,295,158,63,622,164,124,43,121,12,1962,136,582,3177,45,35,8,0,2,782,439,154,116,649,126,59,69,219,115,14,87,34,0,90,86,71,70,86,65,52,"Kings Head Medical Practice","WF","WF-1","Chingford/ Walthamstow"]
["WF_LDP",44136,44137,"F86696",6274,298,4324,32,146,33,6,5,125,186,203,127,2119,236,215,86,222,31,3137,196,1521,5117,52,41,10,0,2,566,287,215,172,405,97,53,60,335,25,4,25,7,0,12,15,12,51,42,28,21,"Francis Road Medical Centre","WF","WF-4","Forest Integrated Health"]
["WF_LDP",44136,44137,"F86705",3420,173,2443,3,66,7,6,0,54,83,122,64,1229,136,117,55,124,26,1889,182,796,2863,26,22,6,1,3,321,162,154,100,236,58,33,40,205,26,3,22,11,1,24,16,13,37,23,20,10,"The Langthorne Sharma Family Practice","WF","WF-5","South Leytonstone"]
["WF_LDP",44136,44137,"F86701",3579,210,2502,4,111,27,19,2,92,137,168,103,1326,177,168,54,159,33,1843,199,856,2936,68,49,23,0,0,440,247,161,133,338,58,35,38,235,23,7,21,10,0,15,20,8,32,33,27,20,"Kiyani Medical Practice","WF","WF-5","South Leytonstone"]
["WF_LDP",44136,44137,"F86625",6041,361,4027,7,178,11,7,5,109,221,155,92,1084,254,246,88,213,64,2870,224,966,4911,95,82,33,0,5,705,333,205,200,523,136,50,74,424,59,17,48,15,0,32,34,46,79,71,56,40,"LL Medical Care (Agarwal & Agrwal Practice)","WF","WF-5","South Leytonstone"]
["WF_LDP",44136,44137,"F86030",8294,486,5469,7,171,9,4,2,125,223,384,260,3854,418,402,75,193,31,4377,224,1027,6551,47,42,9,0,2,718,419,396,308,556,164,134,145,552,39,5,22,3,0,26,29,11,104,58,47,35," Queens Road Medical Centre","WF","WF-7","Walthamstow West"]
["WF_LDP",44136,44137,"F86011",9845,511,6545,13,195,65,30,17,141,261,383,158,2252,409,350,78,204,70,5129,387,1133,8133,159,140,48,3,12,1183,476,260,280,734,233,93,106,727,103,23,77,21,4,47,75,32,125,151,108,82,"The Manor Practice","WF","WF-3","Leyton Collaborative"]
["WF_LDP",44136,44137,"F86038",12058,639,7461,20,199,38,29,14,127,263,469,238,2433,544,432,216,420,109,5627,371,1880,9241,150,124,20,0,9,1154,603,445,315,846,247,137,160,803,47,7,44,10,0,32,27,16,148,111,85,61,"Sma Medical Centre","WF","WF-3","Leyton Collaborative"]
["WF_LDP",44136,44137,"F86036",15795,427,11031,2,226,57,9,22,168,368,520,189,3607,349,357,109,315,82,8397,563,1894,12743,239,180,37,0,9,1485,627,386,332,877,234,110,131,801,121,26,103,43,1,69,96,60,101,116,67,47,"The Allum Medical Centre","WF","WF-4","Forest Integrated Health"]
["WF_LDP",44136,44137,"F86001",7929,309,5390,10,185,20,12,3,110,331,192,70,2255,245,213,69,125,45,3909,216,913,6456,104,78,10,0,6,920,348,236,186,531,172,73,90,495,97,16,65,16,0,44,59,13,70,76,49,35," The Firs","WF","WF-6","Central Walthamstow"]
["WF_LDP",44136,44137,"Total",266431,10799,178432,467,5859,741,389,141,4191,8113,8856,4116,64519,8509,7651,2889,7337,1826,134675,10313,39681,213414,3176,2516,735,21,158,28528,12931,7094,6405,19236,4776,2310,2706,14530,2352,437,1824,642,32,1335,1693,893,2452,2465,1735,1225]
["WF_LDP",44136,44137,"F86006",6514,350,4348,1,152,5,2,0,74,178,107,50,1248,258,258,70,151,54,3319,277,695,5224,60,48,12,0,4,825,439,227,188,683,98,48,59,423,58,22,43,21,1,32,27,36,52,63,55,31,"Seymour Medical Centre","WF","WF-7","Walthamstow West"]
["WF_LDP",44136,44137,"F86005",8959,257,6017,4,273,6,3,0,198,360,192,110,2647,193,191,68,199,41,4415,389,1177,6984,60,49,19,2,3,803,406,167,173,581,89,43,55,334,116,15,101,33,3,77,87,46,52,62,37,28," The Penryhn Surgery","WF","WF-1","Chingford/ Walthamstow"]
["WF_LDP",44136,44137,"F86044",9841,224,7052,93,131,16,13,2,72,240,288,100,1481,149,192,70,150,56,4558,392,884,8088,109,78,17,0,2,763,245,145,148,404,82,27,29,387,32,7,30,11,3,11,22,12,29,61,30,15," Crawley Road Medical Centre","WF","WF-4","Forest Integrated Health"]
["WF_LDP",44136,44137,"F86607",14071,516,9311,34,250,74,38,6,200,336,493,237,4696,381,341,145,418,89,7490,603,2438,10825,187,153,48,5,15,1227,598,339,272,899,193,90,111,637,93,14,72,36,5,66,73,53,106,109,80,61,"Addison Road Medical Practice","WF","WF-6","Central Walthamstow"]
["WF_LDP",44136,44137,"F86088",4809,202,3403,5,111,5,2,1,73,184,118,47,879,143,177,46,116,25,2372,128,567,4073,46,34,5,0,1,667,227,89,131,350,102,59,66,359,38,7,30,8,0,19,29,18,39,39,26,19,"The Lyndhurst Surgery","WF","WF-4","Forest Integrated Health"]
["WF_LDP",44136,44137,"F86621",5983,259,4330,20,161,10,8,1,107,212,94,66,766,212,207,48,159,29,3381,271,1062,5064,74,63,11,0,5,604,320,209,175,454,98,63,67,310,32,3,25,12,0,19,29,24,58,56,48,35,"Green Man Medical Centre","WF","WF-5","South Leytonstone"]
["WF_LDP",44136,44137,"F86616",7438,272,4841,29,276,15,1,1,222,346,296,116,2046,229,190,106,281,52,3705,262,1548,5780,59,41,16,2,2,814,424,205,187,663,177,77,90,332,74,13,56,12,2,49,60,14,96,78,62,48,"Old Church Surgery","WF","WF-2","Chingford E4"]
["WF_LDP",44136,44137,"F86062",7323,322,5081,8,114,10,3,0,84,173,275,124,1535,248,265,74,218,38,4088,410,1340,6004,94,79,24,4,11,830,325,175,204,498,147,85,94,451,71,20,63,19,2,29,49,27,67,67,45,29,"Grove Surgery","WF","WF-7","Walthamstow West"]
["WF_LDP",44136,44137,"F86058",15598,529,10307,2,275,27,4,1,205,365,476,201,3819,420,364,146,433,113,7468,631,2197,12160,196,153,55,0,8,1464,665,275,318,916,226,93,112,740,105,17,77,32,0,60,81,27,126,117,83,67,"St James Medical Practice Ltd","WF","WF-7","Walthamstow West"]
["WF_LDP",44136,44137,"F86086",6301,186,3990,1,62,3,3,0,53,112,120,34,795,150,97,56,160,47,2930,230,820,4777,86,59,16,0,5,496,179,155,85,270,93,23,36,301,33,5,25,7,0,14,19,8,49,40,23,14,"Dr Dhital Practice","WF","WF-6","Central Walthamstow"]
["WF_LDP",44136,44137,"F86078",7057,246,4807,5,88,5,0,0,60,144,362,119,1869,186,162,74,175,34,3855,222,876,5977,53,39,12,0,1,1129,441,174,153,690,185,82,90,348,84,6,55,13,2,46,62,14,67,101,68,50,"The Ridgeway Surgery","WF","WF-2","Chingford E4"]
["WF_LDP",44166,44167,"F86666",14877,664,10178,15,318,84,67,23,207,402,654,369,4517,505,493,225,534,135,7410,689,2633,12040,230,191,71,0,10,1792,853,441,421,1294,203,118,136,865,119,37,90,47,0,72,88,29,106,114,85,50,"The Harrow Road Surgery","WF","WF-5","South Leytonstone"]
["WF_LDP",44166,44167,"F86664",8451,235,5390,38,168,11,9,2,152,233,202,48,1831,225,148,61,160,46,4310,259,861,6709,100,89,36,1,5,897,350,216,129,474,178,56,65,406,100,17,75,27,0,66,80,22,81,97,57,50,"Larkshall Medical Centre","WF","WF-1","Chingford/ Walthamstow"]
["WF_LDP",44166,44167,"F86689",4349,100,2996,2,88,3,3,1,71,103,54,27,690,68,81,24,51,15,2300,105,487,3321,30,24,5,0,5,302,156,98,64,219,52,29,31,124,39,1,32,8,1,27,24,17,30,25,20,16,"The Bailey Practice","WF","WF-1","Chingford/ Walthamstow"]
["WF_LDP",44166,44167,"F86679",6064,207,3903,15,91,9,8,1,76,115,121,84,1072,186,142,53,166,45,2994,275,988,4602,32,29,10,0,1,477,284,172,135,366,51,33,38,234,32,9,31,11,0,22,16,8,36,36,30,27,"Higham Hill Medical Centre","WF","WF-7","Walthamstow West"]
["WF_LDP",44166,44167,"F86627",13549,622,8775,10,419,43,26,11,246,661,674,326,3211,440,392,205,511,127,6772,625,2350,11083,209,164,61,6,8,1856,770,449,367,1290,399,219,257,806,231,37,174,67,7,148,168,73,188,222,147,94,"Churchill Medical Centre","WF","WF-2","Chingford E4"]
["WF_LDP",44166,44167,"F86626",6343,240,4313,11,103,11,11,1,88,120,174,82,1250,172,139,51,182,43,3257,263,1056,5056,50,40,10,1,3,501,233,180,135,361,80,34,42,267,23,6,21,5,0,19,14,6,47,26,22,20,"Dr Shantir Practice","WF","WF-1","Chingford/ Walthamstow"]
["WF_LDP",44166,44167,"F86650",8086,318,5507,29,152,11,6,2,109,222,256,82,1512,239,207,61,205,51,3864,263,1080,6543,112,82,16,0,4,711,268,239,189,393,121,41,50,493,61,15,43,14,0,41,39,37,61,75,45,29,"Lime Tree Surgery","WF","WF-4","Forest Integrated Health"]
["WF_LDP",44166,44167,"F86644",10037,362,6502,13,181,56,22,5,129,291,347,143,2315,253,237,120,208,67,4752,354,1127,7892,143,104,35,0,10,1160,442,279,227,704,194,85,100,531,104,16,63,26,1,68,75,25,73,68,39,29,"Waltham Forest Community & Family Health Services Ltd","WF","WF-6","Central Walthamstow"]
["WF_LDP",44166,44167,"F86712",3351,151,2431,6,66,5,4,2,35,90,38,20,537,111,125,32,71,20,1730,83,457,2842,18,17,4,0,3,340,147,134,100,242,50,26,28,203,10,4,6,1,0,10,9,2,21,16,14,8,"Hampton Medical Centre","WF","WF-4","Forest Integrated Health"]
["WF_LDP",44166,44167,"F86708",2772,131,1728,9,61,4,3,0,39,90,123,50,750,103,88,29,55,29,1443,91,328,2186,29,26,7,0,0,369,162,129,63,232,62,33,38,192,15,1,12,2,0,13,10,7,39,28,16,6,"Claremont Medical Centre","WF","WF-6","Central Walthamstow"]
["WF_LDP",44166,44167,"Y01839",6413,244,4269,16,150,8,2,0,131,195,185,82,1238,209,169,64,135,55,3178,262,684,5105,87,65,13,0,0,720,265,169,141,392,110,54,60,400,83,6,70,32,0,56,71,11,46,53,34,25,"Lime Tree & Sinnott Healthcare Ltd","WF","WF-1","Chingford/ Walthamstow"]
["WF_LDP",44166,44167,"Y01291",8891,351,5725,25,352,14,6,2,247,522,355,142,2261,305,298,116,306,63,4441,306,1454,7090,83,69,27,1,3,1210,510,306,243,800,194,99,110,460,117,29,96,31,0,80,88,99,85,124,94,63,"Chingford Medical Practice","WF","WF-2","Chingford E4"]
["WF_LDP",44166,44167,"F86700",3914,193,2509,12,233,11,10,2,192,295,154,60,620,161,115,40,112,11,1938,128,546,3167,44,35,8,0,2,778,445,168,117,645,124,52,60,217,117,15,83,32,0,99,89,73,70,85,66,53,"Kings Head Medical Practice","WF","WF-1","Chingford/ Walthamstow"]
["WF_LDP",44166,44167,"F86696",6317,300,4360,30,146,30,4,5,116,186,204,128,2108,229,219,86,212,33,3106,179,1478,5160,50,40,10,0,3,565,280,236,172,401,98,55,64,336,25,4,25,7,0,13,15,12,50,42,31,22,"Francis Road Medical Centre","WF","WF-4","Forest Integrated Health"]
["WF_LDP",44166,44167,"F86705",3451,173,2469,5,65,7,6,0,52,85,124,63,1248,133,124,52,120,23,1909,179,795,2891,26,22,6,1,3,321,158,162,105,230,59,33,41,206,26,2,22,11,1,25,16,13,40,23,19,9,"The Langthorne Sharma Family Practice","WF","WF-5","South Leytonstone"]
["WF_LDP",44166,44167,"F86701",3608,206,2511,5,108,29,24,2,90,137,167,103,1338,169,163,51,156,33,1844,193,828,2956,70,49,24,0,0,440,236,167,132,325,59,38,42,234,23,7,19,9,0,15,20,8,33,35,28,22,"Kiyani Medical Practice","WF","WF-5","South Leytonstone"]
["WF_LDP",44166,44167,"F86625",6023,367,4012,6,178,13,9,6,107,218,153,96,1061,255,257,84,209,62,2861,212,939,4893,96,82,30,0,6,700,334,256,208,534,136,58,80,421,59,17,48,15,0,40,34,46,82,72,56,39,"LL Medical Care (Agarwal & Agrwal Practice)","WF","WF-5","South Leytonstone"]
["WF_LDP",44166,44167,"F86036",15748,395,11013,1,206,56,8,22,143,365,519,170,3565,322,347,102,288,80,8254,519,1729,12717,239,177,37,0,8,1481,562,458,323,803,234,105,124,803,123,26,105,46,1,76,96,60,96,116,64,47,"The Allum Medical Centre","WF","WF-4","Forest Integrated Health"]
["WF_LDP",44166,44167,"F86030",8315,490,5489,7,169,10,6,3,125,222,386,263,3838,428,414,70,196,34,4395,216,1001,6566,48,41,8,0,3,724,424,414,319,561,162,132,143,555,40,5,25,4,0,30,29,11,106,57,46,37," Queens Road Medical Centre","WF","WF-7","Walthamstow West"]
["WF_LDP",44166,44167,"F86044",10012,220,7180,12,120,11,9,1,66,242,288,89,1491,140,187,67,140,54,4591,362,833,8236,114,81,18,0,2,768,241,187,148,404,83,27,30,394,33,7,32,12,3,17,22,12,28,64,34,15," Crawley Road Medical Centre","WF","WF-4","Forest Integrated Health"]
["WF_LDP",44166,44167,"F86038",11979,657,7392,26,212,36,29,11,141,265,457,251,2410,563,437,219,426,103,5544,349,1888,9160,149,123,16,0,8,1134,636,492,324,882,241,139,162,798,47,7,43,9,0,33,27,16,154,112,89,64,"Sma Medical Centre","WF","WF-3","Leyton Collaborative"]
["WF_LDP",44166,44167,"F86005",9029,259,6061,4,274,7,4,1,200,358,195,112,2633,195,192,71,182,44,4410,378,1154,7039,59,46,17,2,3,805,405,201,168,576,89,43,55,334,115,15,101,34,3,85,87,46,54,63,41,29," The Penryhn Surgery","WF","WF-1","Chingford/ Walthamstow"]
["WF_LDP",44166,44167,"F86001",7917,300,5377,9,181,19,11,3,111,332,191,73,2246,242,210,68,119,44,3829,167,865,6437,104,77,9,0,6,920,346,262,194,517,173,68,87,499,96,15,57,17,0,48,58,14,60,77,48,36," The Firs","WF","WF-6","Central Walthamstow"]
["WF_LDP",44166,44167,"F86011",9810,488,6514,13,195,60,25,14,151,260,383,139,2228,394,339,70,184,64,5061,367,1046,8105,160,139,43,2,13,1186,470,344,278,709,238,100,110,725,104,24,78,20,4,61,76,32,124,152,107,80,"The Manor Practice","WF","WF-3","Leyton Collaborative"]
["WF_LDP",44166,44167,"F86006",6551,343,4380,1,149,3,1,0,75,176,105,46,1252,257,256,60,133,51,3246,245,626,5261,61,49,12,0,4,824,425,240,186,662,98,47,57,423,58,22,44,22,1,37,27,37,50,63,52,28,"Seymour Medical Centre","WF","WF-7","Walthamstow West"]
["WF_LDP",44166,44167,"F86607",14111,492,9326,38,243,72,34,6,188,334,488,220,4690,370,341,134,393,85,7331,566,2245,10838,192,155,48,5,14,1229,570,411,271,845,193,84,103,638,91,13,70,33,5,72,72,51,102,109,71,56,"Addison Road Medical Practice","WF","WF-6","Central Walthamstow"]
["WF_LDP",44166,44167,"F86086",6296,160,3979,1,59,3,3,0,50,114,120,29,793,129,84,48,135,38,2874,208,702,4773,88,61,16,0,5,498,158,166,83,244,95,21,34,300,34,5,23,6,0,19,21,9,44,42,24,15,"Dr Dhital Practice","WF","WF-6","Central Walthamstow"]
["WF_LDP",44166,44167,"F86621",6009,251,4345,21,155,12,9,1,101,213,100,72,769,207,208,48,145,31,3334,245,999,5080,74,63,11,0,6,604,308,253,191,444,97,66,72,309,32,3,23,11,0,21,29,25,55,56,43,31,"Green Man Medical Centre","WF","WF-5","South Leytonstone"]
["WF_LDP",44166,44167,"F86616",7426,268,4826,26,271,14,1,1,219,342,291,121,2031,229,195,102,264,54,3683,247,1497,5770,60,40,14,2,2,813,415,232,189,656,179,80,93,322,73,13,55,11,2,59,60,15,97,77,61,45,"Old Church Surgery","WF","WF-2","Chingford E4"]
["WF_LDP",44166,44167,"F86058",15552,525,10275,3,268,21,3,0,196,363,477,197,3778,418,374,138,407,109,7387,605,2092,12134,196,153,55,0,7,1462,657,344,327,905,225,97,117,740,104,15,72,32,0,65,81,26,126,118,85,72,"St James Medical Practice Ltd","WF","WF-7","Walthamstow West"]
["WF_LDP",44166,44167,"F86045",2002,112,1422,2,50,20,12,3,27,64,100,61,687,90,94,43,89,19,1061,78,417,1702,34,28,5,0,2,276,134,88,70,201,57,35,41,130,22,3,13,2,1,18,17,5,33,24,18,6,"High Road Surgery","WF","WF-5","South Leytonstone"]
["WF_LDP",44166,44167,"F86078",7037,242,4792,7,86,4,0,0,57,144,361,111,1848,182,163,69,171,35,3829,215,833,5966,54,39,12,0,1,1123,418,226,158,652,183,84,92,350,82,6,53,12,1,59,62,13,67,100,66,48,"The Ridgeway Surgery","WF","WF-2","Chingford E4"]
["WF_LDP",44166,44167,"F86062",7335,331,5081,10,121,7,2,0,90,175,274,127,1529,258,265,71,207,38,4082,403,1281,6007,91,76,24,4,11,831,329,253,212,502,148,87,98,450,70,20,57,16,2,44,49,27,70,70,50,36,"Grove Surgery","WF","WF-7","Walthamstow West"]
["WF_LDP",44166,44167,"F86088",4818,198,3410,5,109,6,3,1,76,183,120,46,868,137,187,41,100,24,2351,127,502,4080,47,34,5,0,1,665,228,162,135,347,102,64,73,360,38,7,27,8,0,25,29,18,38,39,24,20,"The Lyndhurst Surgery","WF","WF-4","Forest Integrated Health"]
["WF_LDP",44166,44167,"Total",266443,10595,178440,433,5747,710,380,132,4103,8117,8840,4032,64215,8324,7690,2775,6972,1765,133371,9763,37801,213407,3179,2510,723,25,162,28482,12619,8534,6524,18812,4767,2342,2733,14525,2346,429,1788,640,33,1583,1698,905,2392,2480,1726,1227]
["WF_LDP",44197,44200,"F86607",14124,467,9337,42,243,64,27,5,186,335,489,212,4679,350,327,124,380,75,7253,559,2084,10846,194,159,49,5,13,1226,539,424,272,798,192,86,104,637,91,12,75,35,5,72,71,50,97,109,72,59,"Addison Road Medical Practice","WF","WF-6","Central Walthamstow"]
["WF_LDP",44197,44200,"F86088",4814,192,3409,3,108,5,2,1,76,182,120,50,863,132,185,37,89,25,2330,121,439,4074,46,35,5,0,1,662,218,197,135,340,103,62,69,361,39,8,27,9,0,27,29,19,43,39,20,16,"The Lyndhurst Surgery","WF","WF-4","Forest Integrated Health"]
["WF_LDP",44197,44200,"F86086",6275,130,3966,1,54,3,3,0,46,115,120,26,788,100,79,43,113,31,2819,188,590,4755,86,59,15,0,5,499,137,171,75,216,95,17,29,299,34,5,23,6,0,20,21,9,36,42,21,13,"Dr Dhital Practice","WF","WF-6","Central Walthamstow"]
["WF_LDP",44197,44200,"F86616",7426,255,4830,21,266,13,2,1,209,345,289,119,2029,214,197,94,253,49,3659,238,1434,5769,60,40,15,1,2,813,405,245,192,647,173,75,86,319,74,13,56,10,1,60,61,16,91,78,62,46,"Old Church Surgery","WF","WF-2","Chingford E4"]
["WF_LDP",44197,44200,"F86625",6021,374,4010,7,177,11,7,5,104,216,151,93,1048,252,260,83,211,63,2850,209,929,4890,95,80,29,0,6,700,332,270,216,537,136,58,79,420,59,17,48,15,0,41,34,47,83,71,59,39,"LL Medical Care (Agarwal & Agrwal Practice)","WF","WF-5","South Leytonstone"]
["WF_LDP",44197,44200,"F86621",6021,256,4365,11,160,13,11,1,105,218,105,74,776,216,217,52,140,31,3327,237,992,5090,77,64,11,0,5,605,297,263,195,429,97,66,72,306,32,3,22,12,1,23,29,25,53,56,42,31,"Green Man Medical Centre","WF","WF-5","South Leytonstone"]
["WF_LDP",44197,44200,"F86011",9798,472,6517,15,191,59,22,11,153,261,381,132,2215,392,324,72,170,65,5049,358,1040,8104,160,137,41,2,14,1168,473,401,265,687,234,97,109,722,102,24,80,22,4,62,74,33,122,153,114,86,"The Manor Practice","WF","WF-3","Leyton Collaborative"]
["WF_LDP",44197,44200,"F86078",7013,229,4786,7,87,5,0,0,58,144,355,109,1837,164,166,62,161,34,3799,213,773,5944,54,39,12,0,1,1115,406,235,163,623,181,87,96,348,79,6,52,11,1,59,61,13,63,102,69,49,"The Ridgeway Surgery","WF","WF-2","Chingford E4"]
["WF_LDP",44197,44200,"F86036",15790,378,11043,2,195,57,9,22,134,366,519,162,3556,305,362,90,274,77,8150,469,1620,12759,240,180,40,1,8,1486,530,519,325,772,235,107,125,807,123,26,102,43,1,83,96,61,90,119,59,41,"The Allum Medical Centre","WF","WF-4","Forest Integrated Health"]
["WF_LDP",44197,44200,"F86038",11939,649,7365,33,214,39,31,11,141,271,455,249,2423,553,433,210,430,108,5482,332,1896,9125,148,121,13,0,6,1127,615,525,322,861,235,136,161,796,47,7,45,10,0,33,28,18,151,110,89,64,"Sma Medical Centre","WF","WF-3","Leyton Collaborative"]
["WF_LDP",44197,44200,"F86627",13524,594,8772,8,410,39,22,10,254,657,671,318,3203,432,397,199,494,119,6692,596,2259,11072,212,166,61,6,8,1852,751,511,364,1244,392,221,258,807,230,36,170,64,7,159,169,74,186,220,143,94,"Churchill Medical Centre","WF","WF-2","Chingford E4"]
["WF_LDP",44197,44200,"F86030",8260,489,5447,5,161,10,6,3,120,219,379,254,3775,429,418,69,185,33,4349,201,963,6527,49,42,7,0,4,721,406,426,324,535,161,135,146,555,39,5,24,5,0,29,28,10,103,56,45,36," Queens Road Medical Centre","WF","WF-7","Walthamstow West"]
["WF_LDP",44197,44200,"F86058",15690,501,10395,4,260,21,3,0,189,362,480,186,3774,389,379,128,405,112,7475,610,2150,12266,201,157,57,0,8,1468,638,379,334,881,223,97,116,743,104,15,68,31,0,67,81,26,120,117,82,68,"St James Medical Practice Ltd","WF","WF-7","Walthamstow West"]
["WF_LDP",44197,44200,"F86062",7330,325,5086,10,116,10,5,3,87,172,275,127,1524,253,268,70,194,39,4079,397,1218,6006,91,77,25,4,13,831,323,279,211,501,146,86,96,452,70,19,57,16,2,51,49,26,67,70,51,39,"Grove Surgery","WF","WF-7","Walthamstow West"]
["WF_LDP",44197,44200,"F86044",10128,238,7266,2,117,12,10,0,64,240,281,88,1487,144,183,56,129,53,4526,317,758,8329,116,85,23,0,2,770,257,217,152,427,82,27,29,392,33,7,32,12,3,18,22,12,27,64,33,14," Crawley Road Medical Centre","WF","WF-4","Forest Integrated Health"]
["WF_LDP",44197,44200,"F86045",1998,119,1417,2,52,20,12,3,28,61,97,66,693,98,98,47,84,19,1062,77,415,1702,34,30,7,0,3,273,145,89,76,208,55,36,41,125,22,3,15,3,1,19,17,6,33,24,18,8,"High Road Surgery","WF","WF-5","South Leytonstone"]
["WF_LDP",44197,44200,"F86705",3460,174,2477,5,62,8,7,0,48,84,124,62,1246,137,123,48,122,23,1915,181,771,2899,26,22,6,1,3,322,152,165,108,229,59,36,44,207,26,2,22,10,1,25,16,13,38,23,20,10,"The Langthorne Sharma Family Practice","WF","WF-5","South Leytonstone"]
["WF_LDP",44197,44200,"F86708",2765,123,1722,11,59,3,2,0,38,91,122,45,740,95,89,26,49,29,1427,87,303,2185,29,26,7,0,0,368,142,131,63,211,62,31,36,193,15,1,12,2,0,13,10,7,37,29,16,7,"Claremont Medical Centre","WF","WF-6","Central Walthamstow"]
["WF_LDP",44197,44200,"F86700",3903,192,2508,12,226,1,1,0,186,291,155,59,615,159,112,37,106,9,1944,138,511,3160,44,34,7,0,2,773,450,173,116,643,121,45,54,215,116,15,90,38,0,99,87,71,69,85,67,55,"Kings Head Medical Practice","WF","WF-1","Chingford/ Walthamstow"]
["WF_LDP",44197,44200,"F86701",3634,206,2522,7,109,25,22,2,95,142,171,108,1348,167,166,55,144,31,1859,194,809,2976,67,50,25,0,0,444,239,174,134,330,57,39,43,234,23,7,22,10,0,16,20,9,32,38,31,23,"Kiyani Medical Practice","WF","WF-5","South Leytonstone"]
["WF_LDP",44197,44200,"Y01839",6407,227,4268,19,143,8,3,0,128,197,186,73,1235,196,177,64,128,53,3154,254,643,5099,85,62,13,0,0,721,261,202,146,380,109,54,60,403,82,6,68,31,0,61,70,11,42,55,33,26,"Lime Tree & Sinnott Healthcare Ltd","WF","WF-1","Chingford/ Walthamstow"]
["WF_LDP",44197,44200,"Total",266733,10389,178784,399,5616,667,366,121,4020,8109,8824,3960,64011,8170,7721,2649,6711,1718,132477,9365,36214,213709,3190,2533,731,25,159,28439,12400,9236,6553,18432,4721,2352,2726,14532,2339,426,1780,639,33,1669,1693,913,2328,2486,1723,1241]
["WF_LDP",44197,44200,"F86712",3370,149,2443,6,63,4,3,2,33,90,41,21,553,108,128,29,64,18,1710,76,411,2857,18,16,3,0,3,341,139,151,105,229,50,25,27,205,11,4,8,2,0,11,10,2,17,16,14,8,"Hampton Medical Centre","WF","WF-4","Forest Integrated Health"]
["WF_LDP",44197,44200,"Y01291",8887,347,5737,28,340,15,7,2,246,523,358,137,2270,311,290,114,297,64,4381,281,1433,7096,86,73,28,1,3,1212,505,331,230,776,191,103,113,460,118,29,93,28,0,97,91,99,86,126,92,67,"Chingford Medical Practice","WF","WF-2","Chingford E4"]
["WF_LDP",44197,44200,"F86650",8073,299,5505,0,140,13,9,1,98,221,255,74,1491,225,206,62,190,45,3820,251,1009,6528,111,83,16,0,4,711,265,267,180,381,120,40,48,496,61,15,43,14,0,44,39,37,59,75,43,28,"Lime Tree Surgery","WF","WF-4","Forest Integrated Health"]
["WF_LDP",44197,44200,"F86664",8487,257,5421,40,170,12,10,2,150,233,202,51,1855,247,162,57,157,48,4323,259,836,6736,100,89,36,1,5,897,372,243,140,498,177,60,69,408,100,17,77,30,0,73,80,22,82,95,62,55,"Larkshall Medical Centre","WF","WF-1","Chingford/ Walthamstow"]
["WF_LDP",44197,44200,"F86626",6410,236,4352,3,101,11,11,1,84,120,176,81,1276,167,140,49,178,38,3269,261,1018,5105,50,40,11,1,3,504,221,186,138,353,80,38,46,270,23,6,19,5,0,19,14,6,44,25,19,16,"Dr Shantir Practice","WF","WF-1","Chingford/ Walthamstow"]
["WF_LDP",44197,44200,"F86644",10011,358,6492,12,173,53,21,4,127,289,337,138,2312,255,238,110,204,60,4707,340,1059,7879,143,106,37,0,9,1148,436,295,231,683,194,85,100,530,102,15,55,23,1,69,73,24,74,68,38,29,"Waltham Forest Community & Family Health Services Ltd","WF","WF-6","Central Walthamstow"]
["WF_LDP",44197,44200,"F86689",4368,98,3007,3,85,4,4,1,68,101,56,27,695,69,79,21,55,16,2276,100,475,3335,33,27,6,0,5,303,158,101,63,211,52,31,32,123,40,1,34,9,1,28,24,17,31,26,21,17,"The Bailey Practice","WF","WF-1","Chingford/ Walthamstow"]
["WF_LDP",44197,44200,"F86696",6334,305,4376,28,139,12,5,3,115,181,206,134,2100,233,224,81,199,34,3054,156,1380,5182,50,40,10,0,3,571,297,260,178,430,98,53,62,343,25,4,25,6,0,15,15,12,52,44,35,26,"Francis Road Medical Centre","WF","WF-4","Forest Integrated Health"]
["WF_LDP",44197,44200,"F86666",14894,666,10205,17,306,83,68,23,205,398,659,375,4494,520,487,218,527,133,7411,683,2564,12056,229,192,69,0,8,1793,864,486,417,1299,206,120,137,863,121,38,89,46,0,79,89,32,109,114,85,53,"The Harrow Road Surgery","WF","WF-5","South Leytonstone"]
["WF_LDP",44197,44200,"F86679",6060,213,3899,21,94,9,8,1,73,124,121,86,1061,191,148,53,157,47,2979,257,945,4594,33,30,10,0,1,480,277,182,139,363,51,35,40,235,32,9,31,12,0,23,16,9,35,35,29,26,"Higham Hill Medical Centre","WF","WF-7","Walthamstow West"]
["WF_LDP",44197,44200,"F86006",6573,334,4400,2,152,2,0,0,73,176,105,46,1248,248,253,53,132,46,3202,223,544,5285,61,49,12,0,4,822,417,250,188,652,98,48,57,425,57,22,42,21,1,37,26,36,51,64,51,29,"Seymour Medical Centre","WF","WF-7","Walthamstow West"]
["WF_LDP",44197,44200,"F86005",9025,255,6054,5,268,6,4,1,190,354,192,106,2571,189,191,69,168,48,4351,354,1082,7034,58,47,17,2,3,793,400,212,166,568,86,44,54,335,114,15,99,33,3,86,85,45,49,63,40,28," The Penryhn Surgery","WF","WF-1","Chingford/ Walthamstow"]
["WF_LDP",44197,44200,"F86001",7921,282,5385,7,175,17,9,2,109,330,191,72,2231,230,215,67,122,43,3794,148,861,6445,104,76,8,0,4,920,333,276,190,490,170,72,88,498,95,14,55,15,0,51,58,16,56,75,48,35," The Firs","WF","WF-6","Central Walthamstow"]
["WF_LDP",44228,44229,"F86086",6253,95,3943,1,40,4,3,0,32,115,117,13,770,64,64,28,79,20,2736,151,392,4730,87,59,13,0,4,501,104,171,64,169,94,14,24,298,31,4,20,5,0,17,19,9,22,42,16,9,"Dr Dhital Practice","WF","WF-6","Central Walthamstow"]
["WF_LDP",44228,44229,"F86078",7006,206,4788,8,78,4,0,0,52,144,357,104,1816,155,164,50,145,30,3738,184,699,5936,53,38,11,0,1,1119,392,237,156,593,179,84,93,347,80,6,48,8,0,62,61,13,54,104,60,44,"The Ridgeway Surgery","WF","WF-2","Chingford E4"]
["WF_LDP",44228,44229,"F86058",15837,473,10535,6,240,18,2,0,173,361,479,179,3746,371,371,126,385,110,7587,624,2130,12425,203,157,56,0,8,1458,597,394,329,817,223,96,115,740,103,15,66,30,0,72,81,26,113,118,78,66,"St James Medical Practice Ltd","WF","WF-7","Walthamstow West"]
["WF_LDP",44228,44229,"F86062",7332,290,5101,10,106,11,5,3,84,171,273,115,1510,221,265,57,174,28,4077,400,1082,6013,91,77,25,4,12,827,301,285,209,461,144,82,93,451,66,17,51,16,2,50,47,24,63,70,50,38,"Grove Surgery","WF","WF-7","Walthamstow West"]
["WF_LDP",44228,44229,"F86616",7436,247,4846,18,257,11,1,1,200,341,290,113,2031,202,205,83,230,50,3636,231,1337,5782,60,41,16,2,2,807,398,250,192,620,169,72,83,320,71,12,55,12,2,58,59,16,84,76,59,43,"Old Church Surgery","WF","WF-2","Chingford E4"]
["WF_LDP",44228,44229,"F86621",6079,256,4415,10,147,19,14,1,96,216,105,72,779,218,215,56,136,32,3321,235,966,5144,84,71,15,0,5,597,273,262,194,388,96,67,74,303,32,3,21,12,2,23,28,26,50,55,39,31,"Green Man Medical Centre","WF","WF-5","South Leytonstone"]
["WF_LDP",44228,44229,"F86088",4814,177,3414,4,100,3,1,1,70,181,119,40,858,126,177,29,77,20,2259,111,350,4071,48,36,5,0,1,655,202,204,129,315,98,56,62,360,39,8,24,9,0,29,29,19,37,36,19,17,"The Lyndhurst Surgery","WF","WF-4","Forest Integrated Health"]
["WF_LDP",44228,44229,"F86607",14235,431,9427,41,236,59,24,5,184,343,488,200,4626,320,299,107,330,71,7166,517,1803,10947,193,154,43,4,10,1227,513,426,263,760,197,83,103,640,92,12,68,33,3,73,70,50,88,110,70,58,"Addison Road Medical Practice","WF","WF-6","Central Walthamstow"]
["WF_LDP",44228,44229,"F86045",2005,117,1424,3,47,20,9,5,25,62,99,64,701,98,98,47,84,17,1051,73,397,1712,35,32,8,0,4,273,142,90,76,201,55,35,40,126,23,3,16,3,1,20,18,6,34,23,17,7,"High Road Surgery","WF","WF-5","South Leytonstone"]
["WF_LDP",44228,44229,"F86006",6622,327,4432,2,144,3,0,0,75,176,108,51,1246,238,256,51,95,40,3141,186,432,5333,61,48,12,0,3,819,412,253,190,632,98,44,53,420,55,21,39,18,0,37,26,36,49,65,48,29,"Seymour Medical Centre","WF","WF-7","Walthamstow West"]
["WF_LDP",44228,44229,"F86011",9733,480,6489,15,193,87,31,19,151,256,388,135,2212,419,322,76,186,60,5034,351,1059,8042,157,143,49,2,18,1152,484,426,261,687,229,93,109,715,103,24,95,27,4,65,77,48,124,151,115,88,"The Manor Practice","WF","WF-3","Leyton Collaborative"]
["WF_LDP",44228,44229,"F86001",7901,251,5377,7,149,11,4,2,91,324,190,56,2233,203,209,64,102,37,3752,121,778,6432,104,75,5,0,3,912,294,276,178,433,166,71,87,497,94,14,50,11,0,51,58,16,51,75,43,32," The Firs","WF","WF-6","Central Walthamstow"]
["WF_LDP",44228,44229,"F86005",9019,248,6057,5,258,6,4,1,181,345,194,111,2504,183,192,63,146,41,4353,383,1019,7038,60,54,23,2,3,786,393,213,163,557,84,45,54,334,112,15,98,34,3,87,84,44,47,61,38,25," The Penryhn Surgery","WF","WF-1","Chingford/ Walthamstow"]
["WF_LDP",44228,44229,"F86038",11874,617,7318,34,207,39,26,13,136,271,459,242,2421,526,410,196,415,104,5429,330,1813,9078,145,125,18,0,7,1110,584,530,303,811,233,126,148,786,45,6,44,11,0,32,28,17,147,106,81,60,"Sma Medical Centre","WF","WF-3","Leyton Collaborative"]
["WF_LDP",44228,44229,"F86044",10246,235,7355,1,111,10,8,0,58,239,279,89,1476,146,184,48,99,45,4454,268,644,8427,116,83,21,0,2,770,252,220,150,408,84,25,28,394,33,7,32,12,3,18,22,12,27,64,32,17," Crawley Road Medical Centre","WF","WF-4","Forest Integrated Health"]
["WF_LDP",44228,44229,"F86030",8196,479,5405,3,153,10,6,3,116,217,375,250,3728,420,417,67,179,33,4294,194,911,6483,47,41,7,0,3,717,374,428,326,501,161,134,145,556,38,5,21,5,0,28,28,10,99,55,40,32," Queens Road Medical Centre","WF","WF-7","Walthamstow West"]
["WF_LDP",44228,44229,"F86036",15649,337,10933,3,180,50,8,21,122,360,519,136,3502,270,348,79,232,66,7819,395,1404,12628,230,165,32,1,8,1476,480,523,302,703,232,104,121,802,121,25,97,40,1,83,95,61,77,118,53,37,"The Allum Medical Centre","WF","WF-4","Forest Integrated Health"]
["WF_LDP",44228,44229,"F86701",3672,197,2549,7,102,24,20,2,85,134,171,106,1377,160,159,56,145,31,1864,186,777,2997,68,52,26,0,0,439,230,172,130,317,53,33,37,231,24,7,23,10,0,17,21,9,32,36,31,23,"Kiyani Medical Practice","WF","WF-5","South Leytonstone"]
["WF_LDP",44228,44229,"F86705",3499,168,2512,3,57,7,6,0,43,85,124,61,1256,128,125,45,114,18,1934,167,744,2936,27,23,6,1,3,325,144,168,107,222,60,38,46,211,26,2,22,10,1,25,16,13,39,24,19,9,"The Langthorne Sharma Family Practice","WF","WF-5","South Leytonstone"]
["WF_LDP",44228,44229,"F86696",6439,298,4461,8,133,12,4,3,106,177,207,130,2104,225,225,79,192,33,3050,156,1306,5269,48,38,10,0,1,578,317,266,179,457,97,53,62,346,24,3,23,6,0,14,13,11,54,44,33,23,"Francis Road Medical Centre","WF","WF-4","Forest Integrated Health"]
["WF_LDP",44228,44229,"F86700",3883,185,2504,11,216,0,0,0,177,287,154,53,607,153,108,35,95,9,1922,130,474,3148,44,33,6,0,2,771,439,172,111,626,121,37,46,215,114,15,87,36,0,98,85,69,67,82,63,51,"Kings Head Medical Practice","WF","WF-1","Chingford/ Walthamstow"]
["WF_LDP",44228,44229,"F86708",2771,110,1728,8,51,2,2,0,34,92,122,40,733,87,88,18,41,23,1411,76,249,2193,28,25,5,0,0,371,132,133,64,195,63,29,34,197,15,1,11,2,0,13,10,7,33,29,11,4,"Claremont Medical Centre","WF","WF-6","Central Walthamstow"]
["WF_LDP",44228,44229,"Y01839",6395,207,4247,18,140,10,4,0,122,199,183,69,1240,174,168,57,114,51,3117,247,571,5078,85,62,13,0,0,715,251,203,138,373,105,50,53,398,79,5,62,29,0,60,67,11,36,55,31,24,"Lime Tree & Sinnott Healthcare Ltd","WF","WF-1","Chingford/ Walthamstow"]
["WF_LDP",44228,44229,"Total",267045,9814,179132,379,5280,657,334,129,3770,8068,8827,3729,63695,7718,7517,2437,6172,1586,130908,8787,33382,214023,3179,2519,708,25,157,28312,11836,9379,6369,17507,4674,2262,2629,14484,2308,418,1741,622,30,1671,1671,920,2202,2466,1626,1181]
["WF_LDP",44228,44229,"F86712",3366,121,2441,4,53,4,3,2,25,89,41,18,552,81,119,20,55,17,1671,63,335,2853,18,16,3,0,3,338,120,148,96,201,49,22,23,201,10,4,7,1,0,10,9,2,16,16,12,7,"Hampton Medical Centre","WF","WF-4","Forest Integrated Health"]
["WF_LDP",44228,44229,"Y01291",8894,340,5744,30,323,15,5,3,233,524,357,128,2256,298,283,112,277,63,4261,241,1333,7103,86,70,25,1,2,1212,455,338,226,725,190,99,111,461,117,28,89,28,0,97,90,98,75,125,87,59,"Chingford Medical Practice","WF","WF-2","Chingford E4"]
["WF_LDP",44228,44229,"F86627",13501,529,8769,10,369,38,20,11,237,655,667,270,3199,382,372,183,462,104,6527,528,2099,11057,210,163,58,6,8,1837,684,514,342,1139,388,214,249,801,227,36,175,59,6,158,167,73,176,216,129,84,"Churchill Medical Centre","WF","WF-2","Chingford E4"]
["WF_LDP",44228,44229,"F86644",9998,326,6481,12,157,42,12,2,111,289,339,121,2327,230,240,94,196,50,4664,323,965,7867,143,103,31,0,9,1141,396,304,222,636,190,86,100,527,99,15,57,23,1,67,70,23,70,67,37,29,"Waltham Forest Community & Family Health Services Ltd","WF","WF-6","Central Walthamstow"]
["WF_LDP",44228,44229,"F86625",6001,366,3991,6,172,12,7,5,106,213,150,91,1027,245,250,74,205,59,2820,201,881,4871,95,82,30,0,7,697,331,274,214,531,135,56,77,417,56,16,45,14,0,40,32,45,77,72,59,42,"LL Medical Care (Agarwal & Agrwal Practice)","WF","WF-5","South Leytonstone"]
["WF_LDP",44228,44229,"F86626",6450,227,4377,2,100,10,10,0,82,120,176,70,1295,156,132,46,160,35,3209,235,922,5136,50,40,11,1,3,503,204,187,138,329,82,37,45,273,24,6,20,7,0,18,13,6,41,24,18,14,"Dr Shantir Practice","WF","WF-1","Chingford/ Walthamstow"]
["WF_LDP",44228,44229,"F86650",8143,274,5547,1,124,13,9,1,85,219,255,70,1482,211,198,59,176,41,3804,236,966,6585,114,85,15,0,5,712,253,275,172,358,118,38,46,497,62,15,45,14,0,45,39,37,72,77,39,25,"Lime Tree Surgery","WF","WF-4","Forest Integrated Health"]
["WF_LDP",44228,44229,"F86679",6014,210,3870,19,94,9,6,0,76,124,125,89,1045,187,144,55,149,47,2939,245,891,4559,30,27,6,0,1,476,286,183,140,370,50,35,39,230,30,10,29,11,0,21,16,9,36,33,29,27,"Higham Hill Medical Centre","WF","WF-7","Walthamstow West"]
["WF_LDP",44228,44229,"F86689",4358,90,2999,4,73,3,3,1,60,101,57,25,690,67,70,18,47,17,2196,94,427,3326,32,27,6,0,3,300,142,101,61,184,51,28,28,124,40,1,35,12,1,29,24,17,24,26,20,17,"The Bailey Practice","WF","WF-1","Chingford/ Walthamstow"]
["WF_LDP",44228,44229,"F86664",8457,244,5402,47,166,10,9,1,145,237,203,46,1872,236,160,49,146,42,4271,243,773,6717,97,86,32,1,6,887,356,251,136,468,174,60,70,403,99,18,72,29,0,72,78,22,77,94,63,56,"Larkshall Medical Centre","WF","WF-1","Chingford/ Walthamstow"]
["WF_LDP",44228,44229,"F86666",14967,656,10251,18,304,81,68,23,197,401,657,372,4474,518,480,210,504,142,7401,662,2453,12107,230,188,66,0,10,1804,901,502,408,1320,206,116,131,863,124,39,94,45,0,82,91,35,111,117,87,54,"The Harrow Road Surgery","WF","WF-5","South Leytonstone"]
["WF_LDP",44256,44257,"F86626",6470,210,4392,2,93,4,4,0,78,120,175,61,1322,143,125,39,145,30,3167,221,837,5157,50,39,9,0,3,507,189,186,131,305,82,33,41,274,24,6,20,8,0,18,13,6,39,24,17,12,"Dr Shantir Practice","WF","WF-1","Chingford/ Walthamstow"]
["WF_LDP",44256,44257,"F86625",5992,367,3985,6,175,13,6,5,104,214,151,90,1018,247,251,82,205,59,2829,210,884,4866,95,83,31,0,7,698,332,275,221,533,134,58,78,416,55,16,47,15,0,40,32,44,78,72,60,42,"LL Medical Care (Agarwal & Agrwal Practice)","WF","WF-5","South Leytonstone"]
["WF_LDP",44256,44257,"F86621",6143,254,4471,9,140,16,8,1,88,216,105,70,788,221,217,51,119,29,3326,237,911,5203,85,71,14,0,4,604,254,264,197,361,96,66,73,304,32,3,19,11,2,23,28,26,45,54,38,30,"Green Man Medical Centre","WF","WF-5","South Leytonstone"]
["WF_LDP",44256,44257,"F86627",13491,475,8766,12,332,31,14,10,219,649,666,248,3192,336,378,177,437,89,6445,492,1988,11054,208,156,50,6,7,1830,643,516,346,1053,389,211,250,800,231,36,191,58,5,162,168,77,159,213,116,76,"Churchill Medical Centre","WF","WF-2","Chingford E4"]
["WF_LDP",44256,44257,"F86664",8491,249,5422,47,166,10,9,0,146,238,206,46,1920,242,162,45,137,38,4273,241,741,6735,97,85,31,0,4,882,347,256,136,452,175,59,70,409,101,19,79,29,0,74,80,22,78,94,61,53,"Larkshall Medical Centre","WF","WF-1","Chingford/ Walthamstow"]
["WF_LDP",44256,44257,"F86650",8062,265,5489,1,126,12,8,1,82,218,251,69,1454,209,213,57,191,38,3782,241,963,6522,115,88,17,0,5,708,227,281,176,326,118,40,49,500,62,16,50,16,0,45,38,39,72,75,41,27,"Lime Tree Surgery","WF","WF-4","Forest Integrated Health"]
["WF_LDP",44256,44257,"F86644",9988,308,6476,12,150,36,7,1,107,295,340,110,2328,216,235,91,195,41,4662,321,914,7870,142,100,28,0,9,1145,368,321,225,608,191,86,99,530,99,15,58,23,1,68,71,24,69,69,39,30,"Waltham Forest Community & Family Health Services Ltd","WF","WF-6","Central Walthamstow"]
["WF_LDP",44256,44257,"F86616",7473,237,4873,11,246,10,1,1,191,344,291,109,2042,192,206,80,217,47,3640,224,1257,5811,58,39,14,1,2,811,389,250,193,622,170,67,77,329,71,9,57,12,1,59,60,14,78,76,57,43,"Old Church Surgery","WF","WF-2","Chingford E4"]
["WF_LDP",44256,44257,"F86062",7321,259,5096,12,95,10,5,3,77,170,268,105,1497,190,268,49,158,27,4066,396,966,6012,90,77,25,3,12,819,262,292,210,412,145,81,91,450,66,17,54,17,2,50,46,24,56,71,46,34,"Grove Surgery","WF","WF-7","Walthamstow West"]
["WF_LDP",44256,44257,"F86058",15976,448,10663,8,231,17,3,0,171,364,473,165,3741,354,357,119,356,105,7718,641,2126,12557,200,156,56,0,8,1457,578,408,317,779,223,96,115,742,103,15,65,30,0,73,81,26,108,120,76,62,"St James Medical Practice Ltd","WF","WF-7","Walthamstow West"]
["WF_LDP",44256,44257,"F86045",1997,115,1413,4,46,17,8,5,25,62,95,58,692,97,96,43,77,19,1040,70,370,1704,34,32,9,0,4,269,139,89,76,189,55,36,42,125,21,2,14,3,1,19,17,5,33,23,17,7,"High Road Surgery","WF","WF-5","South Leytonstone"]
["WF_LDP",44256,44257,"F86078",6981,171,4772,13,72,3,0,0,51,151,356,95,1795,128,157,44,126,25,3793,218,626,5916,53,41,14,0,1,1109,358,238,145,543,178,87,96,346,76,5,50,12,0,59,59,12,47,103,55,38,"The Ridgeway Surgery","WF","WF-2","Chingford E4"]
["WF_LDP",44256,44257,"F86607",14388,396,9556,32,223,53,20,6,173,344,486,185,4635,294,296,95,284,66,7180,480,1617,11094,193,153,39,4,8,1221,499,428,260,730,198,79,99,642,91,12,65,30,1,72,69,50,87,112,66,56,"Addison Road Medical Practice","WF","WF-6","Central Walthamstow"]
["WF_LDP",44256,44257,"F86088",4813,156,3421,4,89,2,1,0,63,180,117,36,856,112,183,21,48,14,2213,94,252,4078,48,36,4,0,1,654,187,203,127,275,98,59,64,360,36,7,21,8,0,26,26,17,33,34,18,16,"The Lyndhurst Surgery","WF","WF-4","Forest Integrated Health"]
["WF_LDP",44256,44257,"F86086",6243,65,3944,1,31,3,2,0,21,116,118,11,770,37,58,17,41,10,2692,130,236,4731,88,61,14,0,3,502,58,173,60,109,93,14,22,299,33,4,19,5,0,18,19,9,10,43,11,5,"Dr Dhital Practice","WF","WF-6","Central Walthamstow"]
["WF_LDP",44256,44257,"F86005",9094,238,6117,10,262,9,5,1,184,347,195,116,2485,178,191,70,145,45,4375,388,1057,7103,62,56,23,2,3,784,396,216,161,551,86,49,59,335,113,15,99,37,2,88,84,46,49,60,37,24," The Penryhn Surgery","WF","WF-1","Chingford/ Walthamstow"]
["WF_LDP",44256,44257,"F86001",7821,252,5334,4,144,9,4,1,90,318,192,60,2214,208,205,62,112,33,3739,119,780,6380,101,72,4,0,3,907,267,280,183,394,163,68,86,502,92,14,50,13,0,50,56,16,48,74,41,30," The Firs","WF","WF-6","Central Walthamstow"]
["WF_LDP",44256,44257,"F86006",6606,319,4431,1,123,2,1,0,62,174,106,48,1240,226,261,35,77,30,3038,143,304,5324,64,49,11,0,2,811,382,252,192,586,100,47,55,411,57,21,43,17,0,38,27,37,48,66,44,31,"Seymour Medical Centre","WF","WF-7","Walthamstow West"]
["WF_LDP",44256,44257,"F86030",8151,484,5371,3,144,10,5,3,106,215,378,249,3700,422,416,64,162,30,4267,190,872,6444,47,39,5,0,3,716,362,428,326,477,160,133,143,557,38,5,21,5,0,28,28,10,94,54,38,30," Queens Road Medical Centre","WF","WF-7","Walthamstow West"]
["WF_LDP",44256,44257,"F86011",9715,537,6484,12,191,99,33,22,155,255,400,169,2219,485,366,82,196,55,4993,336,1107,8029,159,143,54,3,18,1145,516,445,289,718,224,97,117,718,103,23,98,30,3,65,76,47,133,150,117,90,"The Manor Practice","WF","WF-3","Leyton Collaborative"]
["WF_LDP",44256,44257,"Y01839",6398,181,4260,16,130,10,4,0,114,199,180,61,1239,150,164,45,98,44,3090,237,487,5091,85,62,12,0,0,719,233,205,132,352,107,50,55,404,79,5,61,29,0,60,67,11,36,56,31,25,"Lime Tree & Sinnott Healthcare Ltd","WF","WF-1","Chingford/ Walthamstow"]
["WF_LDP",44256,44257,"Total",267250,9434,179409,360,5023,631,302,127,3600,8051,8808,3603,63551,7427,7503,2259,5759,1447,130076,8428,31365,214336,3184,2508,686,22,153,28269,11299,9493,6358,16649,4680,2238,2610,14525,2304,412,1760,627,24,1673,1663,923,2115,2465,1574,1142]
["WF_LDP",44256,44257,"Y01291",8884,335,5737,29,297,15,4,3,213,521,351,118,2233,296,287,100,264,58,4164,219,1241,7094,88,70,22,1,1,1204,412,341,228,660,189,92,103,461,117,29,88,27,0,97,90,98,66,129,87,57,"Chingford Medical Practice","WF","WF-2","Chingford E4"]
["WF_LDP",44256,44257,"F86708",2759,90,1719,7,45,1,1,0,27,92,122,37,725,67,85,15,36,19,1389,73,202,2192,28,25,5,0,0,370,118,130,62,174,61,30,34,194,15,1,11,2,0,13,10,7,26,28,11,5,"Claremont Medical Centre","WF","WF-6","Central Walthamstow"]
["WF_LDP",44256,44257,"F86712",3343,110,2424,4,49,4,3,2,24,88,41,19,549,74,109,18,41,19,1638,62,289,2833,19,17,3,0,3,338,111,149,91,183,49,20,21,201,10,4,8,1,0,10,9,2,17,15,10,6,"Hampton Medical Centre","WF","WF-4","Forest Integrated Health"]
["WF_LDP",44256,44257,"F86696",6488,303,4508,9,145,12,3,3,107,184,208,137,2093,230,220,72,182,33,3015,141,1258,5325,47,37,10,0,1,593,353,270,177,516,100,55,65,348,23,3,22,6,0,13,12,11,56,44,33,22,"Francis Road Medical Centre","WF","WF-4","Forest Integrated Health"]
["WF_LDP",44256,44257,"F86700",3884,183,2506,9,210,0,0,0,171,282,152,53,606,150,105,30,90,9,1922,126,456,3154,44,32,5,0,2,773,430,172,109,613,120,36,44,214,112,15,85,35,0,96,83,68,66,81,62,50,"Kings Head Medical Practice","WF","WF-1","Chingford/ Walthamstow"]
["WF_LDP",44256,44257,"F86689",4368,91,2995,3,69,2,2,1,56,99,58,25,687,62,71,23,45,18,2108,83,423,3329,31,26,5,0,2,299,140,100,61,185,52,30,31,123,40,1,32,12,1,29,24,16,26,25,18,16,"The Bailey Practice","WF","WF-1","Chingford/ Walthamstow"]
["WF_LDP",44256,44257,"F86679",5986,206,3840,12,93,9,6,0,77,124,124,85,1020,181,144,50,140,44,2868,216,844,4526,30,27,6,0,1,470,286,185,138,364,50,31,35,231,30,10,29,11,0,21,16,9,35,33,26,24,"Higham Hill Medical Centre","WF","WF-7","Walthamstow West"]
["WF_LDP",44256,44257,"F86666",14919,640,10226,16,298,81,61,21,197,398,655,365,4458,506,482,198,494,140,7368,637,2357,12082,228,184,61,0,13,1811,900,512,417,1312,208,112,129,874,126,38,96,44,0,85,93,36,112,118,90,53,"The Harrow Road Surgery","WF","WF-5","South Leytonstone"]
["WF_LDP",44256,44257,"F86038",11695,586,7186,35,199,38,27,12,131,270,468,230,2430,504,396,186,400,98,5334,321,1707,8927,146,127,22,0,10,1107,558,532,306,777,237,119,137,787,45,6,43,11,0,32,28,17,136,106,80,58,"Sma Medical Centre","WF","WF-3","Leyton Collaborative"]
["WF_LDP",44256,44257,"F86036",15745,284,10985,3,144,45,5,21,99,350,507,110,3480,220,326,56,191,50,7698,345,1174,12694,232,163,27,1,8,1471,356,517,275,528,232,101,117,796,120,24,90,38,1,82,95,63,73,120,44,29,"The Allum Medical Centre","WF","WF-4","Forest Integrated Health"]
["WF_LDP",44256,44257,"F86044",10388,255,7479,2,114,9,7,0,64,234,273,94,1472,161,187,42,97,37,4447,236,639,8548,115,80,19,0,2,765,266,236,152,419,85,28,33,397,32,7,30,11,3,18,21,12,33,62,40,27," Crawley Road Medical Centre","WF","WF-4","Forest Integrated Health"]
["WF_LDP",44256,44257,"F86701",3702,195,2569,8,100,33,29,3,88,134,174,105,1396,157,160,58,142,32,1877,182,775,3024,75,59,30,0,1,439,234,173,132,321,52,31,35,234,24,7,23,10,0,17,21,9,32,37,30,25,"Kiyani Medical Practice","WF","WF-5","South Leytonstone"]
["WF_LDP",44256,44257,"F86705",3475,170,2499,3,51,6,6,1,39,86,126,64,1255,132,126,43,111,16,1920,158,705,2927,27,23,7,1,2,331,149,170,107,222,60,37,45,212,27,2,22,11,1,25,16,13,37,24,17,9,"The Langthorne Sharma Family Practice","WF","WF-5","South Leytonstone"]
["WF_LDP",44287,44293,"F86664",8468,261,5414,46,165,14,14,0,143,237,209,52,1982,253,168,53,148,34,4284,257,777,6719,96,83,32,0,4,880,346,255,141,453,174,63,76,414,100,19,82,30,0,76,80,22,81,94,61,53,"Larkshall Medical Centre","WF","WF-1","Chingford/ Walthamstow"]
["WF_LDP",44287,44293,"F86666",14898,636,10216,15,287,81,56,22,195,388,652,373,4436,515,469,208,505,139,7369,619,2358,12079,225,184,64,0,15,1797,909,507,419,1294,205,111,127,869,125,34,98,46,0,85,91,37,110,120,95,58,"The Harrow Road Surgery","WF","WF-5","South Leytonstone"]
["WF_LDP",44287,44293,"F86036",15781,281,11021,4,138,18,6,5,97,350,507,106,3466,220,346,64,187,52,7730,348,1191,12741,233,168,32,1,7,1467,325,519,288,480,233,108,125,800,118,22,87,37,1,82,94,63,68,123,42,28,"The Allum Medical Centre","WF","WF-4","Forest Integrated Health"]
["WF_LDP",44287,44293,"F86696",6577,305,4577,10,143,13,6,2,105,184,208,134,2098,229,222,76,184,35,3060,127,1242,5403,45,35,9,0,1,615,370,274,179,536,99,56,64,352,24,3,23,6,0,13,12,11,56,44,35,24,"Francis Road Medical Centre","WF","WF-4","Forest Integrated Health"]
["WF_LDP",44287,44293,"F86689",4366,103,2986,4,74,2,2,1,65,100,59,32,684,71,73,25,54,19,2102,87,457,3319,31,26,5,0,2,298,168,100,58,206,52,31,32,123,41,1,32,12,1,29,24,16,33,25,20,17,"The Bailey Practice","WF","WF-1","Chingford/ Walthamstow"]
["WF_LDP",44287,44293,"F86679",5991,199,3847,11,88,8,4,0,72,120,122,84,1016,171,146,45,128,46,2852,197,822,4533,29,26,7,0,1,465,279,182,136,352,49,31,35,229,29,10,28,11,0,20,16,9,33,32,24,22,"Higham Hill Medical Centre","WF","WF-7","Walthamstow West"]
["WF_LDP",44287,44293,"F86650",8073,305,5497,5,131,13,10,1,86,220,252,83,1450,267,235,80,214,41,3838,259,1090,6531,112,86,17,0,6,704,257,291,191,344,118,42,53,499,61,16,51,16,0,44,37,39,73,74,45,29,"Lime Tree Surgery","WF","WF-4","Forest Integrated Health"]
["WF_LDP",44287,44293,"F86616",7549,226,4921,9,250,12,1,1,190,345,293,117,2043,183,209,70,231,45,3703,236,1284,5873,57,39,14,0,2,810,392,253,193,618,170,68,78,332,69,9,55,13,1,59,58,13,81,81,61,47,"Old Church Surgery","WF","WF-2","Chingford E4"]
["WF_LDP",44287,44293,"F86621",6194,254,4524,9,138,16,9,1,90,215,106,70,793,220,220,56,133,29,3393,244,949,5256,84,69,12,0,5,602,259,262,198,355,98,69,76,304,31,3,24,12,2,22,27,26,54,54,40,33,"Green Man Medical Centre","WF","WF-5","South Leytonstone"]
["WF_LDP",44287,44293,"F86088",4845,148,3445,4,91,2,0,0,63,178,116,34,844,103,195,16,39,17,2221,97,213,4110,49,37,5,0,1,657,182,204,133,269,100,65,69,361,36,7,20,8,0,26,26,17,36,34,19,16,"The Lyndhurst Surgery","WF","WF-4","Forest Integrated Health"]
["WF_LDP",44287,44293,"F86607",14530,410,9695,24,232,53,22,6,176,346,488,183,4611,315,308,89,278,70,7305,507,1565,11247,193,152,40,6,7,1235,525,436,264,755,200,92,111,644,94,13,70,32,2,74,71,54,90,113,72,64,"Addison Road Medical Practice","WF","WF-6","Central Walthamstow"]
["WF_LDP",44287,44293,"F86627",13521,470,8769,133,402,30,13,9,258,773,669,260,3184,334,391,175,446,90,6421,497,2000,11080,209,157,52,6,6,1836,661,514,365,1083,388,212,250,800,230,36,193,55,4,161,167,78,146,212,118,77,"Churchill Medical Centre","WF","WF-2","Chingford E4"]
["WF_LDP",44287,44293,"F86644",9860,290,6399,14,147,33,4,0,105,297,339,107,2313,195,234,86,195,44,4642,340,930,7769,137,96,26,0,8,1133,330,317,226,553,186,81,97,527,98,15,60,24,1,67,70,24,63,68,36,29,"Waltham Forest Community & Family Health Services Ltd","WF","WF-6","Central Walthamstow"]
["WF_LDP",44287,44293,"F86625",5969,369,3972,5,178,16,6,5,109,215,147,87,1009,253,254,89,214,60,2832,213,911,4851,95,85,33,0,7,697,332,273,227,534,134,61,81,415,54,16,47,15,0,39,31,46,84,72,58,40,"LL Medical Care (Agarwal & Agrwal Practice)","WF","WF-5","South Leytonstone"]
["WF_LDP",44287,44293,"F86626",6518,240,4421,2,104,15,11,0,90,119,172,64,1372,192,123,40,148,30,3194,225,877,5197,50,42,11,0,2,513,290,185,136,397,87,40,50,277,24,6,21,6,0,17,13,7,57,25,24,19,"Dr Shantir Practice","WF","WF-1","Chingford/ Walthamstow"]
["WF_LDP",44287,44293,"F86005",9124,249,6135,9,274,9,5,1,185,350,196,127,2450,190,199,76,157,53,4390,424,1171,7132,61,55,22,2,3,794,419,221,166,581,87,54,62,347,112,15,100,38,1,87,83,48,52,59,38,26," The Penryhn Surgery","WF","WF-1","Chingford/ Walthamstow"]
["WF_LDP",44287,44293,"F86001",7811,266,5337,5,148,8,4,1,100,316,194,69,2193,230,224,67,123,35,3764,127,823,6379,101,72,4,0,3,908,276,283,193,407,164,80,98,504,91,14,63,15,0,49,56,25,52,75,41,32," The Firs","WF","WF-6","Central Walthamstow"]
["WF_LDP",44287,44293,"F86006",6638,314,4441,1,119,2,1,0,60,173,104,46,1228,225,258,37,66,33,3053,152,279,5341,63,48,10,0,2,808,366,253,188,570,102,46,56,416,57,21,47,22,0,38,27,38,47,67,42,28,"Seymour Medical Centre","WF","WF-7","Walthamstow West"]
["WF_LDP",44287,44293,"F86030",8131,492,5350,4,150,9,5,3,110,212,374,251,3637,424,413,66,167,28,4273,195,875,6423,47,39,5,0,3,708,360,426,322,476,159,133,144,552,38,5,20,4,0,28,28,10,95,55,36,28," Queens Road Medical Centre","WF","WF-7","Walthamstow West"]
["WF_LDP",44287,44293,"F86011",9660,618,6457,11,205,95,33,20,168,251,411,212,2228,549,416,97,229,67,5001,348,1270,7996,159,145,53,2,20,1147,565,457,323,797,219,115,136,732,101,21,99,31,3,66,76,48,141,145,120,95,"The Manor Practice","WF","WF-3","Leyton Collaborative"]
["WF_LDP",44287,44293,"Y01291",8929,341,5773,29,287,14,2,2,203,523,350,128,2235,297,297,95,264,55,4164,223,1225,7131,94,74,22,0,1,1214,367,347,242,614,190,95,108,469,115,29,88,24,0,95,88,98,63,128,84,57,"Chingford Medical Practice","WF","WF-2","Chingford E4"]
["WF_LDP",44287,44293,"Y01839",6401,186,4269,13,129,11,5,0,117,200,184,67,1233,158,174,41,87,49,3082,238,480,5101,85,64,14,0,0,721,241,207,132,348,107,51,58,408,80,5,63,31,0,61,68,11,36,56,31,23,"Lime Tree & Sinnott Healthcare Ltd","WF","WF-1","Chingford/ Walthamstow"]
["WF_LDP",44287,44293,"F86712",3317,106,2399,9,50,4,3,2,25,92,41,17,533,75,107,16,47,18,1625,64,299,2803,17,15,2,0,3,340,103,149,93,175,49,19,20,201,10,4,7,1,0,10,9,2,18,15,11,7,"Hampton Medical Centre","WF","WF-4","Forest Integrated Health"]
["WF_LDP",44287,44293,"Total",267248,9639,179497,470,5134,615,308,106,3679,8162,8809,3748,63427,7678,7726,2319,5907,1496,130452,8597,32095,214483,3166,2511,705,21,154,28246,11415,9562,6506,16677,4681,2328,2713,14587,2297,406,1805,640,24,1678,1654,944,2143,2470,1586,1164]
["WF_LDP",44287,44293,"F86708",2768,91,1729,7,45,2,2,0,28,93,122,42,716,63,87,17,34,18,1392,66,185,2208,28,26,5,0,0,367,107,130,65,162,61,31,35,197,15,1,11,2,0,13,10,7,21,29,11,6,"Claremont Medical Centre","WF","WF-6","Central Walthamstow"]
["WF_LDP",44287,44293,"F86058",16124,464,10804,9,235,15,4,0,171,362,470,171,3764,366,364,124,376,117,7882,679,2309,12704,200,155,56,0,7,1450,586,431,317,797,220,98,119,752,104,16,66,32,0,77,81,27,111,119,73,61,"St James Medical Practice Ltd","WF","WF-7","Walthamstow West"]
["WF_LDP",44287,44293,"F86705",3531,170,2542,3,55,5,5,1,42,86,128,69,1308,131,126,49,122,17,1975,165,762,2977,25,21,7,1,2,332,147,169,110,223,60,37,43,211,27,2,22,11,1,25,16,13,34,23,18,10,"The Langthorne Sharma Family Practice","WF","WF-5","South Leytonstone"]
["WF_LDP",44287,44293,"F86062",7326,242,5108,8,95,9,3,3,76,169,268,109,1484,176,275,50,168,26,4067,404,967,6021,91,76,24,3,13,816,247,289,210,396,146,80,92,450,65,17,53,18,3,51,45,24,53,69,40,29,"Grove Surgery","WF","WF-7","Walthamstow West"]
["WF_LDP",44287,44293,"F86078",6976,155,4768,12,70,4,0,0,51,151,357,91,1790,127,159,41,108,21,3793,217,586,5922,53,41,14,0,2,1110,309,243,147,476,179,91,99,349,76,5,54,13,0,59,59,12,45,103,52,36,"The Ridgeway Surgery","WF","WF-2","Chingford E4"]
["WF_LDP",44287,44293,"F86086",6250,90,3949,0,30,4,3,1,18,113,120,14,773,51,63,18,36,8,2649,105,201,4733,88,63,15,0,2,501,58,172,60,109,91,14,20,301,33,4,18,4,0,18,19,9,11,42,8,5,"Dr Dhital Practice","WF","WF-6","Central Walthamstow"]
["WF_LDP",44287,44293,"F86038",11597,595,7081,29,198,37,25,11,128,265,466,227,2430,512,420,190,408,100,5277,313,1740,8832,147,132,26,0,11,1099,551,538,317,764,240,123,144,790,48,6,48,11,0,35,30,17,136,105,79,57,"Sma Medical Centre","WF","WF-3","Leyton Collaborative"]
["WF_LDP",44287,44293,"F86700",3898,181,2507,13,213,0,0,0,170,297,147,52,603,146,104,27,83,9,1910,121,428,3164,45,32,5,0,2,768,421,172,108,597,124,37,44,215,113,15,86,35,0,98,83,67,66,88,62,49,"Kings Head Medical Practice","WF","WF-1","Chingford/ Walthamstow"]
["WF_LDP",44287,44293,"F86044",9921,262,7154,2,115,7,5,0,68,226,263,101,1406,166,188,43,100,36,4257,222,656,8165,107,78,22,0,2,744,280,237,153,437,83,27,32,383,33,7,31,12,3,18,21,12,33,61,44,27," Crawley Road Medical Centre","WF","WF-4","Forest Integrated Health"]
["WF_LDP",44287,44293,"F86701",3717,204,2585,7,102,35,31,3,90,134,181,111,1423,169,160,52,149,32,1911,202,796,3045,75,58,31,0,1,445,243,176,133,327,52,31,36,237,24,7,23,10,0,17,21,9,31,37,30,26,"Kiyani Medical Practice","WF","WF-5","South Leytonstone"]
["WF_LDP",44287,44293,"F86045",1989,116,1405,4,46,19,8,5,25,62,94,58,692,102,99,41,79,23,1041,79,377,1698,35,32,9,0,3,265,144,90,73,192,55,36,43,127,21,2,15,3,1,19,17,5,33,23,16,6,"High Road Surgery","WF","WF-5","South Leytonstone"]
["WF_LDP",44317,44320,"F86679",6019,203,3871,11,88,8,4,0,72,119,122,86,1004,174,151,47,138,46,2898,211,873,4553,30,27,8,0,1,461,275,0,137,347,50,33,36,232,30,10,28,11,0,0,17,10,33,32,25,23,"Higham Hill Medical Centre","WF","WF-7","Walthamstow West"]
["WF_LDP",44317,44320,"F86689",4363,104,2983,4,74,1,1,1,68,99,60,33,678,74,76,26,57,20,2120,97,490,3313,30,25,5,0,2,298,168,0,58,206,52,34,35,122,40,1,31,12,1,0,23,15,32,24,19,15,"The Bailey Practice","WF","WF-1","Chingford/ Walthamstow"]
["WF_LDP",44317,44320,"F86644",9915,301,6451,14,153,33,5,1,109,298,339,116,2355,199,244,92,213,49,4724,363,1018,7826,137,97,28,0,9,1131,343,0,226,568,184,88,105,529,98,15,65,26,2,0,71,27,65,69,35,29,"Waltham Forest Community & Family Health Services Ltd","WF","WF-6","Central Walthamstow"]
["WF_LDP",44317,44320,"F86666",14858,652,10190,12,287,86,58,23,193,382,652,382,4427,528,468,224,525,143,7416,640,2463,12041,229,188,68,0,17,1789,917,0,420,1319,204,112,130,863,123,36,98,46,0,0,89,38,112,122,98,63,"The Harrow Road Surgery","WF","WF-5","South Leytonstone"]
["WF_LDP",44317,44320,"F86627",13437,491,8704,130,421,32,15,10,273,766,674,295,3180,345,407,193,474,97,6432,522,2160,11024,209,154,52,6,6,1835,691,0,369,1153,386,219,258,800,233,36,193,58,4,0,167,80,148,212,126,79,"Churchill Medical Centre","WF","WF-2","Chingford E4"]
["WF_LDP",44317,44320,"F86650",8098,309,5511,6,133,15,13,2,87,219,258,93,1510,260,246,89,240,44,3917,276,1266,6559,111,85,17,0,7,703,259,0,199,353,118,44,55,498,62,16,52,16,0,0,37,39,77,74,47,31,"Lime Tree Surgery","WF","WF-4","Forest Integrated Health"]
["WF_LDP",44317,44320,"F86664",8448,273,5401,29,162,15,15,0,138,235,209,57,2008,263,173,61,163,41,4291,264,874,6704,97,85,31,0,5,878,357,0,141,472,173,66,80,415,101,19,80,25,0,0,80,23,84,95,63,55,"Larkshall Medical Centre","WF","WF-1","Chingford/ Walthamstow"]
["WF_LDP",44317,44320,"F86696",6637,309,4624,12,145,16,7,2,108,186,215,147,2092,228,238,83,179,36,3074,136,1276,5455,45,36,10,0,1,641,401,0,172,561,98,60,66,354,24,3,24,6,0,0,12,15,60,45,36,27,"Francis Road Medical Centre","WF","WF-4","Forest Integrated Health"]
["WF_LDP",44317,44320,"Y01291",8949,362,5776,29,295,13,3,2,213,525,354,141,2220,320,313,112,288,64,4210,241,1336,7139,94,74,22,0,2,1215,402,0,249,656,189,101,115,470,115,29,87,24,0,0,88,99,69,129,85,58,"Chingford Medical Practice","WF","WF-2","Chingford E4"]
["WF_LDP",44317,44320,"F86712",3273,111,2373,5,52,4,3,2,26,91,40,17,526,78,111,19,49,18,1618,66,329,2764,15,14,3,0,3,340,107,0,98,180,49,20,21,203,10,4,7,1,0,0,9,2,18,16,11,6,"Hampton Medical Centre","WF","WF-4","Forest Integrated Health"]
["WF_LDP",44317,44320,"Total",281413,10618,189294,433,5495,661,336,116,3895,8471,9220,4166,66237,8413,8549,2654,6569,1688,138689,9655,36186,226132,3313,2648,749,25,184,29867,12473,0,7040,18331,4917,2569,2994,15485,2416,444,1874,663,27,0,1725,1018,2313,2622,1738,1277]
["WF_LDP",44317,44320,"Y01839",6369,196,4256,10,126,13,6,0,113,198,183,72,1211,165,187,41,95,50,3076,241,514,5079,84,63,13,0,0,715,238,0,139,349,108,50,59,406,80,5,54,28,0,0,68,11,36,56,33,24,"Lime Tree & Sinnott Healthcare Ltd","WF","WF-1","Chingford/ Walthamstow"]
["WF_LDP",44317,44320,"F86701",3737,207,2599,5,105,36,32,3,93,133,180,113,1444,171,161,57,151,34,1940,212,843,3064,74,59,31,0,1,451,250,0,134,340,50,30,35,239,24,7,22,10,0,0,21,9,30,37,30,26,"Kiyani Medical Practice","WF","WF-5","South Leytonstone"]
["WF_LDP",44317,44320,"F86700",3870,180,2483,8,217,0,0,0,166,295,144,53,598,144,107,26,88,11,1902,127,454,3144,46,33,6,0,2,761,418,0,107,598,124,45,52,216,112,15,87,35,0,0,83,67,67,90,63,52,"Kings Head Medical Practice","WF","WF-1","Chingford/ Walthamstow"]
["WF_LDP",44317,44320,"F86708",2785,97,1740,8,45,3,2,0,28,93,119,44,710,73,92,16,37,17,1394,67,193,2219,27,26,5,0,1,364,111,0,67,157,60,32,36,199,15,1,11,2,0,0,10,7,22,30,13,8,"Claremont Medical Centre","WF","WF-6","Central Walthamstow"]
["WF_LDP",44317,44320,"F86705",3574,176,2571,2,57,6,6,1,45,86,128,70,1337,131,129,53,123,18,2008,165,819,3008,27,22,7,1,2,337,153,0,110,232,60,38,44,213,27,2,22,11,1,0,16,13,36,23,19,12,"The Langthorne Sharma Family Practice","WF","WF-5","South Leytonstone"]
["WF_LDP",44317,44320,"F86626",6618,241,4491,2,105,15,11,0,89,122,173,67,1424,189,129,43,158,32,3284,243,944,5286,50,41,10,0,2,523,294,0,138,405,88,41,52,281,25,7,22,5,0,0,14,7,57,25,24,18,"Dr Shantir Practice","WF","WF-1","Chingford/ Walthamstow"]
["WF_LDP",44317,44320,"F86044",9863,269,7103,3,117,7,5,0,68,221,254,103,1379,173,191,51,113,38,4242,234,730,8111,106,77,22,0,2,741,288,0,159,455,83,30,35,379,33,7,31,12,3,0,21,12,34,60,45,28," Crawley Road Medical Centre","WF","WF-4","Forest Integrated Health"]
["WF_LDP",44317,44320,"F86045",2017,115,1417,4,45,21,8,5,25,61,95,58,698,101,97,40,79,23,1044,82,382,1714,35,32,9,0,3,263,144,0,71,190,54,34,41,126,21,2,14,3,1,0,17,5,33,24,17,6,"High Road Surgery","WF","WF-5","South Leytonstone"]
["WF_LDP",44317,44320,"F86036",15722,289,10979,5,144,18,6,4,103,343,503,112,3442,232,354,68,202,59,7731,364,1309,12692,229,166,30,1,8,1455,335,0,295,495,231,113,133,793,115,22,86,36,1,0,93,66,73,122,46,30,"The Allum Medical Centre","WF","WF-4","Forest Integrated Health"]
["WF_LDP",44317,44320,"F86038",11574,627,7082,19,205,40,29,11,137,264,469,244,2452,550,439,213,432,105,5289,327,1861,8842,148,132,25,0,13,1102,595,0,317,805,243,128,153,791,47,5,46,12,0,0,30,16,148,107,84,66,"Sma Medical Centre","WF","WF-3","Leyton Collaborative"]
["WF_LDP",44317,44320,"F86058",16091,480,10803,9,242,16,5,0,176,359,470,186,3779,390,377,135,404,128,7986,738,2514,12703,202,157,56,0,7,1442,610,0,323,819,218,105,126,753,105,16,66,32,0,0,82,27,112,120,78,65,"St James Medical Practice Ltd","WF","WF-7","Walthamstow West"]
["WF_LDP",44317,44320,"F86086",6211,115,3922,0,34,4,3,1,24,114,125,23,768,81,79,23,43,11,2654,115,251,4703,87,63,15,0,2,499,71,0,72,127,91,17,23,305,33,4,18,5,0,0,19,9,14,43,10,8,"Dr Dhital Practice","WF","WF-6","Central Walthamstow"]
["WF_LDP",44317,44320,"F86616",7585,240,4954,9,263,11,1,1,196,343,293,124,2056,193,224,80,256,47,3768,252,1414,5910,53,37,14,0,2,810,393,0,194,641,168,77,85,331,68,9,54,13,1,0,58,13,83,81,65,47,"Old Church Surgery","WF","WF-2","Chingford E4"]
["WF_LDP",44317,44320,"F86062",14634,500,10210,14,202,22,8,6,164,342,538,224,2948,358,554,118,352,68,8198,838,2160,12036,186,160,52,6,28,1628,526,0,428,830,292,162,186,902,132,34,108,34,6,0,92,48,114,140,82,62,"Grove Surgery","WF","WF-7","Walthamstow West"]
["WF_LDP",44317,44320,"F86078",6945,167,4742,11,71,4,0,0,54,151,357,97,1780,129,164,43,113,27,3748,207,621,5900,53,41,12,0,2,1104,315,0,155,486,180,90,101,346,74,5,49,12,0,0,58,12,45,103,54,38,"The Ridgeway Surgery","WF","WF-2","Chingford E4"]
["WF_LDP",44317,44320,"F86006",13336,674,8932,2,256,6,4,0,118,342,212,102,2456,484,536,80,136,70,6212,354,630,10732,124,102,24,0,6,1620,778,0,378,1214,204,102,124,836,116,42,92,44,0,0,54,76,94,130,90,54,"Seymour Medical Centre","WF","WF-7","Walthamstow West"]
["WF_LDP",44317,44320,"F86607",14673,449,9827,27,258,60,24,8,193,354,501,214,4682,347,329,114,310,81,7502,546,1763,11381,190,152,42,7,8,1247,592,0,284,856,198,95,114,653,92,12,71,31,1,0,70,52,95,115,74,66,"Addison Road Medical Practice","WF","WF-6","Central Walthamstow"]
["WF_LDP",44317,44320,"F86625",5947,370,3974,5,179,16,6,4,108,215,146,94,1005,256,255,97,218,62,2827,215,954,4839,95,84,32,0,7,694,332,0,226,536,135,65,83,413,56,17,49,15,0,0,32,46,84,69,57,40,"LL Medical Care (Agarwal & Agrwal Practice)","WF","WF-5","South Leytonstone"]
["WF_LDP",44317,44320,"F86621",6211,255,4535,8,140,17,9,2,90,215,106,72,806,220,220,59,144,32,3440,257,1035,5265,84,69,12,0,5,600,262,0,197,360,98,68,76,305,30,2,25,12,2,0,26,25,54,54,40,31,"Green Man Medical Centre","WF","WF-5","South Leytonstone"]
["WF_LDP",44317,44320,"F86088",4832,148,3424,2,85,2,0,0,56,178,117,35,836,102,200,16,40,16,2208,94,214,4089,49,37,5,0,1,661,177,0,137,267,100,70,74,363,36,7,19,7,0,0,26,17,34,35,18,15,"The Lyndhurst Surgery","WF","WF-4","Forest Integrated Health"]
["WF_LDP",44317,44320,"F86011",9648,638,6438,10,208,95,33,20,164,246,407,222,2185,565,431,108,256,68,5022,375,1368,7989,158,144,52,2,20,1142,581,0,338,834,221,121,144,733,99,21,98,30,3,0,74,48,146,148,129,106,"The Manor Practice","WF","WF-3","Leyton Collaborative"]
["WF_LDP",44317,44320,"F86030",8128,500,5355,5,151,11,6,5,106,214,378,256,3619,429,421,67,174,33,4300,211,921,6429,47,40,7,0,3,712,361,0,324,484,160,138,149,558,39,5,22,4,0,0,29,11,97,55,38,27," Queens Road Medical Centre","WF","WF-7","Walthamstow West"]
["WF_LDP",44317,44320,"F86001",7787,301,5318,3,154,7,4,1,104,311,198,75,2176,259,242,76,142,39,3782,139,899,6361,101,71,3,0,3,902,293,0,204,429,162,86,105,505,90,13,64,14,0,0,56,26,56,77,43,34," The Firs","WF","WF-6","Central Walthamstow"]
["WF_LDP",44317,44320,"F86005",9259,269,6255,10,276,8,4,1,188,351,201,139,2446,202,204,84,177,61,4432,436,1308,7258,61,55,21,2,3,803,436,0,174,607,86,55,63,353,111,15,79,31,1,0,83,47,51,60,41,28," The Penryhn Surgery","WF","WF-1","Chingford/ Walthamstow"]
["WF_LDP",44348,44349,"F86088",4848,149,3438,2,86,2,0,0,55,178,117,37,832,104,204,22,41,15,2227,108,234,4107,48,35,3,0,2,663,180,0,133,265,101,73,78,364,36,7,19,6,0,0,28,17,35,35,18,13,"The Lyndhurst Surgery","WF","WF-4","Forest Integrated Health"]
["WF_LDP",44348,44349,"F86078",6966,180,4755,11,76,3,0,0,54,153,357,106,1770,139,171,46,114,26,3698,199,599,5917,54,39,9,0,2,1106,327,0,160,505,181,93,104,347,76,5,45,12,0,0,58,12,47,104,51,35,"The Ridgeway Surgery","WF","WF-2","Chingford E4"]
["WF_LDP",44348,44349,"F86086",6180,115,3911,0,23,4,3,1,15,100,122,25,765,81,85,25,49,12,2642,124,263,4679,82,58,15,0,2,485,75,0,78,122,87,20,28,299,33,4,19,5,0,0,19,9,16,39,9,6,"Dr Dhital Practice","WF","WF-6","Central Walthamstow"]
["WF_LDP",44348,44349,"F86045",2005,113,1412,1,44,21,8,5,25,61,95,57,703,100,97,43,80,24,1050,87,394,1707,35,32,8,0,4,261,140,0,70,187,54,34,41,124,20,2,14,3,1,0,17,5,33,23,16,6,"High Road Surgery","WF","WF-5","South Leytonstone"]
["WF_LDP",44348,44349,"F86058",16118,496,10845,11,244,19,5,1,177,359,465,195,3782,404,394,152,445,133,8067,764,2781,12747,198,153,55,0,6,1439,624,0,327,840,223,109,132,765,106,16,65,31,0,0,82,27,115,119,77,65,"St James Medical Practice Ltd","WF","WF-7","Walthamstow West"]
["WF_LDP",44348,44349,"F86062",7341,254,5122,6,103,11,4,3,83,172,272,116,1465,177,273,62,190,35,4104,417,1165,6030,93,78,24,3,11,813,265,0,209,422,147,83,96,452,67,17,54,16,2,0,47,24,57,70,41,30,"Grove Surgery","WF","WF-7","Walthamstow West"]
["WF_LDP",44348,44349,"F86607",14803,468,9929,23,257,63,25,9,191,353,507,227,4734,364,337,128,342,88,7667,588,1939,11505,191,152,41,7,9,1252,627,0,282,897,196,95,112,659,90,11,71,30,1,0,69,50,93,115,79,62,"Addison Road Medical Practice","WF","WF-6","Central Walthamstow"]
["WF_LDP",44348,44349,"F86708",2794,118,1751,6,52,4,4,1,34,93,119,49,706,87,100,20,41,21,1385,68,242,2230,27,26,6,0,1,358,119,0,71,180,59,36,40,199,15,1,11,1,0,0,10,7,27,29,13,9,"Claremont Medical Centre","WF","WF-6","Central Walthamstow"]
["WF_LDP",44348,44349,"F86712",3310,133,2397,5,57,4,3,2,30,91,40,19,526,89,114,22,57,18,1623,68,375,2794,15,13,2,0,3,340,146,0,102,249,50,23,25,204,10,4,8,1,0,0,9,2,20,16,11,7,"Hampton Medical Centre","WF","WF-4","Forest Integrated Health"]
["WF_LDP",44348,44349,"Y01291",9029,378,5831,18,317,13,3,2,234,527,352,150,2215,331,319,127,306,72,4266,256,1472,7200,94,74,21,0,2,1223,436,0,248,717,191,106,122,473,116,29,85,23,0,0,89,101,69,128,86,63,"Chingford Medical Practice","WF","WF-2","Chingford E4"]
["WF_LDP",44348,44349,"F86705",3594,178,2590,0,57,8,8,1,47,86,129,74,1354,133,128,52,132,21,2017,167,848,3024,28,24,8,1,2,337,161,0,110,240,60,37,43,215,27,3,22,11,1,0,16,13,38,23,19,11,"The Langthorne Sharma Family Practice","WF","WF-5","South Leytonstone"]
["WF_LDP",44348,44349,"F86696",6751,311,4714,12,141,16,7,2,96,185,218,147,2085,230,236,88,185,37,3132,155,1329,5565,46,37,10,0,0,651,407,0,165,573,100,60,67,359,24,3,24,6,0,0,12,15,62,45,37,25,"Francis Road Medical Centre","WF","WF-4","Forest Integrated Health"]
["WF_LDP",44348,44349,"F86700",3865,174,2477,5,217,0,0,0,171,294,143,56,600,141,106,27,85,12,1880,117,455,3141,46,33,6,0,2,756,415,0,104,594,124,46,54,215,111,15,79,30,0,0,83,67,64,90,67,54,"Kings Head Medical Practice","WF","WF-1","Chingford/ Walthamstow"]
["WF_LDP",44348,44349,"F86701",3727,213,2592,7,111,36,32,3,95,140,183,119,1457,174,162,62,156,35,1960,225,891,3055,73,59,31,0,1,456,261,0,137,354,51,31,36,244,25,7,21,8,0,0,21,10,31,37,30,26,"Kiyani Medical Practice","WF","WF-5","South Leytonstone"]
["WF_LDP",44348,44349,"Y01839",6382,210,4274,11,127,14,6,0,115,195,186,80,1212,175,198,42,108,56,3075,233,552,5093,86,66,15,0,1,718,250,0,145,366,108,53,62,407,80,5,45,25,0,0,68,11,37,57,34,25,"Lime Tree & Sinnott Healthcare Ltd","WF","WF-1","Chingford/ Walthamstow"]
["WF_LDP",44348,44349,"F86011",9607,643,6411,14,211,94,32,20,159,247,405,228,2084,559,441,111,265,67,5010,388,1400,7955,157,143,54,2,21,1137,583,0,339,841,218,120,143,731,97,21,96,30,3,0,72,46,146,146,126,100,"The Manor Practice","WF","WF-3","Leyton Collaborative"]
["WF_LDP",44348,44349,"F86030",8094,505,5333,7,155,11,6,5,114,216,383,262,3580,441,420,68,182,33,4312,216,950,6403,46,39,8,1,3,709,366,0,313,495,160,138,149,555,38,5,21,3,0,0,28,11,98,55,38,27," Queens Road Medical Centre","WF","WF-7","Walthamstow West"]
["WF_LDP",44348,44349,"F86036",15630,304,10891,5,155,18,6,4,104,342,499,120,3415,242,358,75,226,65,7699,361,1419,12610,225,164,29,1,8,1452,345,0,298,518,235,119,139,790,112,21,83,35,2,0,90,63,75,124,49,31,"The Allum Medical Centre","WF","WF-4","Forest Integrated Health"]
["WF_LDP",44348,44349,"F86006",6710,364,4508,2,135,3,2,0,69,171,105,57,1229,261,277,41,74,42,3100,182,350,5401,64,53,14,0,2,806,401,0,185,627,102,57,68,416,57,21,37,18,0,0,26,37,46,66,49,31,"Seymour Medical Centre","WF","WF-7","Walthamstow West"]
["WF_LDP",44348,44349,"Total",267785,10344,180065,387,5376,663,350,118,3803,8127,8893,4209,63607,8185,8132,2726,6750,1760,132033,9366,37128,215139,3163,2519,716,22,167,28242,12148,0,6633,17819,4679,2486,2904,14670,2274,398,1716,600,22,0,1644,959,2241,2490,1677,1227]
["WF_LDP",44348,44349,"F86001",7765,326,5307,3,158,9,5,1,113,311,199,78,2189,285,259,76,155,48,3779,151,928,6351,101,72,4,0,2,899,303,0,213,439,162,87,107,513,88,13,63,14,0,0,55,26,62,78,44,33," The Firs","WF","WF-6","Central Walthamstow"]
["WF_LDP",44348,44349,"F86005",9280,279,6277,9,274,8,4,1,181,347,212,156,2426,196,208,94,198,70,4444,456,1438,7278,58,53,21,2,4,802,442,0,171,619,85,54,63,350,110,14,80,33,1,0,82,48,50,60,43,30," The Penryhn Surgery","WF","WF-1","Chingford/ Walthamstow"]
["WF_LDP",44348,44349,"F86621",6237,259,4560,7,145,18,9,2,89,216,106,71,808,221,219,62,152,34,3474,275,1108,5288,83,68,11,0,5,605,265,0,198,371,98,69,77,306,31,2,26,12,2,0,26,25,55,55,40,31,"Green Man Medical Centre","WF","WF-5","South Leytonstone"]
["WF_LDP",44348,44349,"F86625",5935,369,3967,6,179,18,8,6,110,216,148,97,1005,254,257,101,221,62,2782,209,967,4829,95,84,31,0,6,697,341,0,213,544,134,66,83,416,56,17,38,12,0,0,32,46,82,69,56,43,"LL Medical Care (Agarwal & Agrwal Practice)","WF","WF-5","South Leytonstone"]
["WF_LDP",44348,44349,"F86626",6577,242,4454,2,103,15,11,0,86,120,171,73,1430,184,132,43,161,36,3259,246,978,5241,49,43,12,0,1,525,293,0,135,405,89,41,52,283,24,7,21,5,0,0,14,8,56,25,24,19,"Dr Shantir Practice","WF","WF-1","Chingford/ Walthamstow"]
["WF_LDP",44348,44349,"F86616",7642,245,4996,10,267,12,1,1,199,344,299,136,2073,195,218,85,269,52,3825,254,1490,5961,54,36,14,0,2,816,420,0,192,666,170,78,86,336,67,8,54,13,1,0,58,13,84,83,63,44,"Old Church Surgery","WF","WF-2","Chingford E4"]
["WF_LDP",44348,44349,"F86044",9934,276,7142,3,118,7,5,0,67,223,256,105,1382,175,182,58,131,44,4230,231,808,8165,111,81,24,0,3,747,292,0,150,470,85,31,36,387,33,7,15,6,1,0,21,12,36,59,45,28," Crawley Road Medical Centre","WF","WF-4","Forest Integrated Health"]
["WF_LDP",44348,44349,"F86038",11588,652,7091,14,208,42,31,11,141,264,478,266,2487,570,449,228,456,112,5304,328,1978,8864,149,134,26,0,13,1105,620,0,326,835,245,135,160,796,46,5,45,11,0,0,30,16,148,109,88,67,"Sma Medical Centre","WF","WF-3","Leyton Collaborative"]
["WF_LDP",44348,44349,"F86627",13405,497,8695,126,418,34,18,10,259,758,673,298,3166,344,420,197,478,111,6402,530,2200,11005,208,153,52,5,6,1827,700,0,372,1151,386,219,262,797,231,36,192,62,4,0,167,82,152,213,129,79,"Churchill Medical Centre","WF","WF-2","Chingford E4"]
["WF_LDP",44348,44349,"F86666",14830,668,10173,7,300,88,59,22,199,384,659,400,4454,537,486,232,562,154,7462,672,2631,12016,232,193,72,0,18,1785,919,0,420,1326,201,116,133,866,119,33,98,48,0,0,86,37,111,121,100,69,"The Harrow Road Surgery","WF","WF-5","South Leytonstone"]
["WF_LDP",44348,44349,"F86664",8453,280,5418,20,171,17,17,0,148,238,212,63,2048,269,172,70,185,46,4329,276,980,6718,99,86,33,0,5,880,373,0,143,490,172,63,78,418,102,19,82,27,0,0,81,23,87,94,64,56,"Larkshall Medical Centre","WF","WF-1","Chingford/ Walthamstow"]
["WF_LDP",44348,44349,"F86689",4357,105,2974,3,73,1,1,1,69,98,60,32,680,79,75,26,58,24,2145,105,524,3303,30,25,5,0,2,294,164,0,58,201,53,34,36,123,40,1,31,12,1,0,23,16,32,24,19,16,"The Bailey Practice","WF","WF-1","Chingford/ Walthamstow"]
["WF_LDP",44348,44349,"F86679",6045,205,3893,11,88,9,5,1,72,121,123,84,991,176,144,49,148,48,2942,222,925,4580,30,28,8,0,2,462,274,0,133,347,50,30,33,229,30,10,27,9,0,0,17,11,33,32,24,22,"Higham Hill Medical Centre","WF","WF-7","Walthamstow West"]
["WF_LDP",44348,44349,"F86644",9921,319,6451,14,172,22,5,1,118,307,340,127,2378,206,246,96,230,56,4773,381,1095,7844,142,100,26,0,9,1138,352,0,233,603,186,87,105,535,96,14,73,26,2,0,70,31,68,72,40,32,"Waltham Forest Community & Family Health Services Ltd","WF","WF-6","Central Walthamstow"]
["WF_LDP",44348,44349,"F86650",8062,316,5486,6,134,19,17,2,84,217,260,99,1576,262,245,96,268,51,3969,307,1420,6533,114,85,18,0,7,698,262,0,200,360,116,43,54,497,61,15,52,16,0,0,38,38,76,75,48,32,"Lime Tree Surgery","WF","WF-4","Forest Integrated Health"]
["WF_LDP",44378,44379,"F86036",15454,343,10728,4,164,19,7,4,108,335,498,138,3399,273,366,85,246,68,7589,344,1493,12456,225,165,29,1,7,1446,380,0,301,563,234,118,135,789,110,21,59,24,1,0,88,64,76,124,54,35,"The Allum Medical Centre","WF","WF-4","Forest Integrated Health"]
["WF_LDP",44378,44379,"F86038",11571,675,7096,7,209,46,35,13,143,263,476,278,2517,599,463,235,484,122,5319,337,2081,8864,148,134,26,0,13,1103,651,0,337,855,244,142,168,798,47,7,46,11,0,0,30,17,149,107,83,65,"Sma Medical Centre","WF","WF-3","Leyton Collaborative"]
["WF_LDP",44378,44379,"F86011",9612,647,6411,10,208,91,31,19,151,244,401,224,1984,554,428,112,275,70,5038,410,1434,7964,158,146,56,1,20,1133,585,0,334,851,219,116,140,728,94,21,93,31,2,0,69,47,148,145,126,95,"The Manor Practice","WF","WF-3","Leyton Collaborative"]
["WF_LDP",44378,44379,"F86044",9921,270,7129,4,117,7,5,0,67,222,254,89,1366,173,153,58,138,47,4195,220,838,8156,115,82,22,0,1,746,294,0,129,472,83,28,34,384,33,7,14,5,1,0,21,12,35,58,44,26," Crawley Road Medical Centre","WF","WF-4","Forest Integrated Health"]
["WF_LDP",44378,44379,"F86005",9320,290,6323,7,275,10,5,1,183,345,214,158,2405,219,206,99,222,73,4506,478,1559,7317,59,54,22,2,4,802,459,0,175,642,84,54,65,349,110,14,80,35,1,0,82,47,53,61,43,30," The Penryhn Surgery","WF","WF-1","Chingford/ Walthamstow"]
["WF_LDP",44378,44379,"F86001",7756,350,5301,2,169,8,6,1,117,308,199,79,2183,304,267,79,164,48,3784,156,980,6345,101,72,4,0,2,895,323,0,222,475,163,89,109,520,87,12,62,14,0,0,54,25,66,77,45,32," The Firs","WF","WF-6","Central Walthamstow"]
["WF_LDP",44378,44379,"F86030",8111,511,5361,9,158,15,8,6,117,216,392,274,3558,442,410,72,188,37,4365,226,1004,6437,45,39,8,1,5,712,375,0,297,510,158,135,143,553,38,5,21,3,0,0,28,11,93,54,38,28," Queens Road Medical Centre","WF","WF-7","Walthamstow West"]
["WF_LDP",44378,44379,"F86006",6689,365,4491,1,126,2,1,0,67,167,107,61,1228,266,282,42,78,43,3102,193,368,5391,63,53,14,0,3,807,358,0,197,574,104,59,71,419,58,21,37,17,0,0,26,37,43,66,46,30,"Seymour Medical Centre","WF","WF-7","Walthamstow West"]
["WF_LDP",44378,44379,"F86689",4365,108,2965,3,73,1,1,1,66,98,60,33,682,81,77,29,61,26,2178,114,544,3301,30,25,5,0,2,293,164,0,62,208,53,34,36,122,40,1,31,12,1,0,23,16,31,24,19,16,"The Bailey Practice","WF","WF-1","Chingford/ Walthamstow"]
["WF_LDP",44378,44379,"F86696",6746,304,4712,11,138,16,7,2,96,186,217,141,2065,223,238,87,177,39,3103,146,1322,5556,46,37,10,0,0,607,356,0,165,514,100,60,67,361,24,3,18,2,0,0,12,15,59,45,37,27,"Francis Road Medical Centre","WF","WF-4","Forest Integrated Health"]
["WF_LDP",44378,44379,"F86700",3863,180,2482,4,216,0,0,0,172,293,141,59,601,146,108,26,93,12,1873,115,465,3139,47,32,5,0,2,754,423,0,104,596,123,47,58,216,113,15,80,29,0,0,88,69,57,92,62,50,"Kings Head Medical Practice","WF","WF-1","Chingford/ Walthamstow"]
["WF_LDP",44378,44379,"F86664",8445,285,5408,23,181,18,18,0,156,241,218,74,2085,273,174,85,196,46,4350,290,1086,6713,95,80,30,0,4,877,389,0,140,508,173,67,82,415,102,19,83,25,0,0,81,24,90,94,64,54,"Larkshall Medical Centre","WF","WF-1","Chingford/ Walthamstow"]
["WF_LDP",44378,44379,"F86666",14831,689,10189,8,311,89,61,23,212,389,656,414,4463,556,483,243,585,162,7532,677,2777,12040,233,192,71,0,20,1791,946,0,415,1368,200,116,133,872,119,33,101,48,0,0,87,39,116,122,103,68,"The Harrow Road Surgery","WF","WF-5","South Leytonstone"]
["WF_LDP",44378,44379,"F86679",6047,213,3905,3,88,9,6,2,72,119,127,89,977,178,142,55,165,48,2950,231,982,4595,30,29,9,0,2,464,270,0,123,344,49,29,32,233,30,10,27,9,0,0,17,11,34,32,24,22,"Higham Hill Medical Centre","WF","WF-7","Walthamstow West"]
["WF_LDP",44378,44379,"F86701",3724,212,2574,6,110,38,34,3,90,140,183,117,1478,164,154,63,173,37,1977,238,949,3042,72,59,32,0,1,455,258,0,133,356,51,32,36,248,24,7,21,9,0,0,20,11,30,36,29,23,"Kiyani Medical Practice","WF","WF-5","South Leytonstone"]
["WF_LDP",44378,44379,"Y01291",9024,393,5819,24,344,13,5,1,248,537,354,164,2212,345,319,134,343,82,4313,290,1592,7204,93,75,23,0,2,1226,486,0,247,786,196,110,129,479,114,29,68,21,0,0,88,101,75,129,91,66,"Chingford Medical Practice","WF","WF-2","Chingford E4"]
["WF_LDP",44378,44379,"Y01839",6385,217,4272,9,129,15,7,0,114,197,186,83,1206,177,193,46,117,59,3099,247,605,5090,87,67,16,0,1,717,258,0,140,374,109,53,63,407,80,5,43,24,0,0,68,12,39,58,36,27,"Lime Tree & Sinnott Healthcare Ltd","WF","WF-1","Chingford/ Walthamstow"]
["WF_LDP",44378,44379,"Total",268154,10690,180349,365,5511,685,379,118,3914,8129,8921,4408,63620,8484,8152,2865,7126,1854,132685,9661,39159,215568,3169,2523,711,20,169,28203,12445,0,6590,18245,4688,2507,2937,14744,2270,399,1667,586,21,0,1646,977,2295,2491,1681,1225]
["WF_LDP",44378,44379,"F86705",3563,186,2575,0,57,8,8,1,47,86,129,78,1351,137,129,52,141,21,2024,167,867,3007,29,25,8,1,2,338,168,0,112,246,60,39,43,217,27,3,22,10,1,0,16,13,39,23,19,11,"The Langthorne Sharma Family Practice","WF","WF-5","South Leytonstone"]
["WF_LDP",44378,44379,"F86708",2824,139,1775,8,66,5,5,1,47,97,116,58,703,108,109,25,53,23,1398,69,292,2256,27,26,6,0,2,364,145,0,82,206,59,36,40,203,16,1,14,1,0,0,11,9,29,29,14,9,"Claremont Medical Centre","WF","WF-6","Central Walthamstow"]
["WF_LDP",44378,44379,"F86712",3295,138,2382,5,57,0,0,0,30,91,41,19,533,93,109,25,64,25,1619,75,411,2782,14,11,2,0,2,339,145,0,98,254,50,26,29,202,14,4,13,2,0,0,11,2,22,16,11,7,"Hampton Medical Centre","WF","WF-4","Forest Integrated Health"]
["WF_LDP",44378,44379,"F86650",8053,334,5466,6,137,18,16,2,85,216,262,116,1586,276,248,109,292,56,4025,328,1564,6518,114,84,16,0,8,697,298,0,204,413,117,48,60,501,60,14,51,17,0,0,39,38,78,76,50,33,"Lime Tree Surgery","WF","WF-4","Forest Integrated Health"]
["WF_LDP",44378,44379,"F86078",6911,179,4731,10,80,4,0,1,58,152,356,112,1761,135,173,39,108,29,3642,193,579,5875,54,35,5,0,2,1100,335,0,162,512,179,96,110,345,74,6,42,12,0,0,57,11,48,105,46,29,"The Ridgeway Surgery","WF","WF-2","Chingford E4"]
["WF_LDP",44378,44379,"F86086",6163,125,3897,0,28,4,3,1,20,99,121,30,759,95,91,29,51,14,2642,126,281,4663,81,57,14,0,2,483,91,0,82,134,87,24,33,298,33,4,19,5,0,0,19,9,19,39,9,6,"Dr Dhital Practice","WF","WF-6","Central Walthamstow"]
["WF_LDP",44378,44379,"F86088",4871,148,3456,3,79,2,0,0,52,178,117,38,834,108,200,25,44,18,2245,112,271,4130,48,35,3,0,2,661,178,0,137,260,100,70,75,365,36,7,17,5,0,0,28,17,36,34,18,12,"The Lyndhurst Surgery","WF","WF-4","Forest Integrated Health"]
["WF_LDP",44378,44379,"F86045",2017,113,1425,1,44,21,9,5,24,61,95,56,706,100,96,44,82,23,1059,96,408,1716,37,33,9,0,4,262,142,0,66,187,54,37,43,126,20,2,13,3,1,0,17,5,33,24,16,5,"High Road Surgery","WF","WF-5","South Leytonstone"]
["WF_LDP",44378,44379,"F86058",16369,534,11042,12,237,23,9,1,177,363,468,206,3819,435,409,165,456,129,8117,771,2940,12967,205,157,57,1,4,1445,597,0,333,821,226,108,130,777,106,16,59,28,0,0,83,27,116,119,74,63,"St James Medical Practice Ltd","WF","WF-7","Walthamstow West"]
["WF_LDP",44378,44379,"F86062",7329,270,5116,6,108,13,6,3,87,171,270,123,1461,191,272,66,194,37,4032,397,1198,6027,91,77,22,3,10,812,281,0,201,442,148,82,95,458,67,17,53,16,1,0,48,25,60,71,41,31,"Grove Surgery","WF","WF-7","Walthamstow West"]
["WF_LDP",44378,44379,"F86607",14915,482,10027,22,269,65,29,8,202,356,506,250,4746,375,355,130,349,91,7830,631,2039,11623,195,161,47,6,10,1252,624,0,291,902,195,98,114,666,90,11,68,28,4,0,70,51,98,116,81,62,"Addison Road Medical Practice","WF","WF-6","Central Walthamstow"]
["WF_LDP",44378,44379,"F86626",6678,242,4517,2,102,16,12,1,85,120,172,79,1461,185,132,48,174,38,3291,249,1022,5317,51,45,13,0,1,533,290,0,129,406,89,39,51,288,24,7,21,6,0,0,15,9,53,25,24,19,"Dr Shantir Practice","WF","WF-1","Chingford/ Walthamstow"]
["WF_LDP",44378,44379,"F86627",13427,532,8708,123,455,38,22,8,290,758,682,312,3161,381,414,193,508,122,6461,556,2312,11023,208,152,48,4,7,1834,758,0,366,1209,387,211,254,808,229,35,193,66,2,0,163,85,160,211,134,89,"Churchill Medical Centre","WF","WF-2","Chingford E4"]
["WF_LDP",44378,44379,"F86644",9973,335,6482,15,183,20,5,2,127,309,343,134,2424,223,243,107,248,62,4848,407,1181,7894,139,97,24,0,10,1142,368,0,231,644,186,85,104,532,97,14,78,28,3,0,71,34,77,71,39,32,"Waltham Forest Community & Family Health Services Ltd","WF","WF-6","Central Walthamstow"]
["WF_LDP",44378,44379,"F86616",7699,256,5029,8,271,16,2,1,204,341,302,150,2090,201,230,94,278,54,3885,271,1545,6007,52,37,14,0,2,815,440,0,185,692,170,81,89,337,67,8,55,14,1,0,59,13,90,83,66,49,"Old Church Surgery","WF","WF-2","Chingford E4"]
["WF_LDP",44378,44379,"F86621",6282,264,4601,1,142,18,9,2,91,212,111,78,817,229,225,65,164,36,3523,288,1212,5328,82,67,11,0,5,601,264,0,187,377,99,69,78,308,30,2,25,12,2,0,25,25,57,55,40,32,"Green Man Medical Centre","WF","WF-5","South Leytonstone"]
["WF_LDP",44378,44379,"F86625",5921,361,3954,8,180,17,7,5,109,219,147,94,999,239,254,99,215,57,2771,213,958,4825,95,83,30,0,7,697,346,0,203,544,139,69,88,420,57,18,40,14,0,0,32,46,86,70,55,42,"LL Medical Care (Agarwal & Agrwal Practice)","WF","WF-5","South Leytonstone"]
["WF_LDP",44409,44410,"Y01291",9021,398,5826,22,355,14,6,1,250,533,355,178,2215,348,323,146,360,91,4341,294,1707,7209,92,72,22,0,3,1231,538,0,240,861,193,114,132,477,112,29,71,22,0,0,87,98,82,126,90,65,"Chingford Medical Practice","WF","WF-2","Chingford E4"]
["WF_LDP",44409,44410,"F86712",3308,145,2387,5,58,4,1,2,31,91,43,24,556,102,116,28,81,29,1645,72,479,2791,14,12,3,0,2,338,152,0,98,258,50,27,30,204,13,3,11,1,0,0,10,2,25,16,11,6,"Hampton Medical Centre","WF","WF-4","Forest Integrated Health"]
["WF_LDP",44409,44410,"Total",268418,10988,180557,365,5592,731,417,128,3993,8123,8979,4571,63610,8762,8150,3001,7459,1926,133179,9895,40830,215850,3171,2529,710,22,176,28181,12893,0,6538,18808,4671,2513,2953,14799,2253,397,1651,581,22,0,1638,983,2353,2488,1720,1259]
["WF_LDP",44409,44410,"Y01839",6355,234,4252,5,132,15,7,0,114,195,188,87,1197,192,189,47,122,63,3090,248,627,5070,87,67,16,0,1,714,270,0,148,392,110,50,62,410,80,5,44,23,0,0,68,12,44,59,39,32,"Lime Tree & Sinnott Healthcare Ltd","WF","WF-1","Chingford/ Walthamstow"]
["WF_LDP",44409,44410,"F86062",7322,283,5106,6,110,19,12,7,86,172,277,129,1450,196,262,67,207,38,4020,404,1255,6015,89,75,21,4,11,813,285,0,196,450,148,79,91,467,67,17,55,18,2,0,48,25,60,71,45,32,"Grove Surgery","WF","WF-7","Walthamstow West"]
["WF_LDP",44409,44410,"F86078",6961,194,4770,10,82,5,0,2,58,154,357,122,1748,145,177,43,118,31,3663,195,600,5912,56,37,6,0,2,1098,343,0,154,520,178,96,110,348,74,6,42,12,0,0,57,11,50,104,52,34,"The Ridgeway Surgery","WF","WF-2","Chingford E4"]
["WF_LDP",44409,44410,"F86045",2010,114,1419,0,44,21,11,5,23,61,100,61,716,100,98,46,87,23,1052,92,421,1710,37,32,9,0,4,265,143,0,68,188,55,35,45,131,19,1,13,3,1,0,16,4,33,23,15,5,"High Road Surgery","WF","WF-5","South Leytonstone"]
["WF_LDP",44409,44410,"F86058",16489,560,11140,12,243,37,23,2,182,363,460,216,3813,458,421,179,482,131,8251,811,3121,13066,205,160,55,1,8,1446,621,0,335,869,226,109,132,784,109,16,62,30,0,0,85,28,119,124,83,67,"St James Medical Practice Ltd","WF","WF-7","Walthamstow West"]
["WF_LDP",44409,44410,"F86607",15005,514,10097,20,271,71,34,9,200,357,511,262,4734,404,370,132,371,96,7940,639,2172,11704,198,167,52,6,12,1251,659,0,283,948,197,107,124,660,89,11,69,29,3,0,70,50,109,117,84,64,"Addison Road Medical Practice","WF","WF-6","Central Walthamstow"]
["WF_LDP",44409,44410,"F86616",7761,269,5050,6,272,20,6,2,213,340,305,159,2105,225,232,97,267,49,3883,264,1475,6042,52,37,13,0,2,814,456,0,193,692,169,84,93,343,66,8,54,14,1,0,58,14,91,82,64,51,"Old Church Surgery","WF","WF-2","Chingford E4"]
["WF_LDP",44409,44410,"F86086",6158,160,3895,1,38,7,5,1,31,98,121,33,763,127,93,32,70,23,2679,143,369,4658,81,57,14,0,3,481,141,0,86,188,86,26,34,298,33,4,23,6,0,0,19,9,33,41,16,14,"Dr Dhital Practice","WF","WF-6","Central Walthamstow"]
["WF_LDP",44409,44410,"F86088",4899,152,3472,5,87,2,0,0,56,181,122,43,827,109,202,27,44,19,2264,118,284,4156,48,35,3,0,2,661,180,0,133,269,99,71,75,363,36,7,15,4,0,0,28,17,34,34,17,10,"The Lyndhurst Surgery","WF","WF-4","Forest Integrated Health"]
["WF_LDP",44409,44410,"F86006",6663,362,4479,2,123,4,2,0,72,167,111,61,1233,270,281,41,90,45,3096,191,387,5381,63,53,15,0,3,803,356,0,199,567,102,60,72,420,57,21,37,16,0,0,26,36,43,63,43,29,"Seymour Medical Centre","WF","WF-7","Walthamstow West"]
["WF_LDP",44409,44410,"F86011",9604,667,6421,10,207,89,33,19,151,245,414,240,1925,555,426,110,294,71,5054,446,1525,7967,157,147,55,1,18,1136,601,0,333,872,219,111,137,738,93,21,92,31,2,0,69,47,149,145,125,91,"The Manor Practice","WF","WF-3","Leyton Collaborative"]
["WF_LDP",44409,44410,"F86001",7750,374,5303,4,174,6,4,0,122,306,198,81,2187,327,269,92,175,54,3785,165,1040,6344,99,74,7,0,1,890,354,0,232,512,160,85,103,525,84,12,61,14,0,0,51,24,73,77,47,35," The Firs","WF","WF-6","Central Walthamstow"]
["WF_LDP",44409,44410,"F86005",9378,292,6361,8,272,11,6,1,183,344,208,156,2386,229,206,104,227,73,4472,478,1635,7372,58,53,21,2,4,804,469,0,175,647,84,53,63,349,108,13,76,32,1,0,80,46,53,60,41,30," The Penryhn Surgery","WF","WF-1","Chingford/ Walthamstow"]
["WF_LDP",44409,44410,"F86038",11548,696,7085,2,211,46,37,14,143,262,478,291,2518,615,460,236,494,132,5311,333,2148,8866,146,131,27,0,11,1105,655,0,319,875,248,145,171,800,46,7,44,10,0,0,30,21,156,107,84,65,"Sma Medical Centre","WF","WF-3","Leyton Collaborative"]
["WF_LDP",44409,44410,"F86044",10024,299,7209,4,127,7,4,0,72,223,257,103,1364,210,156,65,158,51,4255,243,947,8249,117,85,23,0,1,751,316,0,131,496,83,30,36,389,32,6,15,5,1,0,20,12,36,59,43,23," Crawley Road Medical Centre","WF","WF-4","Forest Integrated Health"]
["WF_LDP",44409,44410,"F86030",8119,497,5378,11,157,18,11,6,117,216,391,264,3542,434,395,76,188,38,4388,231,1004,6453,45,39,10,1,5,710,365,0,296,500,156,132,142,554,38,5,22,4,0,0,28,11,90,54,36,27," Queens Road Medical Centre","WF","WF-7","Walthamstow West"]
["WF_LDP",44409,44410,"F86036",15311,363,10608,4,173,20,7,3,118,331,501,149,3378,284,360,92,267,73,7501,343,1561,12334,225,168,30,1,8,1443,394,0,292,579,233,114,130,788,108,21,47,19,1,0,87,66,77,124,60,39,"The Allum Medical Centre","WF","WF-4","Forest Integrated Health"]
["WF_LDP",44409,44410,"F86689",4363,110,2962,2,77,1,1,1,71,98,59,32,678,86,76,30,66,25,2213,125,553,3304,30,25,5,0,2,293,201,0,60,250,55,33,35,122,41,2,31,12,1,0,24,17,35,23,20,18,"The Bailey Practice","WF","WF-1","Chingford/ Walthamstow"]
["WF_LDP",44409,44410,"F86696",6837,294,4770,7,133,16,6,2,89,185,216,136,2059,212,235,86,176,39,3151,165,1325,5622,47,38,11,0,1,612,354,0,165,518,100,62,69,363,24,3,19,2,0,0,13,15,56,45,36,25,"Francis Road Medical Centre","WF","WF-4","Forest Integrated Health"]
["WF_LDP",44409,44410,"F86666",14805,689,10157,8,312,89,58,23,220,390,654,414,4448,563,484,255,596,163,7564,701,2849,12018,229,188,67,0,21,1788,964,0,404,1390,199,119,138,865,119,35,102,54,0,0,88,38,114,122,104,71,"The Harrow Road Surgery","WF","WF-5","South Leytonstone"]
["WF_LDP",44409,44410,"F86679",6071,220,3928,3,90,10,7,2,74,119,127,89,983,189,147,59,179,46,2985,238,1033,4619,30,29,10,0,3,465,274,0,116,345,49,32,35,233,31,10,26,9,0,0,18,11,35,32,25,24,"Higham Hill Medical Centre","WF","WF-7","Walthamstow West"]
["WF_LDP",44409,44410,"F86705",3549,182,2563,12,68,6,6,1,53,98,138,87,1342,133,129,55,146,21,1999,159,873,2989,29,25,8,1,1,340,165,0,113,243,60,39,43,216,27,3,16,7,1,0,16,13,35,23,20,12,"The Langthorne Sharma Family Practice","WF","WF-5","South Leytonstone"]
["WF_LDP",44409,44410,"F86708",2833,150,1783,10,71,6,5,1,52,100,118,61,706,117,108,26,63,23,1422,80,321,2269,28,27,7,0,3,368,155,0,85,223,58,35,39,206,16,1,14,2,1,0,11,10,30,29,15,8,"Claremont Medical Centre","WF","WF-6","Central Walthamstow"]
["WF_LDP",44409,44410,"F86700",3859,185,2481,2,210,0,0,0,168,290,141,64,593,150,112,28,107,11,1868,116,511,3133,47,34,6,0,2,754,437,0,105,610,123,53,64,220,112,15,84,29,0,0,88,68,61,92,64,53,"Kings Head Medical Practice","WF","WF-1","Chingford/ Walthamstow"]
["WF_LDP",44409,44410,"F86701",3744,208,2583,7,106,36,34,4,86,139,184,114,1501,156,147,72,178,40,1972,239,960,3055,72,56,29,0,1,452,252,0,132,355,52,30,34,253,23,7,21,9,0,0,19,14,29,36,28,23,"Kiyani Medical Practice","WF","WF-5","South Leytonstone"]
["WF_LDP",44409,44410,"F86626",6750,237,4563,1,103,16,12,1,85,120,175,73,1482,184,124,50,177,40,3324,251,1044,5372,50,44,12,0,2,536,288,0,124,404,92,39,49,291,24,7,20,6,0,0,15,9,52,25,24,19,"Dr Shantir Practice","WF","WF-1","Chingford/ Walthamstow"]
["WF_LDP",44409,44410,"F86625",5927,356,3960,9,172,19,7,5,101,217,146,93,1006,241,260,103,202,55,2766,210,930,4827,97,83,29,0,5,693,339,0,196,531,137,71,87,424,57,18,41,15,0,0,32,46,84,71,54,40,"LL Medical Care (Agarwal & Agrwal Practice)","WF","WF-5","South Leytonstone"]
["WF_LDP",44409,44410,"F86621",6324,268,4623,1,143,17,8,2,97,209,111,80,813,231,226,67,165,37,3543,298,1262,5353,84,68,10,0,5,600,267,0,188,382,99,68,77,308,29,2,24,11,3,0,24,24,57,53,41,33,"Green Man Medical Centre","WF","WF-5","South Leytonstone"]
["WF_LDP",44409,44410,"F86627",13395,550,8695,121,462,36,22,7,302,754,690,329,3185,396,410,200,517,123,6466,564,2330,11005,209,151,47,4,6,1835,793,0,367,1240,382,206,256,811,229,35,193,65,2,0,162,88,163,209,139,97,"Churchill Medical Centre","WF","WF-2","Chingford E4"]
["WF_LDP",44409,44410,"F86650",8065,339,5470,5,137,20,17,3,88,213,264,126,1616,278,250,113,315,61,4086,339,1685,6529,117,86,16,1,9,697,331,0,205,460,116,53,64,500,60,14,52,16,0,0,39,39,77,77,53,34,"Lime Tree Surgery","WF","WF-4","Forest Integrated Health"]
["WF_LDP",44409,44410,"F86664",8440,289,5421,22,185,19,19,0,160,245,220,82,2174,275,176,91,222,51,4392,312,1229,6724,96,79,27,0,4,876,396,0,142,520,171,66,82,415,101,18,80,26,0,0,81,24,95,95,64,53,"Larkshall Medical Centre","WF","WF-1","Chingford/ Walthamstow"]
["WF_LDP",44409,44410,"F86644",9770,338,6340,18,187,24,6,2,125,307,339,132,2367,221,230,106,248,61,4738,388,1168,7732,137,95,24,0,10,1118,379,0,225,654,182,79,99,524,96,14,75,25,2,0,71,34,73,70,38,30,"Waltham Forest Community & Family Health Services Ltd","WF","WF-6","Central Walthamstow"]
["WF_LDP",44440,44441,"F86006",6690,361,4490,2,125,6,3,0,75,166,115,63,1237,262,283,43,94,50,3103,191,407,5400,64,53,14,0,3,798,358,0,200,577,99,64,74,422,58,21,38,17,0,0,26,37,41,63,42,28,"Seymour Medical Centre","WF","WF-7","Walthamstow West"]
["WF_LDP",44440,44441,"F86011",9612,671,6429,11,207,91,35,19,139,245,422,250,1885,537,432,114,311,73,5062,458,1602,7974,162,151,60,1,19,1141,606,0,333,887,224,122,149,737,91,21,90,30,3,0,68,49,153,146,124,90,"The Manor Practice","WF","WF-3","Leyton Collaborative"]
["WF_LDP",44440,44441,"F86005",9409,300,6386,6,274,11,6,1,188,345,210,157,2344,234,213,107,238,75,4523,490,1680,7389,58,53,20,2,3,802,468,0,175,644,82,53,62,354,107,12,92,37,1,0,79,47,53,61,43,30," The Penryhn Surgery","WF","WF-1","Chingford/ Walthamstow"]
["WF_LDP",44440,44441,"F86626",6825,224,4606,1,86,16,12,1,78,120,178,69,1498,179,120,52,180,45,3351,253,1042,5429,50,44,12,0,2,539,286,0,112,392,93,40,50,294,24,7,20,6,0,0,15,9,55,26,24,19,"Dr Shantir Practice","WF","WF-1","Chingford/ Walthamstow"]
["WF_LDP",44440,44441,"F86001",7741,389,5288,4,186,6,4,0,131,306,198,85,2170,336,278,95,191,56,3810,180,1099,6346,98,72,6,0,1,891,382,0,241,553,159,85,106,531,83,11,69,16,0,0,53,27,78,77,50,38," The Firs","WF","WF-6","Central Walthamstow"]
["WF_LDP",44440,44441,"F86696",6916,281,4832,11,137,13,6,2,81,190,217,134,2044,197,233,68,110,29,3217,192,754,5694,48,38,10,0,2,599,341,0,159,502,101,60,66,360,24,3,19,2,0,0,13,15,56,47,37,26,"Francis Road Medical Centre","WF","WF-4","Forest Integrated Health"]
["WF_LDP",44440,44441,"F86700",3858,187,2490,5,218,0,0,0,175,292,143,65,599,152,111,34,115,16,1895,125,563,3140,47,35,7,0,2,750,442,0,113,619,118,56,67,223,113,15,90,32,0,0,89,69,62,90,65,53,"Kings Head Medical Practice","WF","WF-1","Chingford/ Walthamstow"]
["WF_LDP",44440,44441,"F86701",3757,209,2595,7,103,36,33,5,85,137,184,116,1503,152,149,70,178,41,1996,244,962,3062,73,58,30,0,1,453,249,0,136,359,54,31,36,255,23,6,21,10,0,0,18,14,33,37,30,26,"Kiyani Medical Practice","WF","WF-5","South Leytonstone"]
["WF_LDP",44440,44441,"F86689",4358,111,2955,3,78,2,2,1,70,100,60,30,687,87,72,35,72,26,2245,132,599,3298,30,26,6,0,2,293,198,0,59,251,56,36,37,123,44,2,32,10,1,0,26,18,35,23,20,17,"The Bailey Practice","WF","WF-1","Chingford/ Walthamstow"]
["WF_LDP",44440,44441,"F86664",8432,294,5419,21,187,20,20,0,161,247,225,88,2213,278,176,103,258,53,4429,327,1346,6727,95,78,26,0,5,871,399,0,148,528,171,69,87,416,100,18,82,25,0,0,82,25,95,96,66,56,"Larkshall Medical Centre","WF","WF-1","Chingford/ Walthamstow"]
["WF_LDP",44440,44441,"F86666",14779,686,10146,14,328,86,57,22,232,400,654,405,4434,565,479,257,615,165,7567,713,2928,11987,231,187,63,0,22,1783,976,0,391,1391,196,118,135,865,120,35,101,54,1,0,88,39,112,119,100,69,"The Harrow Road Surgery","WF","WF-5","South Leytonstone"]
["WF_LDP",44440,44441,"F86679",6079,219,3939,3,86,12,9,2,69,120,126,92,977,186,148,67,180,49,3013,241,1070,4634,31,30,10,0,4,457,268,0,116,342,48,34,37,234,31,10,29,11,0,0,18,11,34,31,24,22,"Higham Hill Medical Centre","WF","WF-7","Walthamstow West"]
["WF_LDP",44440,44441,"F86705",3551,186,2567,13,68,8,8,1,55,98,138,83,1352,139,119,60,148,22,2001,162,895,2985,31,25,6,1,2,338,161,0,109,237,59,35,38,218,28,4,14,5,1,0,16,14,36,22,19,11,"The Langthorne Sharma Family Practice","WF","WF-5","South Leytonstone"]
["WF_LDP",44440,44441,"Total",268730,11255,180819,376,5740,787,462,135,4082,8144,9047,4718,63711,8964,8222,3136,7738,2006,134269,10270,42054,216195,3184,2543,719,22,189,28167,13328,0,6605,19409,4669,2546,2979,14872,2247,390,1732,609,25,0,1635,1000,2423,2489,1770,1296]
["WF_LDP",44440,44441,"F86045",2011,109,1423,0,41,21,9,5,22,60,100,60,724,91,99,43,88,23,1047,94,421,1710,37,33,10,0,4,267,136,0,67,184,55,35,47,133,19,1,13,5,1,0,16,4,34,22,15,5,"High Road Surgery","WF","WF-5","South Leytonstone"]
["WF_LDP",44440,44441,"F86058",16570,585,11210,15,265,62,42,4,196,365,460,217,3837,482,406,187,514,135,8419,847,3288,13142,206,155,49,2,10,1451,669,0,333,932,226,112,132,785,109,16,70,29,0,0,86,28,121,123,88,73,"St James Medical Practice Ltd","WF","WF-7","Walthamstow West"]
["WF_LDP",44440,44441,"Y01839",6382,242,4268,7,140,16,8,0,117,198,188,93,1193,198,197,55,126,68,3118,252,662,5092,87,67,16,0,1,714,283,0,154,407,110,49,61,412,79,5,44,24,0,0,67,14,44,59,40,32,"Lime Tree & Sinnott Healthcare Ltd","WF","WF-1","Chingford/ Walthamstow"]
["WF_LDP",44440,44441,"F86708",2846,154,1794,9,71,6,5,1,49,100,120,61,720,121,111,30,79,25,1424,78,359,2287,28,27,7,0,3,370,159,0,88,227,59,37,41,213,16,1,12,1,1,0,11,10,31,29,15,8,"Claremont Medical Centre","WF","WF-6","Central Walthamstow"]
["WF_LDP",44440,44441,"F86712",3313,150,2395,8,64,5,2,2,32,94,45,26,563,112,121,29,84,29,1655,72,498,2797,14,12,3,0,2,336,160,0,103,261,50,26,29,205,13,3,11,1,0,0,10,2,25,16,12,5,"Hampton Medical Centre","WF","WF-4","Forest Integrated Health"]
["WF_LDP",44440,44441,"Y01291",9071,416,5851,23,388,17,4,2,272,533,358,185,2260,352,322,151,381,106,4409,310,1892,7254,94,75,24,0,4,1231,641,0,245,990,195,115,138,482,111,28,75,25,0,0,88,99,93,127,98,72,"Chingford Medical Practice","WF","WF-2","Chingford E4"]
["WF_LDP",44440,44441,"F86607",15091,521,10155,17,270,80,46,10,196,357,507,249,4732,411,365,138,384,102,8076,672,2236,11771,198,168,52,4,10,1259,676,0,287,980,196,110,124,658,89,11,69,33,2,0,69,49,110,116,84,62,"Addison Road Medical Practice","WF","WF-6","Central Walthamstow"]
["WF_LDP",44440,44441,"F86616",7790,286,5071,5,279,23,11,3,218,341,313,170,2118,242,231,98,275,54,3896,276,1485,6067,53,40,17,0,3,815,468,0,197,703,167,81,91,350,65,8,52,13,1,0,57,14,88,79,66,55,"Old Church Surgery","WF","WF-2","Chingford E4"]
["WF_LDP",44440,44441,"F86621",6382,271,4666,1,137,17,8,2,92,209,114,82,813,228,227,68,173,38,3593,313,1316,5404,84,68,10,0,5,603,265,0,188,389,101,68,79,313,30,2,25,11,3,0,25,25,56,55,43,35,"Green Man Medical Centre","WF","WF-5","South Leytonstone"]
["WF_LDP",44440,44441,"F86088",4910,166,3480,6,91,3,0,0,57,183,121,48,816,118,205,27,55,19,2308,126,322,4166,48,35,3,0,2,666,185,0,135,283,99,72,75,366,36,7,14,4,0,0,28,17,34,35,18,9,"The Lyndhurst Surgery","WF","WF-4","Forest Integrated Health"]
["WF_LDP",44440,44441,"F86044",10141,308,7291,3,126,6,4,0,70,223,263,116,1370,228,173,70,180,52,4366,273,1072,8358,117,86,25,0,3,756,323,0,145,497,85,29,35,394,33,6,23,7,1,0,21,12,39,59,45,25," Crawley Road Medical Centre","WF","WF-4","Forest Integrated Health"]
["WF_LDP",44440,44441,"F86078",6966,194,4770,5,84,6,0,2,56,154,355,130,1727,141,180,45,121,33,3650,193,599,5923,57,38,7,0,2,1100,348,0,154,529,178,95,108,349,73,6,43,13,0,0,56,10,49,104,56,37,"The Ridgeway Surgery","WF","WF-2","Chingford E4"]
["WF_LDP",44440,44441,"F86086",6151,184,3889,1,42,9,7,2,36,97,127,49,767,149,113,41,90,30,2690,148,455,4661,81,61,18,0,3,480,174,0,89,226,86,32,39,296,33,4,24,6,0,0,19,9,43,41,20,16,"Dr Dhital Practice","WF","WF-6","Central Walthamstow"]
["WF_LDP",44440,44441,"F86625",5905,353,3950,8,158,15,5,4,89,215,148,85,1023,237,264,102,185,51,2756,201,905,4813,96,80,26,0,6,689,328,0,200,510,136,70,85,423,57,18,40,15,0,0,32,46,78,71,55,39,"LL Medical Care (Agarwal & Agrwal Practice)","WF","WF-5","South Leytonstone"]
["WF_LDP",44440,44441,"F86038",11466,720,7034,4,208,48,39,14,144,262,481,307,2552,637,472,248,502,130,5300,328,2201,8809,141,129,28,0,12,1098,649,0,334,880,250,151,175,804,46,7,45,10,1,0,30,21,156,108,85,66,"Sma Medical Centre","WF","WF-3","Leyton Collaborative"]
["WF_LDP",44440,44441,"F86644",9677,351,6283,15,186,25,4,3,127,304,339,139,2375,232,234,108,252,60,4714,388,1191,7662,137,95,24,0,11,1113,392,0,225,662,183,80,99,524,95,13,75,23,2,0,70,35,80,71,40,31,"Waltham Forest Community & Family Health Services Ltd","WF","WF-6","Central Walthamstow"]
["WF_LDP",44440,44441,"F86650",8051,354,5475,6,142,20,17,3,91,213,269,128,1655,285,250,121,336,68,4106,353,1781,6526,117,88,18,1,9,698,354,0,203,492,116,54,65,503,59,13,49,14,0,0,39,38,79,76,54,36,"Lime Tree Surgery","WF","WF-4","Forest Integrated Health"]
["WF_LDP",44440,44441,"F86036",15227,402,10549,6,189,21,8,3,134,332,501,172,3384,326,366,109,290,77,7608,412,1704,12262,226,172,35,1,9,1440,427,0,295,621,231,111,125,787,106,21,76,32,2,0,86,71,85,123,62,39,"The Allum Medical Centre","WF","WF-4","Forest Integrated Health"]
["WF_LDP",44440,44441,"F86062",7300,294,5083,4,114,24,16,9,89,171,278,125,1438,197,249,70,218,39,4018,402,1314,5991,90,75,21,4,10,813,283,0,188,461,144,78,89,469,65,16,55,17,2,0,47,24,61,72,47,34,"Grove Surgery","WF","WF-7","Walthamstow West"]
["WF_LDP",44440,44441,"F86627",13368,565,8673,120,482,36,20,6,319,751,697,351,3174,412,420,216,536,131,6493,580,2415,10983,210,150,46,5,7,1839,814,0,370,1282,385,208,258,818,229,34,193,65,2,0,159,87,172,211,140,99,"Churchill Medical Centre","WF","WF-2","Chingford E4"]
["WF_LDP",44440,44441,"F86030",8105,512,5367,12,180,20,12,6,137,216,393,288,3527,461,404,75,179,36,4411,244,991,6452,45,39,10,1,5,714,460,0,313,611,157,130,140,556,38,5,27,6,0,0,28,11,102,54,43,33," Queens Road Medical Centre","WF","WF-7","Walthamstow West"]
["WF_LDP",44470,44473,"F86666",14764,679,10135,32,338,85,57,20,231,417,655,387,4441,558,452,261,592,167,7585,720,2915,11979,227,184,61,0,22,1787,980,40,365,1389,199,109,126,868,119,36,102,53,1,7,88,39,112,118,97,67,"The Harrow Road Surgery","WF","WF-5","South Leytonstone"]
["WF_LDP",44470,44473,"F86689",4368,105,2957,2,72,2,2,1,62,100,61,30,691,82,72,35,69,24,2545,265,612,3298,29,26,7,0,5,294,195,14,60,247,56,33,34,124,43,2,33,12,1,3,25,18,34,23,20,15,"The Bailey Practice","WF","WF-1","Chingford/ Walthamstow"]
["WF_LDP",44470,44473,"F86696",6932,288,4840,11,135,12,5,1,83,188,219,142,2026,198,229,69,108,32,3228,198,765,5703,48,37,9,0,2,598,341,53,157,510,101,58,66,358,24,3,19,3,0,0,13,15,57,48,39,29,"Francis Road Medical Centre","WF","WF-4","Forest Integrated Health"]
["WF_LDP",44470,44473,"F86679",6115,222,3980,4,83,14,10,3,70,122,125,89,975,188,155,70,193,49,3062,245,1117,4671,32,31,11,1,4,457,263,16,120,334,48,35,38,237,31,10,30,11,0,0,18,12,34,31,22,21,"Higham Hill Medical Centre","WF","WF-7","Walthamstow West"]
["WF_LDP",44470,44473,"F86644",9590,364,6217,11,176,24,4,4,120,300,336,119,2376,238,241,102,250,61,4693,397,1187,7601,137,97,26,0,11,1109,367,182,226,641,186,82,102,527,95,13,76,22,1,29,70,35,84,70,42,31,"Waltham Forest Community & Family Health Services Ltd","WF","WF-6","Central Walthamstow"]
["WF_LDP",44470,44473,"F86627",13359,583,8676,3,477,35,19,6,308,742,694,353,3180,421,418,225,562,140,6534,607,2479,10968,213,156,51,5,8,1824,822,35,373,1292,382,193,241,816,230,34,194,65,2,18,161,87,176,211,133,87,"Churchill Medical Centre","WF","WF-2","Chingford E4"]
["WF_LDP",44470,44473,"F86664",8430,300,5430,21,183,21,21,0,154,246,232,91,2277,284,179,115,293,60,4461,337,1466,6727,96,81,29,0,5,865,410,8,146,534,169,71,88,414,98,17,82,26,0,4,81,27,100,95,67,57,"Larkshall Medical Centre","WF","WF-1","Chingford/ Walthamstow"]
["WF_LDP",44470,44473,"F86650",8069,361,5479,3,145,21,18,3,92,214,270,128,1660,293,247,129,356,73,4124,354,1865,6532,116,87,17,1,10,697,363,128,208,505,116,53,64,504,59,13,50,14,0,30,40,39,80,77,53,36,"Lime Tree Surgery","WF","WF-4","Forest Integrated Health"]
["WF_LDP",44470,44473,"Y01291",9040,417,5816,26,409,16,6,2,283,535,357,203,2306,342,314,166,409,111,4449,330,2051,7232,92,75,23,0,5,1236,665,43,239,1042,200,111,133,481,109,27,79,26,0,8,90,97,95,127,98,73,"Chingford Medical Practice","WF","WF-2","Chingford E4"]
["WF_LDP",44470,44473,"F86712",3329,157,2403,3,67,5,2,2,36,94,46,28,554,121,125,32,91,29,1666,74,527,2805,15,13,3,0,2,337,172,67,108,274,50,27,30,206,13,3,11,1,0,6,10,3,25,16,13,6,"Hampton Medical Centre","WF","WF-4","Forest Integrated Health"]
["WF_LDP",44470,44473,"Total",268596,11412,180776,323,5702,833,518,136,4028,8185,9065,4658,61825,9071,8102,3301,8039,2109,135111,10641,43647,216107,3169,2549,734,19,189,28142,13453,2271,6546,19565,4665,2460,2895,14923,2232,387,1771,615,28,363,1636,1037,2448,2488,1791,1315]
["WF_LDP",44470,44473,"Y01839",6340,239,4235,6,120,16,8,0,98,198,187,88,1178,192,190,57,135,68,3078,251,675,5061,85,66,16,0,1,715,261,36,147,377,107,45,56,412,79,5,40,22,0,14,67,15,39,60,38,30,"Lime Tree & Sinnott Healthcare Ltd","WF","WF-1","Chingford/ Walthamstow"]
["WF_LDP",44470,44473,"F86701",3769,214,2605,7,102,33,30,5,80,137,188,113,1520,159,142,73,194,40,1993,240,996,3075,74,59,29,0,1,451,248,31,131,356,54,28,33,257,24,6,22,11,0,3,18,14,30,37,29,26,"Kiyani Medical Practice","WF","WF-5","South Leytonstone"]
["WF_LDP",44470,44473,"F86700",3876,190,2501,65,245,0,0,0,199,347,139,59,597,159,108,43,128,20,1905,132,617,3151,49,35,7,0,1,749,441,105,111,613,117,54,64,224,112,15,96,34,0,51,90,69,64,90,69,55,"Kings Head Medical Practice","WF","WF-1","Chingford/ Walthamstow"]
["WF_LDP",44470,44473,"F86708",2856,162,1802,9,74,6,5,1,51,101,119,61,725,133,112,32,94,28,1424,69,392,2297,28,26,5,0,3,374,181,6,88,255,59,38,42,212,17,2,12,1,1,1,13,12,34,29,17,9,"Claremont Medical Centre","WF","WF-6","Central Walthamstow"]
["WF_LDP",44470,44473,"F86705",3551,184,2565,13,69,8,8,1,55,97,140,80,1361,149,112,59,158,22,2013,168,913,2984,33,26,6,0,3,335,176,16,102,242,59,33,36,215,28,5,20,8,0,1,16,15,38,22,19,12,"The Langthorne Sharma Family Practice","WF","WF-5","South Leytonstone"]
["WF_LDP",44470,44473,"F86626",6852,200,4640,1,67,16,12,1,47,120,180,61,1522,153,116,55,172,43,3360,255,1050,5457,50,44,12,0,2,542,240,19,112,339,95,38,50,297,24,7,17,6,0,1,15,9,45,26,23,17,"Dr Shantir Practice","WF","WF-1","Chingford/ Walthamstow"]
["WF_LDP",44470,44473,"F86038",11379,708,6998,4,202,65,58,15,148,261,487,291,2574,635,459,252,507,131,5269,325,2188,8757,136,127,30,0,14,1096,659,251,334,853,249,150,175,801,46,7,46,9,1,25,30,21,154,108,84,68,"Sma Medical Centre","WF","WF-3","Leyton Collaborative"]
["WF_LDP",44470,44473,"F86030",8137,513,5394,10,181,21,12,6,137,215,392,290,1561,471,404,73,182,37,4440,240,994,6478,45,39,10,1,5,713,498,267,311,638,155,127,139,559,38,5,30,8,0,19,29,11,108,54,45,36," Queens Road Medical Centre","WF","WF-7","Walthamstow West"]
["WF_LDP",44470,44473,"F86045",2019,104,1434,1,39,19,9,5,22,61,100,55,733,86,101,44,88,24,1061,96,432,1718,36,33,10,0,4,267,131,18,71,182,55,35,46,137,19,1,15,5,1,4,16,4,33,22,15,5,"High Road Surgery","WF","WF-5","South Leytonstone"]
["WF_LDP",44470,44473,"F86044",10125,325,7274,3,123,9,4,1,68,221,263,127,1360,256,192,79,193,57,4417,292,1170,8331,117,86,24,0,3,751,314,31,164,483,85,33,39,399,33,6,27,7,0,2,23,13,41,60,48,26," Crawley Road Medical Centre","WF","WF-4","Forest Integrated Health"]
["WF_LDP",44470,44473,"F86011",9593,669,6424,9,209,86,36,17,139,244,422,254,1856,526,433,126,316,78,5071,469,1626,7965,158,146,56,1,18,1137,590,157,333,878,221,118,146,740,86,18,84,24,6,20,63,53,148,144,127,99,"The Manor Practice","WF","WF-3","Leyton Collaborative"]
["WF_LDP",44470,44473,"F86001",7744,409,5282,3,188,11,8,1,141,306,197,74,2170,355,266,103,200,58,3811,185,1166,6360,98,72,8,0,1,895,409,137,237,578,158,79,100,535,83,11,69,17,0,23,53,27,79,77,50,35," The Firs","WF","WF-6","Central Walthamstow"]
["WF_LDP",44470,44473,"F86036",15175,454,10512,4,208,22,10,4,142,330,507,201,3447,364,380,124,346,94,7684,447,1939,12213,223,173,41,1,9,1435,462,32,290,683,233,112,126,789,106,21,94,36,3,8,86,84,91,125,68,45,"The Allum Medical Centre","WF","WF-4","Forest Integrated Health"]
["WF_LDP",44470,44473,"F86006",6696,356,4514,2,126,6,3,0,73,162,118,63,1236,243,271,49,97,56,3095,189,434,5412,63,53,14,0,3,794,343,163,195,591,98,61,73,424,55,20,40,18,0,23,28,35,46,64,49,33,"Seymour Medical Centre","WF","WF-7","Walthamstow West"]
["WF_LDP",44470,44473,"F86005",9384,295,6379,5,230,9,4,1,155,343,211,141,2316,223,211,113,248,77,4469,480,1744,7373,59,54,20,1,2,805,430,3,177,594,84,52,63,356,108,12,87,36,0,2,79,49,49,60,42,33," The Penryhn Surgery","WF","WF-1","Chingford/ Walthamstow"]
["WF_LDP",44470,44473,"F86616",7799,299,5075,5,287,23,12,2,226,342,310,171,2125,251,235,102,284,58,3935,294,1523,6070,52,40,16,0,3,819,474,11,197,718,166,82,95,353,66,8,51,13,1,3,58,15,93,78,67,55,"Old Church Surgery","WF","WF-2","Chingford E4"]
["WF_LDP",44470,44473,"F86607",15127,527,10190,14,266,91,60,10,184,353,508,246,4727,421,355,138,392,103,8240,702,2288,11819,198,169,52,3,6,1264,681,79,283,988,198,110,124,662,87,11,69,33,4,20,68,50,112,116,86,63,"Addison Road Medical Practice","WF","WF-6","Central Walthamstow"]
["WF_LDP",44470,44473,"F86625",5888,349,3945,8,146,18,8,4,83,214,147,82,1035,229,260,113,176,54,2755,209,943,4803,96,79,26,0,6,689,317,31,195,491,136,69,82,425,56,17,37,15,0,2,32,45,76,70,52,37,"LL Medical Care (Agarwal & Agrwal Practice)","WF","WF-5","South Leytonstone"]
["WF_LDP",44470,44473,"F86621",6421,261,4693,2,139,23,14,3,100,210,118,72,820,215,207,67,174,40,3612,315,1305,5433,86,70,10,0,4,603,257,131,176,388,103,57,68,315,31,2,25,12,3,10,25,25,57,56,46,36,"Green Man Medical Centre","WF","WF-5","South Leytonstone"]
["WF_LDP",44470,44473,"F86088",4904,185,3468,8,97,3,0,0,60,185,123,52,798,126,209,34,82,26,2312,129,434,4158,47,34,4,0,2,669,195,56,139,300,101,71,75,368,36,7,12,3,0,4,28,17,37,35,17,7,"The Lyndhurst Surgery","WF","WF-4","Forest Integrated Health"]
["WF_LDP",44470,44473,"F86062",7321,282,5086,4,100,31,21,9,70,169,276,110,1414,181,214,77,206,42,4048,421,1344,6001,89,76,25,3,8,813,274,46,166,457,145,65,73,469,64,16,53,16,3,9,46,23,52,72,45,32,"Grove Surgery","WF","WF-7","Walthamstow West"]
["WF_LDP",44470,44473,"F86058",16559,605,11212,17,266,65,43,4,203,363,456,206,3793,500,389,196,512,142,8464,866,3351,13131,206,157,52,2,11,1448,722,40,333,988,217,108,123,787,107,16,82,29,0,7,83,36,123,121,88,76,"St James Medical Practice Ltd","WF","WF-7","Walthamstow West"]
["WF_LDP",44470,44473,"F86086",6180,206,3893,1,53,11,9,2,46,99,130,58,782,170,125,45,105,33,2712,153,535,4674,81,60,17,0,3,482,211,6,101,269,89,36,45,305,34,5,25,6,0,2,19,13,51,43,25,21,"Dr Dhital Practice","WF","WF-6","Central Walthamstow"]
["WF_LDP",44470,44473,"F86078",6905,200,4722,6,80,6,0,2,62,149,352,133,1689,149,179,43,127,32,3596,187,604,5870,55,38,7,0,2,1092,361,13,151,536,174,87,100,347,72,6,42,13,0,4,55,10,51,103,58,37,"The Ridgeway Surgery","WF","WF-2","Chingford E4"]
["WF_LDP",44501,44502,"F86705",3535,183,2552,12,70,9,9,1,53,95,147,95,1362,147,117,62,153,24,2006,169,913,2969,33,26,6,0,3,336,176,131,107,243,59,33,37,219,27,4,22,8,0,20,16,14,38,23,18,10,"The Langthorne Sharma Family Practice","WF","WF-5","South Leytonstone"]
["WF_LDP",44501,44502,"F86708",2860,163,1804,9,76,6,5,1,53,101,120,65,739,133,114,33,104,33,1436,72,427,2303,28,25,4,0,3,373,177,100,92,259,60,38,42,214,17,2,12,1,1,10,13,12,34,29,20,13,"Claremont Medical Centre","WF","WF-6","Central Walthamstow"]
["WF_LDP",44501,44502,"F86700",3883,192,2500,65,251,1,1,0,201,346,136,54,589,159,105,42,130,21,1906,131,639,3150,50,36,8,0,2,750,442,150,113,617,114,50,60,224,110,15,94,34,0,86,89,67,61,90,71,56,"Kings Head Medical Practice","WF","WF-1","Chingford/ Walthamstow"]
["WF_LDP",44501,44502,"F86701",3777,213,2616,6,102,32,29,5,74,138,187,105,1519,152,135,76,191,46,1979,233,988,3084,75,57,27,0,1,452,239,116,126,357,53,25,29,259,24,6,21,11,0,16,19,17,31,37,29,24,"Kiyani Medical Practice","WF","WF-5","South Leytonstone"]
["WF_LDP",44501,44502,"Y01839",6320,230,4217,5,101,16,8,0,80,196,186,82,1164,185,181,56,142,69,3082,250,669,5043,84,66,15,0,1,717,255,135,141,364,108,45,56,414,78,5,43,23,0,34,66,17,39,60,35,26,"Lime Tree & Sinnott Healthcare Ltd","WF","WF-1","Chingford/ Walthamstow"]
["WF_LDP",44501,44502,"Total",269393,11498,181372,379,5803,880,557,147,4080,8236,9097,4738,61929,9154,8074,3431,8283,2146,136165,10962,45018,216809,3167,2579,775,22,187,28187,13743,6400,6614,20036,4672,2461,2899,14979,2225,381,1816,630,29,1170,1644,1062,2512,2496,1846,1350]
["WF_LDP",44501,44502,"F86712",3352,158,2424,3,69,5,2,2,42,93,47,27,541,124,127,31,94,28,1677,73,539,2827,15,13,3,0,2,340,173,110,107,280,51,29,32,205,12,3,10,1,0,7,10,3,27,16,14,7,"Hampton Medical Centre","WF","WF-4","Forest Integrated Health"]
["WF_LDP",44501,44502,"Y01291",9062,427,5817,28,419,18,8,3,289,541,373,223,2370,352,313,182,454,116,4495,358,2231,7251,92,75,23,1,4,1244,696,203,250,1083,204,112,135,489,110,27,82,26,0,61,91,98,96,131,102,73,"Chingford Medical Practice","WF","WF-2","Chingford E4"]
["WF_LDP",44501,44502,"F86696",6921,291,4840,8,135,12,5,1,83,180,215,138,1985,197,226,70,114,32,3252,222,794,5691,49,40,11,0,4,591,347,140,155,516,102,60,68,355,24,3,18,4,0,7,13,15,58,48,41,29,"Francis Road Medical Centre","WF","WF-4","Forest Integrated Health"]
["WF_LDP",44501,44502,"F86078",6965,202,4755,5,78,7,0,2,58,148,347,132,1668,156,174,48,130,34,3622,193,649,5916,55,39,8,0,2,1088,361,184,148,539,173,83,96,347,74,6,45,15,0,57,56,10,53,106,61,43,"The Ridgeway Surgery","WF","WF-2","Chingford E4"]
["WF_LDP",44501,44502,"F86062",7293,291,5071,5,116,35,24,10,74,169,276,115,1416,195,208,81,218,46,4064,434,1410,5979,87,76,25,3,8,809,295,152,158,479,144,68,77,465,64,16,58,20,3,32,46,23,66,70,60,43,"Grove Surgery","WF","WF-7","Walthamstow West"]
["WF_LDP",44501,44502,"F86058",16782,618,11357,21,276,70,45,5,215,368,461,218,3808,508,399,204,514,145,8591,886,3445,13325,209,160,54,2,12,1460,759,166,347,1032,220,109,127,794,108,15,89,27,0,31,83,40,128,122,92,76,"St James Medical Practice Ltd","WF","WF-7","Walthamstow West"]
["WF_LDP",44501,44502,"F86607",15209,543,10252,11,271,98,61,11,185,356,500,246,4740,429,361,147,408,102,8429,751,2365,11893,198,171,55,3,8,1266,701,329,282,1028,196,110,125,660,89,11,75,34,4,56,70,53,118,118,90,67,"Addison Road Medical Practice","WF","WF-6","Central Walthamstow"]
["WF_LDP",44501,44502,"F86088",4923,193,3482,11,104,2,0,0,65,188,123,52,794,135,210,39,92,26,2361,151,486,4175,48,35,6,0,2,671,203,134,145,322,99,68,72,368,35,7,20,5,0,13,27,18,41,35,18,9,"The Lyndhurst Surgery","WF","WF-4","Forest Integrated Health"]
["WF_LDP",44501,44502,"F86086",6190,216,3897,2,59,14,12,3,49,100,131,60,785,184,134,48,124,35,2719,162,589,4673,82,59,17,0,2,481,230,100,105,295,90,40,47,310,32,4,23,5,0,15,17,11,52,42,24,21,"Dr Dhital Practice","WF","WF-6","Central Walthamstow"]
["WF_LDP",44501,44502,"F86045",2033,94,1445,1,36,19,9,5,22,61,100,52,748,79,99,41,93,24,1066,94,435,1734,35,33,10,0,4,267,119,63,69,168,54,35,46,138,19,1,15,5,1,12,16,4,30,22,12,4,"High Road Surgery","WF","WF-5","South Leytonstone"]
["WF_LDP",44501,44502,"F86030",8120,510,5385,9,183,22,12,6,141,214,392,292,1556,467,409,73,192,38,4464,251,1016,6469,45,40,11,1,5,722,504,382,313,638,156,133,145,557,37,4,33,9,0,25,28,13,112,53,46,35," Queens Road Medical Centre","WF","WF-7","Walthamstow West"]
["WF_LDP",44501,44502,"F86011",9633,677,6459,8,208,85,38,19,139,246,428,264,1832,518,425,132,321,82,5120,472,1665,8003,161,150,59,1,18,1140,585,319,336,901,220,116,144,744,87,19,86,24,7,49,64,54,142,144,128,94,"The Manor Practice","WF","WF-3","Leyton Collaborative"]
["WF_LDP",44501,44502,"F86006",6732,354,4537,2,128,6,3,0,73,163,119,59,1237,249,266,51,92,54,3106,193,432,5440,63,52,13,0,3,801,356,227,194,604,100,62,75,430,58,20,42,19,0,27,32,38,46,63,48,33,"Seymour Medical Centre","WF","WF-7","Walthamstow West"]
["WF_LDP",44501,44502,"F86044",10279,336,7381,4,125,9,4,1,67,222,268,132,1358,277,206,87,214,56,4498,316,1284,8463,118,87,25,0,3,752,334,172,169,506,88,36,43,407,32,6,27,6,0,13,24,13,47,60,48,28," Crawley Road Medical Centre","WF","WF-4","Forest Integrated Health"]
["WF_LDP",44501,44502,"F86038",11395,703,7011,7,205,67,62,14,153,260,487,291,2595,639,437,245,517,130,5294,333,2223,8778,133,128,34,0,13,1089,685,407,332,876,251,144,168,804,45,7,45,9,1,33,29,21,164,108,90,75,"Sma Medical Centre","WF","WF-3","Leyton Collaborative"]
["WF_LDP",44501,44502,"F86036",15128,471,10465,4,216,36,22,6,156,330,508,202,3511,381,373,139,367,101,7737,474,2119,12170,222,179,52,1,8,1433,503,282,294,730,233,110,128,787,106,21,96,38,3,54,86,84,102,127,83,57,"The Allum Medical Centre","WF","WF-4","Forest Integrated Health"]
["WF_LDP",44501,44502,"F86664",8442,293,5454,24,171,24,23,1,141,250,235,84,2346,282,179,123,320,60,4516,346,1561,6749,96,83,30,0,4,869,426,158,147,560,169,73,91,419,98,17,86,24,0,54,82,29,97,96,68,60,"Larkshall Medical Centre","WF","WF-1","Chingford/ Walthamstow"]
["WF_LDP",44501,44502,"F86650",8078,370,5486,2,146,21,19,4,91,216,276,132,1654,297,252,137,363,69,4174,381,1883,6555,116,89,20,1,10,701,361,203,221,506,118,51,61,509,58,12,50,14,0,34,39,38,81,79,52,34,"Lime Tree Surgery","WF","WF-4","Forest Integrated Health"]
["WF_LDP",44501,44502,"F86644",9528,350,6189,48,187,20,4,4,122,338,335,111,2380,223,238,98,246,57,4654,378,1141,7554,137,94,24,0,9,1103,354,233,237,624,185,80,98,527,95,13,75,22,1,42,69,35,80,69,43,34,"Waltham Forest Community & Family Health Services Ltd","WF","WF-6","Central Walthamstow"]
["WF_LDP",44501,44502,"F86689",4383,109,2964,4,70,2,2,1,57,104,61,32,700,85,68,37,72,22,2567,268,649,3309,28,25,6,0,3,298,194,79,64,252,57,33,35,126,42,2,34,13,2,20,24,24,36,22,18,16,"The Bailey Practice","WF","WF-1","Chingford/ Walthamstow"]
["WF_LDP",44501,44502,"F86679",6183,226,4016,5,91,14,10,3,80,123,125,95,974,187,157,71,206,47,3111,252,1145,4718,32,30,10,2,4,467,268,90,125,347,49,34,38,240,31,10,30,10,0,13,18,11,34,32,24,22,"Higham Hill Medical Centre","WF","WF-7","Walthamstow West"]
["WF_LDP",44501,44502,"F86666",14787,668,10163,38,345,86,54,19,244,423,653,384,4448,544,457,251,575,166,7638,732,2873,12001,226,187,65,0,22,1793,978,336,376,1388,200,114,132,870,119,35,102,53,1,58,89,41,112,117,92,60,"The Harrow Road Surgery","WF","WF-5","South Leytonstone"]
["WF_LDP",44501,44502,"F86627",13370,604,8707,2,492,36,21,6,313,736,691,367,3162,440,423,241,573,153,6604,653,2577,10974,211,160,56,6,8,1822,863,349,377,1352,379,194,236,815,228,35,195,71,1,120,164,90,177,208,142,96,"Churchill Medical Centre","WF","WF-2","Chingford E4"]
["WF_LDP",44501,44502,"F86625",5886,344,3939,7,146,17,7,4,88,212,147,81,1031,231,259,121,177,56,2745,209,956,4800,95,79,27,1,6,690,317,153,195,488,136,68,80,422,55,16,40,16,0,19,31,44,77,70,54,39,"LL Medical Care (Agarwal & Agrwal Practice)","WF","WF-5","South Leytonstone"]
["WF_LDP",44501,44502,"F86621",6444,257,4714,3,143,26,17,3,103,211,119,71,806,209,193,67,175,42,3628,314,1284,5444,85,72,13,0,4,602,265,225,171,398,105,61,73,316,31,2,26,12,3,18,25,25,61,56,44,32,"Green Man Medical Centre","WF","WF-5","South Leytonstone"]
["WF_LDP",44501,44502,"F86616",7845,301,5106,8,283,24,12,2,217,346,316,176,2139,254,248,108,284,56,3950,296,1552,6103,53,43,18,0,3,824,476,131,200,728,166,85,97,353,66,7,46,13,1,33,58,14,92,79,68,56,"Old Church Surgery","WF","WF-2","Chingford E4"]
["WF_LDP",44501,44502,"F86626",6900,196,4674,0,67,15,11,1,41,120,178,72,1511,140,115,59,163,40,3378,251,1044,5492,50,45,13,0,2,542,241,93,107,350,94,39,51,299,25,7,20,6,0,9,16,9,47,27,23,14,"Dr Shantir Practice","WF","WF-1","Chingford/ Walthamstow"]
["WF_LDP",44501,44502,"F86001",7740,421,5283,5,202,18,14,3,150,299,200,86,2171,371,258,110,213,60,3827,191,1224,6371,97,71,8,0,2,886,435,228,235,610,154,73,97,536,81,11,68,16,0,40,53,27,81,77,51,36," The Firs","WF","WF-6","Central Walthamstow"]
["WF_LDP",44501,44502,"F86005",9415,294,6410,7,232,8,4,1,161,343,210,143,2290,225,208,121,252,76,4469,473,1811,7403,59,54,19,0,2,808,425,120,176,596,85,50,58,357,108,12,88,36,0,52,81,50,52,60,37,28," The Penryhn Surgery","WF","WF-1","Chingford/ Walthamstow"]
["WF_LDP",44531,44533,"F86666",14845,669,10215,36,339,90,57,20,232,424,656,393,4480,542,455,242,586,159,7700,741,2903,12061,225,191,71,0,20,1798,941,407,373,1381,197,116,136,870,121,35,106,57,1,67,91,44,110,119,89,60,"The Harrow Road Surgery","WF","WF-5","South Leytonstone"]
["WF_LDP",44531,44533,"F86664",8427,303,5454,28,166,28,27,3,134,253,234,86,2392,291,177,132,352,57,4568,368,1663,6738,99,85,31,0,6,870,432,203,150,570,168,71,88,417,97,17,86,24,0,67,82,30,98,97,70,61,"Larkshall Medical Centre","WF","WF-1","Chingford/ Walthamstow"]
["WF_LDP",44531,44533,"F86689",4381,115,2970,4,80,7,7,0,61,103,60,34,708,91,73,37,79,25,2597,267,670,3311,28,26,6,0,4,296,199,96,67,263,57,33,35,126,42,2,36,14,2,24,26,25,36,22,18,15,"The Bailey Practice","WF","WF-1","Chingford/ Walthamstow"]
["WF_LDP",44531,44533,"F86679",6211,231,4028,4,94,13,8,3,77,121,125,94,981,185,157,76,207,51,3126,260,1171,4734,31,29,10,2,3,463,268,111,129,349,50,34,38,242,31,10,30,10,0,17,18,11,40,34,26,24,"Higham Hill Medical Centre","WF","WF-7","Walthamstow West"]
["WF_LDP",44531,44533,"F86627",13317,620,8681,2,502,32,20,4,315,727,689,375,3157,449,420,261,591,157,6540,635,2628,10931,211,151,49,0,10,1836,881,414,377,1401,375,196,237,815,226,35,192,75,1,133,161,94,180,205,145,100,"Churchill Medical Centre","WF","WF-2","Chingford E4"]
["WF_LDP",44531,44533,"F86626",6913,196,4684,0,71,13,9,1,51,121,181,79,1501,135,123,59,154,38,3388,244,1035,5509,49,44,12,0,2,545,240,126,116,346,94,43,55,302,25,7,19,5,0,12,16,9,46,25,22,15,"Dr Shantir Practice","WF","WF-1","Chingford/ Walthamstow"]
["WF_LDP",44531,44533,"F86650",8073,379,5487,6,144,19,17,4,91,219,279,139,1677,301,255,145,374,71,4206,393,1953,6541,117,93,24,1,9,698,368,238,221,521,117,48,58,512,55,12,46,13,0,35,37,37,79,81,53,36,"Lime Tree Surgery","WF","WF-4","Forest Integrated Health"]
["WF_LDP",44531,44533,"F86644",9492,371,6163,47,199,21,4,6,130,337,338,135,2386,237,232,101,239,66,4626,357,1150,7533,140,96,23,0,11,1103,373,283,235,661,188,79,95,530,94,12,74,17,1,52,68,35,84,70,43,32,"Waltham Forest Community & Family Health Services Ltd","WF","WF-6","Central Walthamstow"]
["WF_LDP",44531,44533,"F86696",6767,296,4736,7,139,12,5,1,83,177,209,140,1923,203,225,65,115,33,3192,229,786,5574,53,43,11,0,5,582,355,194,163,517,102,58,67,356,24,3,19,4,0,12,13,15,64,51,45,30,"Francis Road Medical Centre","WF","WF-4","Forest Integrated Health"]
["WF_LDP",44531,44533,"Y01291",9086,435,5832,32,429,19,9,2,298,541,375,231,2411,357,318,185,477,119,4644,416,2351,7269,95,79,26,1,6,1243,722,268,264,1108,202,113,136,496,111,25,89,30,0,77,92,97,102,131,106,75,"Chingford Medical Practice","WF","WF-2","Chingford E4"]
["WF_LDP",44531,44533,"F86712",3372,160,2439,3,71,5,2,2,44,93,50,30,553,125,127,32,99,27,1688,79,565,2851,15,13,3,0,3,335,172,126,111,279,50,29,32,208,12,3,10,1,0,7,10,3,27,16,14,7,"Hampton Medical Centre","WF","WF-4","Forest Integrated Health"]
["WF_LDP",44531,44533,"F86030",8099,519,5366,10,189,24,13,6,146,216,392,301,1581,467,412,76,193,38,4452,255,1033,6459,44,39,12,1,4,732,486,404,326,644,156,133,145,559,37,4,34,10,0,30,30,14,111,54,46,35," Queens Road Medical Centre","WF","WF-7","Walthamstow West"]
["WF_LDP",44531,44533,"Y01839",6291,224,4197,5,104,15,8,0,79,197,185,84,1159,182,179,57,143,69,3077,247,686,5025,83,67,15,0,1,716,252,175,146,371,108,41,51,413,78,5,45,24,0,43,65,17,40,60,37,28,"Lime Tree & Sinnott Healthcare Ltd","WF","WF-1","Chingford/ Walthamstow"]
["WF_LDP",44531,44533,"F86701",3777,220,2617,5,108,34,31,6,81,139,189,112,1516,155,141,81,191,49,2008,243,1021,3084,76,61,28,0,1,456,239,155,132,371,52,24,28,262,24,6,21,11,0,17,19,17,31,37,30,22,"Kiyani Medical Practice","WF","WF-5","South Leytonstone"]
["WF_LDP",44531,44533,"F86700",3892,192,2508,73,257,3,2,0,207,351,136,52,596,162,109,41,141,23,1921,134,667,3155,51,38,8,0,2,751,444,163,122,618,114,52,61,225,110,15,95,34,0,92,90,69,62,93,76,62,"Kings Head Medical Practice","WF","WF-1","Chingford/ Walthamstow"]
["WF_LDP",44531,44533,"F86708",2881,167,1823,9,77,6,5,1,49,101,124,66,779,135,110,42,119,35,1474,85,500,2324,28,25,6,0,2,389,187,113,88,274,59,38,42,214,17,2,12,1,1,10,13,12,32,28,20,12,"Claremont Medical Centre","WF","WF-6","Central Walthamstow"]
["WF_LDP",44531,44533,"F86705",3530,194,2547,13,74,12,12,1,54,94,145,99,1370,152,119,61,159,26,2001,183,929,2958,33,28,7,0,5,337,186,164,112,256,60,37,42,219,27,4,22,9,0,23,18,14,42,20,18,9,"The Langthorne Sharma Family Practice","WF","WF-5","South Leytonstone"]
["WF_LDP",44531,44533,"F86045",2021,97,1435,2,41,16,8,3,31,62,101,52,756,83,96,37,94,24,1075,94,429,1730,33,30,8,0,4,266,113,82,74,159,53,36,47,138,19,1,14,4,0,15,16,4,25,22,12,10,"High Road Surgery","WF","WF-5","South Leytonstone"]
["WF_LDP",44531,44533,"F86058",16622,632,11290,19,283,77,45,8,226,366,461,236,3766,520,406,211,519,146,8572,904,3538,13218,206,160,55,3,14,1470,781,303,364,1081,219,112,128,785,111,15,96,30,0,57,87,40,139,118,93,78,"St James Medical Practice Ltd","WF","WF-7","Walthamstow West"]
["WF_LDP",44531,44533,"F86038",11360,717,6996,7,203,67,61,14,147,257,491,289,2596,658,421,256,538,138,5351,366,2300,8746,132,128,35,0,13,1091,704,468,329,897,251,145,170,804,46,7,45,9,1,37,29,21,172,109,93,75,"Sma Medical Centre","WF","WF-3","Leyton Collaborative"]
["WF_LDP",44531,44533,"F86044",10250,338,7378,3,129,11,5,1,77,222,272,147,1365,285,214,85,217,60,4508,315,1318,8448,120,89,27,0,3,750,363,194,175,534,88,38,44,401,33,6,29,6,0,15,25,15,50,60,48,28," Crawley Road Medical Centre","WF","WF-4","Forest Integrated Health"]
["WF_LDP",44531,44533,"F86005",9513,298,6480,8,235,7,3,0,159,343,210,141,2289,229,209,125,268,82,4515,469,1899,7482,62,55,20,0,2,811,433,186,177,620,86,47,56,360,108,12,88,35,0,69,81,51,51,58,42,31," The Penryhn Surgery","WF","WF-1","Chingford/ Walthamstow"]
["WF_LDP",44531,44533,"F86001",7746,440,5290,5,210,18,14,3,157,301,203,93,2139,385,260,116,226,65,3917,231,1289,6376,97,79,19,0,4,888,439,263,240,630,158,72,95,541,82,12,73,17,0,43,53,28,82,79,56,41," The Firs","WF","WF-6","Central Walthamstow"]
["WF_LDP",44531,44533,"F86011",9624,670,6463,4,214,83,33,18,142,245,431,275,1816,496,421,136,331,82,5121,464,1687,8000,161,147,57,2,18,1137,588,392,335,916,219,115,141,736,88,18,85,25,7,58,67,53,145,144,129,94,"The Manor Practice","WF","WF-3","Leyton Collaborative"]
["WF_LDP",44531,44533,"F86006",6750,370,4546,1,131,8,4,0,74,162,120,61,1241,258,263,53,99,58,3099,195,458,5447,63,53,14,0,4,848,382,252,196,667,100,60,73,437,60,20,43,21,0,30,32,38,49,64,50,35,"Seymour Medical Centre","WF","WF-7","Walthamstow West"]
["WF_LDP",44531,44533,"F86036",14979,527,10335,4,241,38,20,5,174,329,508,220,3533,416,385,147,402,101,7825,526,2305,12032,220,186,61,1,9,1429,567,408,313,811,235,114,135,783,107,21,100,40,3,67,86,85,125,128,100,67,"The Allum Medical Centre","WF","WF-4","Forest Integrated Health"]
["WF_LDP",44531,44533,"F86616",7861,318,5110,11,306,23,12,2,239,352,314,180,2145,268,254,113,296,61,4013,311,1588,6109,52,44,20,1,2,833,514,181,211,772,167,88,100,359,67,7,54,14,1,39,59,19,105,81,69,58,"Old Church Surgery","WF","WF-2","Chingford E4"]
["WF_LDP",44531,44533,"F86607",15284,556,10323,13,272,98,59,13,197,359,507,250,4756,440,353,163,409,112,8576,767,2443,11963,201,175,57,3,9,1290,718,388,284,1051,199,114,128,670,88,11,74,34,3,62,70,54,123,119,89,66,"Addison Road Medical Practice","WF","WF-6","Central Walthamstow"]
["WF_LDP",44531,44533,"F86625",5903,348,3944,7,149,19,8,3,92,212,147,83,1043,235,257,122,176,58,2762,216,954,4809,95,81,30,1,7,688,318,221,205,489,137,61,75,424,55,16,39,17,0,29,32,47,73,72,53,39,"LL Medical Care (Agarwal & Agrwal Practice)","WF","WF-5","South Leytonstone"]
["WF_LDP",44531,44533,"F86621",6433,239,4703,3,143,29,19,3,108,211,123,68,797,195,186,57,177,39,3614,308,1239,5437,84,71,14,0,4,598,266,242,164,386,107,60,72,317,31,2,26,12,3,20,26,25,61,56,44,33,"Green Man Medical Centre","WF","WF-5","South Leytonstone"]
["WF_LDP",44531,44533,"F86078",6916,206,4735,3,77,9,1,2,56,149,345,131,1643,154,177,53,125,31,3613,187,657,5869,59,42,8,0,2,1088,356,214,147,542,173,84,97,347,74,6,49,17,0,61,56,10,50,108,61,42,"The Ridgeway Surgery","WF","WF-2","Chingford E4"]
["WF_LDP",44531,44533,"F86062",7280,275,5062,5,117,35,24,10,73,166,278,125,1410,184,215,84,225,51,4114,439,1482,5969,87,76,26,3,10,815,281,186,159,485,145,69,79,463,64,16,58,19,3,34,46,24,63,70,57,34,"Grove Surgery","WF","WF-7","Walthamstow West"]
["WF_LDP",44531,44533,"F86088",4948,240,3506,12,126,2,0,0,74,187,126,63,792,160,208,43,114,31,2407,157,561,4203,52,37,7,0,2,674,288,177,149,443,100,71,76,369,35,7,21,5,0,20,27,18,52,34,23,14,"The Lyndhurst Surgery","WF","WF-4","Forest Integrated Health"]
["WF_LDP",44531,44533,"F86086",6193,221,3901,2,63,16,13,4,52,100,131,62,784,190,135,49,137,36,2719,162,636,4681,84,61,18,0,3,489,235,131,107,311,88,37,44,307,30,3,22,6,0,15,16,11,54,42,26,23,"Dr Dhital Practice","WF","WF-6","Central Walthamstow"]
["WF_LDP",44531,44533,"Total",269037,11783,181244,393,5983,909,565,149,4210,8237,9135,4926,62041,9325,8092,3543,8572,2218,137009,11247,46494,216576,3186,2622,818,19,204,28315,14091,7928,6761,20724,4674,2468,2906,15007,2229,377,1852,650,27,1389,1657,1086,2603,2507,1903,1391]
["WF_LDP",44562,44565,"F86666",14888,675,10256,35,343,90,56,22,238,422,661,409,4489,556,466,249,592,159,7748,738,2939,12108,226,191,70,0,22,1806,959,453,394,1398,196,114,135,872,122,37,109,56,1,77,92,44,112,122,93,60,"The Harrow Road Surgery","WF","WF-5","South Leytonstone"]
["WF_LDP",44562,44565,"F86664",8435,295,5460,25,162,27,26,3,134,256,235,90,2411,282,173,128,351,54,4575,367,1653,6749,101,84,28,0,7,866,416,219,143,552,169,68,85,413,96,16,87,24,0,70,81,31,96,95,70,61,"Larkshall Medical Centre","WF","WF-1","Chingford/ Walthamstow"]
["WF_LDP",44562,44565,"F86689",4372,116,2958,3,77,7,7,0,57,101,58,32,703,90,76,38,75,27,2603,266,673,3301,27,25,5,0,5,296,192,101,73,259,58,34,38,126,42,2,36,14,2,29,26,25,34,24,20,16,"The Bailey Practice","WF","WF-1","Chingford/ Walthamstow"]
["WF_LDP",44562,44565,"F86679",6272,232,4077,7,99,15,9,3,81,122,125,96,993,189,157,82,215,55,3200,272,1235,4795,31,28,8,2,4,463,275,129,125,355,50,33,37,243,31,10,30,10,0,19,18,11,40,34,27,26,"Higham Hill Medical Centre","WF","WF-7","Walthamstow West"]
["WF_LDP",44562,44565,"F86627",13287,619,8666,1,503,35,20,6,314,722,688,384,3149,452,432,263,613,157,6569,656,2704,10904,212,154,52,0,11,1834,891,457,382,1406,373,198,249,814,223,35,191,77,1,140,161,94,185,207,155,106,"Churchill Medical Centre","WF","WF-2","Chingford E4"]
["WF_LDP",44562,44565,"F86626",6933,194,4706,0,73,13,9,1,52,122,180,79,1507,134,120,58,151,39,3377,237,1007,5533,50,45,11,0,2,548,238,138,117,345,93,40,52,305,25,7,19,5,0,13,16,9,50,26,22,16,"Dr Shantir Practice","WF","WF-1","Chingford/ Walthamstow"]
["WF_LDP",44562,44565,"F86650",8075,382,5484,12,154,18,14,5,98,225,281,138,1684,308,256,143,377,74,4216,395,1984,6542,116,94,25,1,9,697,366,246,228,523,117,51,61,514,56,12,46,15,0,38,37,37,78,82,57,38,"Lime Tree Surgery","WF","WF-4","Forest Integrated Health"]
["WF_LDP",44562,44565,"F86644",9406,372,6108,42,196,20,4,6,126,332,344,142,2394,236,221,106,236,70,4566,347,1167,7462,138,95,22,0,10,1097,390,307,242,682,186,78,93,526,93,11,74,16,1,56,67,37,87,69,45,34,"Waltham Forest Community & Family Health Services Ltd","WF","WF-6","Central Walthamstow"]
["WF_LDP",44562,44565,"F86696",6837,302,4796,6,137,11,4,0,81,169,208,141,1922,204,230,63,115,33,3222,235,779,5646,54,42,10,0,5,581,356,203,166,521,103,60,71,356,25,3,21,5,0,12,13,16,68,51,46,30,"Francis Road Medical Centre","WF","WF-4","Forest Integrated Health"]
["WF_LDP",44562,44565,"Y01291",9074,440,5837,22,431,22,11,3,294,537,381,241,2421,363,320,183,485,125,4644,414,2386,7272,96,78,25,1,7,1241,725,274,263,1118,205,117,139,496,110,26,89,29,0,78,91,97,109,128,104,74,"Chingford Medical Practice","WF","WF-2","Chingford E4"]
["WF_LDP",44562,44565,"F86712",3370,167,2436,3,73,5,2,2,48,92,50,28,549,130,127,34,107,27,1682,78,596,2852,15,13,3,0,3,336,184,135,112,288,50,31,34,209,12,3,11,1,0,9,11,6,29,15,14,8,"Hampton Medical Centre","WF","WF-4","Forest Integrated Health"]
["WF_LDP",44562,44565,"Total",269368,11929,181587,374,6028,921,563,158,4261,8190,9175,5079,62212,9434,8214,3638,8724,2253,137700,11431,47462,216987,3201,2648,830,18,213,28294,14345,8493,6906,21043,4680,2468,2930,15032,2221,373,1870,651,28,1472,1653,1102,2668,2506,1938,1409]
["WF_LDP",44562,44565,"Y01839",6271,222,4198,4,102,15,7,0,78,197,188,90,1153,176,181,62,145,64,3072,252,685,5008,83,67,16,0,1,714,248,189,143,364,106,43,52,418,78,5,46,24,0,45,65,18,36,59,34,25,"Lime Tree & Sinnott Healthcare Ltd","WF","WF-1","Chingford/ Walthamstow"]
["WF_LDP",44562,44565,"F86701",3787,225,2618,6,107,34,31,6,83,137,188,104,1519,161,144,72,193,49,2010,248,1030,3086,76,64,30,0,1,455,263,163,133,387,54,23,28,259,24,6,16,9,0,17,19,17,32,37,33,23,"Kiyani Medical Practice","WF","WF-5","South Leytonstone"]
["WF_LDP",44562,44565,"F86700",3887,200,2508,73,256,3,2,0,211,348,135,52,598,166,115,44,151,24,1924,133,697,3150,51,38,9,0,2,750,461,173,127,640,114,52,61,224,109,14,93,34,0,95,89,68,64,93,76,63,"Kings Head Medical Practice","WF","WF-1","Chingford/ Walthamstow"]
["WF_LDP",44562,44565,"F86708",2894,167,1835,5,73,8,7,1,50,101,124,67,821,136,112,47,126,37,1496,96,560,2338,28,25,7,0,1,388,189,123,89,283,60,38,42,213,17,2,12,1,1,12,13,12,32,28,19,11,"Claremont Medical Centre","WF","WF-6","Central Walthamstow"]
["WF_LDP",44562,44565,"F86705",3547,198,2567,13,76,11,11,1,54,94,146,102,1393,152,125,69,159,29,2034,192,968,2978,33,28,7,0,5,339,189,171,120,263,60,36,42,220,27,4,22,10,0,23,18,14,43,21,18,9,"The Langthorne Sharma Family Practice","WF","WF-5","South Leytonstone"]
["WF_LDP",44562,44565,"F86038",11370,722,6993,9,209,65,59,13,157,256,490,296,2617,659,425,264,567,140,5386,379,2367,8761,132,128,35,0,13,1089,706,499,338,909,254,150,173,806,46,7,45,10,1,37,29,21,178,108,88,70,"Sma Medical Centre","WF","WF-3","Leyton Collaborative"]
["WF_LDP",44562,44565,"F86036",14935,547,10296,5,251,45,22,6,191,328,516,243,3542,435,396,154,433,105,7879,544,2476,12002,218,189,60,0,8,1430,649,425,320,897,235,114,137,786,106,21,101,41,3,74,86,84,128,129,108,79,"The Allum Medical Centre","WF","WF-4","Forest Integrated Health"]
["WF_LDP",44562,44565,"F86045",2019,118,1434,2,50,17,9,3,41,61,104,70,760,102,98,42,109,22,1076,97,487,1729,33,28,5,0,3,261,143,92,77,194,53,36,48,136,19,1,15,5,0,15,16,4,36,22,15,12,"High Road Surgery","WF","WF-5","South Leytonstone"]
["WF_LDP",44562,44565,"F86044",10358,343,7448,3,130,10,3,2,80,222,274,150,1389,295,221,86,222,62,4587,331,1384,8534,120,89,27,0,3,754,358,206,185,529,86,37,43,406,33,5,31,6,0,17,25,15,48,62,52,30," Crawley Road Medical Centre","WF","WF-4","Forest Integrated Health"]
["WF_LDP",44562,44565,"F86030",8122,521,5370,8,187,23,12,6,143,216,392,305,1597,472,419,75,186,36,4469,248,1038,6484,45,40,12,1,4,735,489,416,330,650,159,131,147,560,38,4,35,10,0,31,30,14,112,53,46,35," Queens Road Medical Centre","WF","WF-7","Walthamstow West"]
["WF_LDP",44562,44565,"F86005",9491,297,6463,8,235,12,9,2,157,340,215,141,2273,227,208,126,276,83,4568,502,1971,7466,64,60,24,0,4,809,441,199,175,621,86,46,56,359,106,12,92,34,0,73,82,52,53,57,41,27," The Penryhn Surgery","WF","WF-1","Chingford/ Walthamstow"]
["WF_LDP",44562,44565,"F86001",7743,447,5299,5,209,20,16,3,153,300,206,99,2122,386,271,114,221,68,3989,261,1293,6378,97,83,26,0,8,890,447,286,252,642,161,71,96,545,82,12,75,17,0,48,54,28,83,79,59,41," The Firs","WF","WF-6","Central Walthamstow"]
["WF_LDP",44562,44565,"F86011",9658,664,6496,6,217,78,32,20,148,246,429,275,1808,492,417,138,327,82,5122,461,1653,8024,166,151,59,2,20,1130,593,404,343,928,214,113,137,732,90,18,88,24,7,58,68,54,148,146,128,96,"The Manor Practice","WF","WF-3","Leyton Collaborative"]
["WF_LDP",44562,44565,"F86006",6759,377,4565,1,131,9,4,0,69,159,126,67,1255,261,266,63,105,58,3087,194,494,5463,64,53,14,0,4,846,388,258,199,681,98,54,68,438,59,18,44,21,0,32,32,37,50,62,54,36,"Seymour Medical Centre","WF","WF-7","Walthamstow West"]
["WF_LDP",44562,44565,"F86616",7911,332,5135,11,307,21,11,2,239,351,317,178,2181,267,261,119,305,62,4050,314,1627,6148,53,44,20,1,2,842,519,205,215,783,167,89,100,366,68,7,55,13,1,41,59,21,105,81,70,60,"Old Church Surgery","WF","WF-2","Chingford E4"]
["WF_LDP",44562,44565,"F86607",15376,565,10411,10,271,100,59,13,192,356,507,257,4779,450,360,173,402,112,8698,791,2464,12049,204,180,59,3,10,1292,718,428,291,1056,202,112,126,678,87,11,72,33,3,62,69,55,129,119,87,62,"Addison Road Medical Practice","WF","WF-6","Central Walthamstow"]
["WF_LDP",44562,44565,"F86625",5900,349,3947,6,153,20,8,3,98,210,147,89,1053,238,265,127,177,62,2763,218,974,4823,96,84,32,1,7,683,314,244,208,487,136,60,74,429,55,16,44,18,0,36,32,51,77,69,53,40,"LL Medical Care (Agarwal & Agrwal Practice)","WF","WF-5","South Leytonstone"]
["WF_LDP",44562,44565,"F86621",6394,238,4685,4,144,27,17,3,107,211,122,72,779,190,185,55,170,36,3579,299,1181,5403,83,70,12,0,4,596,269,250,169,394,107,60,73,319,29,2,24,12,3,21,25,25,56,55,43,31,"Green Man Medical Centre","WF","WF-5","South Leytonstone"]
["WF_LDP",44562,44565,"F86088",4965,253,3519,11,129,2,0,0,82,187,125,69,793,176,218,45,125,33,2437,159,600,4218,53,37,7,0,2,674,297,199,159,450,102,74,79,371,35,7,21,5,0,21,27,18,54,33,22,14,"The Lyndhurst Surgery","WF","WF-4","Forest Integrated Health"]
["WF_LDP",44562,44565,"F86062",7232,281,5025,6,117,33,23,8,70,164,278,128,1402,186,219,92,225,53,4078,444,1525,5927,87,75,27,4,8,809,289,194,163,484,144,71,80,459,64,16,58,20,4,34,45,24,66,73,59,35,"Grove Surgery","WF","WF-7","Walthamstow West"]
["WF_LDP",44562,44565,"F86058",16682,636,11348,17,285,78,45,8,227,357,459,245,3736,520,413,214,514,149,8642,912,3530,13282,205,162,58,2,13,1470,804,348,375,1110,218,110,127,778,111,14,100,31,0,64,86,43,146,117,96,80,"St James Medical Practice Ltd","WF","WF-7","Walthamstow West"]
["WF_LDP",44562,44565,"F86086",6191,225,3897,2,64,17,14,5,53,100,133,65,787,189,142,53,143,37,2731,166,660,4682,84,61,18,0,3,490,235,139,105,313,89,39,47,309,30,3,22,6,0,15,16,11,54,42,26,23,"Dr Dhital Practice","WF","WF-6","Central Walthamstow"]
["WF_LDP",44562,44565,"F86078",6927,208,4746,3,77,10,0,2,55,149,343,135,1633,154,175,57,126,30,3621,185,675,5890,60,43,7,0,2,1083,344,220,145,531,175,85,100,347,73,6,46,15,0,60,55,9,50,108,58,38,"The Ridgeway Surgery","WF","WF-2","Chingford E4"]
["WF_LDP",44593,44600,"F86666",14913,689,10279,36,342,87,51,22,246,419,666,419,4494,567,477,249,592,160,7789,761,2973,12129,225,192,74,0,22,1812,965,475,405,1410,193,113,138,876,119,39,110,60,1,78,89,46,115,120,88,56,"The Harrow Road Surgery","WF","WF-5","South Leytonstone"]
["WF_LDP",44593,44600,"F86664",8450,299,5472,26,171,30,29,5,141,260,242,101,2447,283,178,132,361,56,4627,384,1702,6767,102,85,31,0,8,870,416,232,149,563,171,67,86,415,97,16,91,26,0,73,82,32,95,95,68,58,"Larkshall Medical Centre","WF","WF-1","Chingford/ Walthamstow"]
["WF_LDP",44593,44600,"F86689",4370,116,2951,3,80,7,7,0,57,100,57,30,705,90,77,47,79,25,2615,276,680,3295,26,24,5,0,4,296,195,107,73,261,58,34,38,127,44,2,40,15,2,31,26,25,35,24,23,18,"The Bailey Practice","WF","WF-1","Chingford/ Walthamstow"]
["WF_LDP",44593,44600,"F86679",6303,230,4110,7,100,14,9,3,80,120,126,97,997,189,157,87,214,57,3238,281,1272,4824,30,27,8,2,4,464,275,142,128,361,50,36,39,241,31,10,30,10,0,20,18,11,39,34,28,27,"Higham Hill Medical Centre","WF","WF-7","Walthamstow West"]
["WF_LDP",44593,44600,"F86627",13269,636,8658,0,523,35,19,6,334,720,684,393,3132,476,438,277,646,160,6610,677,2796,10882,212,157,54,0,10,1832,925,464,387,1459,363,198,250,812,224,34,189,75,1,142,160,99,179,205,158,109,"Churchill Medical Centre","WF","WF-2","Chingford E4"]
["WF_LDP",44593,44600,"F86626",6974,196,4726,0,77,14,10,1,55,121,179,82,1492,139,121,66,168,41,3410,250,1057,5569,50,45,10,0,3,544,257,146,119,369,92,40,52,304,26,7,21,6,0,15,17,10,52,24,20,15,"Dr Shantir Practice","WF","WF-1","Chingford/ Walthamstow"]
["WF_LDP",44593,44600,"F86650",8096,380,5503,11,157,19,14,5,96,224,280,140,1688,304,254,141,380,73,4223,390,2006,6557,115,94,26,1,9,692,366,248,236,524,115,53,63,511,56,12,51,14,0,39,37,41,70,81,57,40,"Lime Tree Surgery","WF","WF-4","Forest Integrated Health"]
["WF_LDP",44593,44600,"F86644",9370,365,6079,37,195,23,5,6,129,331,342,147,2391,230,218,110,224,70,4618,361,1161,7441,138,100,25,0,12,1110,392,318,242,684,184,72,87,525,92,11,76,17,1,60,67,37,86,70,48,38,"Waltham Forest Community & Family Health Services Ltd","WF","WF-6","Central Walthamstow"]
["WF_LDP",44593,44600,"F86696",6807,304,4779,4,137,9,3,0,81,167,207,146,1902,206,223,62,119,32,3248,243,770,5621,53,42,10,0,5,578,353,222,171,518,104,61,71,356,25,3,21,5,0,13,13,16,67,51,46,31,"Francis Road Medical Centre","WF","WF-4","Forest Integrated Health"]
["WF_LDP",44593,44600,"Y01291",9173,450,5899,24,441,22,10,3,297,539,385,250,2495,374,324,199,521,133,4749,451,2535,7350,96,79,26,1,6,1246,724,288,269,1123,204,119,141,498,108,24,87,29,0,77,88,95,110,129,107,76,"Chingford Medical Practice","WF","WF-2","Chingford E4"]
["WF_LDP",44593,44600,"F86712",3370,171,2435,3,72,5,2,2,47,91,51,28,540,129,130,38,107,25,1688,79,600,2851,15,13,3,0,3,339,182,138,111,290,50,31,34,212,12,3,9,1,0,9,11,6,29,15,14,8,"Hampton Medical Centre","WF","WF-4","Forest Integrated Health"]
["WF_LDP",44593,44600,"Total",269495,12049,181676,353,6116,920,553,156,4319,8183,9197,5215,62329,9522,8258,3750,8985,2290,138403,11651,48634,217147,3185,2655,850,17,208,28326,14481,8747,7057,21354,4662,2485,2960,15045,2209,366,1880,657,26,1504,1635,1114,2671,2512,1959,1420]
["WF_LDP",44593,44600,"Y01839",6264,227,4197,4,100,17,9,0,78,195,186,88,1150,177,187,67,148,64,3063,252,719,4999,82,67,16,0,2,711,241,194,149,363,108,43,53,417,76,5,47,24,0,46,64,18,36,59,36,28,"Lime Tree & Sinnott Healthcare Ltd","WF","WF-1","Chingford/ Walthamstow"]
["WF_LDP",44593,44600,"F86701",3822,231,2647,5,107,35,32,6,80,140,188,104,1543,162,145,74,194,48,2031,253,1034,3120,78,67,33,0,0,463,263,167,131,389,54,25,30,267,24,6,17,9,0,17,19,17,33,37,33,23,"Kiyani Medical Practice","WF","WF-5","South Leytonstone"]
["WF_LDP",44593,44600,"F86700",3856,204,2490,74,261,2,1,0,206,348,134,56,597,166,115,45,152,26,1932,138,713,3130,49,37,10,0,2,749,456,174,131,646,113,53,64,221,107,13,91,32,0,93,87,68,64,93,78,65,"Kings Head Medical Practice","WF","WF-1","Chingford/ Walthamstow"]
["WF_LDP",44593,44600,"F86708",2789,161,1766,4,74,7,7,1,52,100,118,65,810,128,109,47,132,36,1469,105,581,2250,25,22,5,0,0,371,182,121,87,276,58,35,39,206,16,2,12,1,1,12,12,11,30,27,19,11,"Claremont Medical Centre","WF","WF-6","Central Walthamstow"]
["WF_LDP",44593,44600,"F86705",3540,198,2566,3,75,11,10,1,53,92,147,104,1389,150,123,69,160,28,2033,192,970,2971,34,29,8,0,5,338,189,170,118,264,60,36,42,217,27,4,22,10,0,23,18,14,41,21,19,9,"The Langthorne Sharma Family Practice","WF","WF-5","South Leytonstone"]
["WF_LDP",44593,44600,"F86625",5902,352,3950,5,152,20,8,4,96,209,145,92,1061,242,266,127,176,64,2770,216,1005,4829,94,84,31,1,6,686,310,253,211,487,136,61,75,431,53,15,42,18,0,34,31,49,76,71,54,40,"LL Medical Care (Agarwal & Agrwal Practice)","WF","WF-5","South Leytonstone"]
["WF_LDP",44593,44600,"F86036",14827,559,10230,5,252,46,20,7,187,326,518,256,3544,450,404,168,450,113,7870,552,2586,11933,213,185,59,0,8,1425,679,437,328,934,233,111,135,785,108,21,103,41,3,77,86,84,129,131,110,79,"The Allum Medical Centre","WF","WF-4","Forest Integrated Health"]
["WF_LDP",44593,44600,"F86030",8090,527,5346,6,190,24,13,6,149,217,391,307,1602,484,417,76,196,38,4472,254,1075,6456,45,40,12,1,4,734,531,418,339,679,157,133,148,557,38,4,35,10,0,31,30,14,114,54,51,42," Queens Road Medical Centre","WF","WF-7","Walthamstow West"]
["WF_LDP",44593,44600,"F86044",10506,356,7552,3,135,13,4,3,81,223,278,157,1420,305,231,92,240,63,4699,363,1466,8656,121,90,28,0,4,761,372,207,205,545,88,39,45,411,33,5,32,5,0,17,25,15,47,64,53,30," Crawley Road Medical Centre","WF","WF-4","Forest Integrated Health"]
["WF_LDP",44593,44600,"F86038",11266,737,6920,9,213,67,60,12,161,252,481,305,2605,666,433,263,576,144,5348,385,2430,8680,131,127,35,0,14,1080,721,510,357,927,253,155,179,803,44,7,42,11,1,35,28,20,177,108,88,71,"Sma Medical Centre","WF","WF-3","Leyton Collaborative"]
["WF_LDP",44593,44600,"F86005",9502,298,6455,8,240,13,8,2,160,340,219,144,2240,228,211,129,283,85,4545,490,1981,7471,61,56,22,0,3,807,444,213,173,625,87,47,58,360,103,11,91,34,0,78,79,50,54,57,40,30," The Penryhn Surgery","WF","WF-1","Chingford/ Walthamstow"]
["WF_LDP",44593,44600,"F86001",7720,453,5292,8,219,19,16,3,163,307,210,111,2097,392,263,112,224,68,3997,267,1308,6363,97,83,27,0,8,892,462,288,249,654,159,71,94,546,82,11,74,16,0,47,53,29,87,78,60,43," The Firs","WF","WF-6","Central Walthamstow"]
["WF_LDP",44593,44600,"F86011",9690,663,6507,6,213,64,26,15,142,244,434,273,1814,477,411,147,330,84,5118,455,1666,8052,168,151,58,2,16,1131,575,422,342,923,214,109,134,738,92,18,89,24,6,60,68,58,141,147,129,87,"The Manor Practice","WF","WF-3","Leyton Collaborative"]
["WF_LDP",44593,44600,"F86006",6788,370,4584,0,132,11,4,0,71,157,135,67,1272,254,258,64,115,59,3109,203,532,5496,63,51,13,0,4,851,399,261,201,705,99,56,71,439,58,18,43,20,0,33,32,37,50,65,55,36,"Seymour Medical Centre","WF","WF-7","Walthamstow West"]
["WF_LDP",44593,44600,"F86045",2025,118,1439,2,50,15,8,1,42,61,105,76,773,103,100,44,111,21,1091,98,515,1734,34,28,6,0,3,261,149,93,79,204,53,35,48,135,20,1,15,5,0,16,17,4,37,22,15,12,"High Road Surgery","WF","WF-5","South Leytonstone"]
["WF_LDP",44593,44600,"F86607",15420,571,10457,9,272,104,60,13,188,356,506,261,4813,448,361,179,426,113,8815,816,2592,12079,206,184,63,3,11,1296,702,434,299,1057,199,110,123,680,88,11,71,34,3,65,69,55,127,119,86,59,"Addison Road Medical Practice","WF","WF-6","Central Walthamstow"]
["WF_LDP",44593,44600,"F86088",4998,261,3542,8,129,4,1,1,84,187,128,74,825,184,226,47,129,34,2466,162,632,4253,53,38,6,0,1,675,298,201,161,453,103,74,80,373,35,7,22,5,0,21,27,18,56,32,21,12,"The Lyndhurst Surgery","WF","WF-4","Forest Integrated Health"]
["WF_LDP",44593,44600,"F86621",6381,231,4665,4,141,23,15,3,106,210,122,69,767,185,179,47,162,36,3547,287,1100,5385,83,70,11,0,3,596,260,254,171,387,106,62,74,319,29,2,24,12,3,21,25,25,54,56,42,31,"Green Man Medical Centre","WF","WF-5","South Leytonstone"]
["WF_LDP",44593,44600,"F86616",7943,336,5155,11,307,21,11,2,240,351,316,180,2204,272,261,118,320,60,4068,314,1652,6177,51,42,18,0,2,842,516,229,222,781,169,91,101,372,68,6,54,14,0,47,58,21,104,81,71,61,"Old Church Surgery","WF","WF-2","Chingford E4"]
["WF_LDP",44593,44600,"F86062",7195,282,4981,10,122,34,23,8,73,168,279,134,1395,188,223,97,232,54,4055,429,1596,5894,86,75,27,4,8,807,288,194,172,487,142,75,85,455,63,16,58,21,4,34,44,24,69,71,59,33,"Grove Surgery","WF","WF-7","Walthamstow West"]
["WF_LDP",44593,44600,"F86058",16753,647,11398,16,285,79,44,8,227,352,460,254,3722,527,420,214,536,148,8697,903,3552,13351,204,161,58,2,13,1482,811,365,381,1133,220,113,132,780,109,14,100,32,0,65,84,45,152,118,98,80,"St James Medical Practice Ltd","WF","WF-7","Walthamstow West"]
["WF_LDP",44593,44600,"F86086",6209,225,3915,1,65,16,14,5,53,101,132,66,792,191,144,58,150,40,2800,188,692,4705,84,66,24,0,3,502,237,143,112,319,89,41,49,311,29,2,23,6,0,15,16,10,55,44,27,24,"Dr Dhital Practice","WF","WF-6","Central Walthamstow"]
["WF_LDP",44593,44600,"F86078",6914,206,4731,1,87,10,0,2,64,155,346,139,1611,156,174,58,132,32,3593,176,685,5877,61,44,8,0,2,1083,346,219,149,554,178,86,102,345,73,6,48,15,0,60,55,10,61,109,58,38,"The Ridgeway Surgery","WF","WF-2","Chingford E4"]
["WF_LDP",44621,44630,"F86700",3846,208,2486,71,268,2,1,0,212,344,132,58,595,170,116,44,153,29,1949,152,740,3121,48,41,14,0,2,738,452,174,134,654,111,53,64,218,106,13,95,33,0,92,89,66,65,92,80,64,"Kings Head Medical Practice","WF","WF-1","Chingford/ Walthamstow"]
["WF_LDP",44621,44630,"F86701",3826,231,2650,7,109,31,28,5,81,143,188,103,1545,162,144,68,201,48,2031,256,1027,3124,79,69,34,0,1,467,259,170,133,379,55,27,32,267,24,6,17,10,0,18,19,17,33,38,33,24,"Kiyani Medical Practice","WF","WF-5","South Leytonstone"]
["WF_LDP",44621,44630,"F86705",3533,197,2562,1,73,10,9,0,52,91,148,105,1385,146,116,68,164,30,2044,198,974,2972,34,30,9,0,5,338,189,171,117,264,60,35,41,216,27,4,23,11,0,23,18,14,43,21,19,10,"The Langthorne Sharma Family Practice","WF","WF-5","South Leytonstone"]
["WF_LDP",44621,44630,"F86679",6359,230,4147,7,102,14,9,3,80,121,128,100,993,188,158,87,220,59,3299,303,1333,4877,32,29,11,2,4,465,277,143,129,361,52,38,41,238,31,10,30,10,0,20,19,11,41,34,29,27,"Higham Hill Medical Centre","WF","WF-7","Walthamstow West"]
["WF_LDP",44621,44630,"F86689",4373,111,2951,2,78,7,7,0,54,100,58,32,707,90,72,48,75,29,2640,276,676,3294,26,24,5,0,4,297,177,107,74,243,57,30,33,127,44,2,40,15,2,31,26,25,32,24,22,17,"The Bailey Practice","WF","WF-1","Chingford/ Walthamstow"]
["WF_LDP",44621,44630,"F86696",6841,306,4805,3,147,8,4,0,83,168,208,149,1896,216,222,59,131,36,3295,254,801,5650,52,42,10,0,5,577,352,222,171,517,101,61,71,357,25,3,22,5,0,13,13,16,62,51,45,32,"Francis Road Medical Centre","WF","WF-4","Forest Integrated Health"]
["WF_LDP",44621,44630,"Y01839",6238,235,4172,2,104,17,7,0,82,192,186,88,1147,181,176,71,173,66,3059,259,785,4973,82,67,16,0,3,706,247,204,146,373,109,44,54,414,76,5,48,24,0,50,64,19,41,59,39,31,"Lime Tree & Sinnott Healthcare Ltd","WF","WF-1","Chingford/ Walthamstow"]
["WF_LDP",44621,44630,"Total",269561,12182,181679,410,6217,962,551,165,4359,8225,9281,5358,62623,9602,8281,3825,9319,2369,139007,11928,49874,217206,3192,2686,884,19,215,28304,14633,8888,7126,21534,4645,2485,2961,15067,2203,361,1879,646,24,1525,1645,1115,2700,2521,1993,1422]
["WF_LDP",44621,44630,"F86062",7170,287,4944,13,122,34,22,8,73,167,285,141,1406,193,223,96,240,55,4061,439,1653,5853,85,75,28,4,7,802,305,193,171,499,140,75,86,453,62,16,58,21,4,34,43,25,72,71,62,36,"Grove Surgery","WF","WF-7","Walthamstow West"]
["WF_LDP",44621,44630,"F86708",2788,163,1768,4,75,7,7,1,50,99,122,67,817,129,110,48,139,34,1471,107,613,2253,25,22,5,0,0,373,182,120,92,280,57,30,34,207,17,3,14,1,1,13,13,11,29,29,22,12,"Claremont Medical Centre","WF","WF-6","Central Walthamstow"]
["WF_LDP",44621,44630,"F86712",3368,172,2429,7,78,5,2,2,49,98,53,31,533,132,131,41,106,23,1704,93,634,2844,15,13,3,0,3,342,181,140,112,297,50,32,36,214,12,3,9,1,0,9,11,6,29,15,14,8,"Hampton Medical Centre","WF","WF-4","Forest Integrated Health"]
["WF_LDP",44621,44630,"Y01291",9168,455,5900,85,486,26,12,4,324,598,396,266,2581,371,325,206,548,144,4805,480,2647,7366,96,79,27,1,6,1250,720,301,260,1132,205,122,144,499,111,24,90,29,0,83,90,95,115,128,107,73,"Chingford Medical Practice","WF","WF-2","Chingford E4"]
["WF_LDP",44621,44630,"F86666",14944,703,10314,30,335,85,52,21,241,413,673,427,4528,582,492,257,587,163,7858,780,2992,12172,224,190,70,0,23,1814,994,490,418,1426,193,112,141,879,120,38,112,62,1,80,90,48,117,122,98,63,"The Harrow Road Surgery","WF","WF-5","South Leytonstone"]
["WF_LDP",44621,44630,"F86607",15450,581,10492,14,276,112,60,13,181,361,509,271,4802,447,362,187,434,113,8863,824,2618,12097,208,191,66,4,11,1299,689,439,301,1048,196,112,123,683,88,10,76,34,2,66,71,56,122,121,88,54,"Addison Road Medical Practice","WF","WF-6","Central Walthamstow"]
["WF_LDP",44621,44630,"F86616",7970,341,5171,9,307,21,11,2,240,348,311,180,2202,276,261,127,334,61,4087,312,1672,6200,52,43,18,0,2,843,521,238,222,786,165,93,102,372,68,6,56,14,0,49,59,21,102,86,75,62,"Old Church Surgery","WF","WF-2","Chingford E4"]
["WF_LDP",44621,44630,"F86621",6416,241,4697,4,146,18,14,2,109,207,124,74,764,189,186,50,172,36,3543,286,1109,5417,82,70,11,0,4,594,262,253,176,391,107,63,75,319,28,1,24,12,3,20,24,24,57,55,42,29,"Green Man Medical Centre","WF","WF-5","South Leytonstone"]
["WF_LDP",44621,44630,"F86078",6868,219,4716,2,87,11,0,3,65,152,351,146,1587,168,169,63,143,33,3621,181,733,5847,61,44,8,0,2,1074,361,226,150,579,174,89,104,340,71,6,51,15,0,59,53,9,58,106,56,38,"The Ridgeway Surgery","WF","WF-2","Chingford E4"]
["WF_LDP",44621,44630,"F86086",6250,232,3950,1,70,18,12,6,56,104,137,69,797,196,144,64,161,39,2830,189,757,4745,85,64,22,0,3,505,243,145,117,325,89,40,49,317,29,2,22,5,0,15,16,10,58,45,29,26,"Dr Dhital Practice","WF","WF-6","Central Walthamstow"]
["WF_LDP",44621,44630,"F86088",5002,266,3544,6,129,5,1,1,86,185,130,77,852,190,228,49,137,35,2480,166,660,4255,55,40,8,0,1,675,302,202,161,459,103,75,80,372,35,7,23,6,0,21,27,19,57,32,22,11,"The Lyndhurst Surgery","WF","WF-4","Forest Integrated Health"]
["WF_LDP",44621,44630,"F86644",9302,361,6031,36,192,26,6,7,125,331,343,143,2398,228,220,109,214,75,4560,350,1148,7387,139,101,25,0,14,1100,392,314,238,680,185,73,87,521,90,10,76,18,1,59,67,36,87,72,47,39,"Waltham Forest Community & Family Health Services Ltd","WF","WF-6","Central Walthamstow"]
["WF_LDP",44621,44630,"F86650",8066,365,5488,8,154,21,15,5,100,225,280,140,1691,305,258,134,371,78,4218,395,1985,6529,116,95,29,1,9,691,371,259,242,521,116,51,61,512,57,12,50,13,0,41,37,41,74,79,55,39,"Lime Tree Surgery","WF","WF-4","Forest Integrated Health"]
["WF_LDP",44621,44630,"F86664",8449,305,5474,31,179,30,28,5,142,262,245,105,2470,285,175,138,367,64,4649,387,1733,6771,101,84,32,0,8,869,415,241,152,567,173,68,87,418,97,15,91,25,0,75,82,32,99,94,70,58,"Larkshall Medical Centre","WF","WF-1","Chingford/ Walthamstow"]
["WF_LDP",44621,44630,"F86625",5880,356,3943,8,158,19,7,3,100,210,146,93,1062,238,269,121,189,68,2764,216,1033,4819,92,84,32,1,6,686,318,256,211,505,135,61,74,429,52,15,41,17,0,33,31,48,78,70,57,43,"LL Medical Care (Agarwal & Agrwal Practice)","WF","WF-5","South Leytonstone"]
["WF_LDP",44621,44630,"F86626",6995,199,4742,0,78,20,13,2,56,120,181,89,1478,141,124,70,183,39,3448,265,1097,5591,50,45,10,1,2,545,270,159,123,377,91,39,51,305,26,7,20,4,0,15,18,10,53,25,20,15,"Dr Shantir Practice","WF","WF-1","Chingford/ Walthamstow"]
["WF_LDP",44621,44630,"F86627",13277,653,8663,2,527,35,18,6,339,719,684,406,3148,481,461,281,677,168,6681,697,2908,10889,211,158,56,0,11,1833,944,468,390,1491,363,206,257,820,223,34,181,71,0,143,162,101,173,206,159,107,"Churchill Medical Centre","WF","WF-2","Chingford E4"]
["WF_LDP",44621,44630,"F86036",14783,589,10172,3,255,58,23,10,189,322,520,272,3589,466,416,178,474,113,7863,559,2675,11881,214,186,61,0,7,1423,705,441,348,962,230,110,138,786,106,20,101,38,3,75,85,82,134,133,113,78,"The Allum Medical Centre","WF","WF-4","Forest Integrated Health"]
["WF_LDP",44621,44630,"F86030",8104,525,5355,5,188,23,12,6,144,216,389,304,1618,478,415,75,198,39,4486,252,1087,6464,47,42,12,1,4,738,539,418,343,680,157,130,146,557,37,4,35,10,0,30,29,13,115,53,50,41," Queens Road Medical Centre","WF","WF-7","Walthamstow West"]
["WF_LDP",44621,44630,"F86038",11105,745,6782,6,214,67,59,13,168,249,488,315,2603,673,436,256,578,145,5305,392,2464,8531,129,125,34,0,14,1071,722,514,356,927,252,156,181,806,45,7,43,11,1,35,29,21,180,108,93,73,"Sma Medical Centre","WF","WF-3","Leyton Collaborative"]
["WF_LDP",44621,44630,"F86045",2027,119,1439,3,51,15,8,1,43,61,106,77,800,104,103,49,124,20,1123,122,571,1740,34,32,11,0,4,260,149,94,80,205,53,37,49,136,20,1,16,6,0,16,17,4,37,22,16,13,"High Road Surgery","WF","WF-5","South Leytonstone"]
["WF_LDP",44621,44630,"F86044",10688,362,7663,3,138,13,4,3,87,223,278,163,1454,313,237,102,247,68,4790,380,1531,8795,123,92,30,0,4,762,384,210,215,549,87,37,44,418,34,5,32,5,0,19,26,15,51,64,47,24," Crawley Road Medical Centre","WF","WF-4","Forest Integrated Health"]
["WF_LDP",44621,44630,"F86001",7737,453,5295,9,221,19,15,3,160,307,213,110,2063,385,257,113,232,70,4002,265,1339,6378,98,84,27,0,7,894,474,290,257,676,158,69,92,547,84,11,75,17,0,48,54,29,87,79,63,42," The Firs","WF","WF-6","Central Walthamstow"]
["WF_LDP",44621,44630,"F86058",16716,661,11360,14,282,87,50,9,225,349,465,273,3730,537,421,228,552,153,8702,900,3567,13314,200,157,57,2,14,1480,828,379,384,1152,217,116,133,774,108,14,100,30,0,68,84,45,151,117,98,81,"St James Medical Practice Ltd","WF","WF-7","Walthamstow West"]
["WF_LDP",44621,44630,"F86005",9521,299,6472,6,247,13,9,2,164,340,227,148,2255,234,207,129,323,81,4540,494,2047,7487,62,56,24,0,3,811,443,213,171,621,89,45,55,360,103,11,88,31,0,78,79,51,58,60,43,32," The Penryhn Surgery","WF","WF-1","Chingford/ Walthamstow"]
["WF_LDP",44621,44630,"F86011",9692,650,6502,8,213,74,22,19,134,247,440,269,1851,465,399,146,345,92,5141,494,1700,8058,173,161,65,2,18,1134,571,432,338,910,219,103,127,746,91,18,90,25,6,61,69,60,141,147,125,86,"The Manor Practice","WF","WF-3","Leyton Collaborative"]
["WF_LDP",44621,44630,"F86006",6809,362,4600,0,128,11,4,0,65,153,137,67,1276,243,248,63,127,63,3095,205,565,5512,62,51,14,0,4,848,395,262,194,698,96,53,69,440,56,18,30,17,0,33,31,35,49,63,55,34,"Seymour Medical Centre","WF","WF-7","Walthamstow West"]
["WF_LDP",44652,44655,"F86700",3901,210,2509,12,270,3,2,1,212,344,131,57,582,171,117,50,149,31,1961,152,746,3176,49,42,14,0,2,738,443,175,138,651,111,53,64,220,104,13,93,31,0,90,87,64,65,92,79,63,"Kings Head Medical Practice","WF","WF-1","Chingford/ Walthamstow"]
["WF_LDP",44652,44655,"F86701",3853,231,2667,7,106,31,27,5,79,141,188,104,1559,163,157,70,197,49,2029,252,1006,3145,80,69,33,0,1,466,247,172,144,373,54,29,34,268,24,6,17,10,0,18,19,17,32,38,31,22,"Kiyani Medical Practice","WF","WF-5","South Leytonstone"]
["WF_LDP",44652,44655,"F86705",3512,200,2550,1,72,9,8,0,50,90,153,109,1391,151,115,66,169,30,2010,187,939,2958,32,29,9,0,4,338,194,170,115,273,60,35,41,214,27,4,23,11,0,23,18,14,46,20,20,11,"The Langthorne Sharma Family Practice","WF","WF-5","South Leytonstone"]
["WF_LDP",44652,44655,"F86679",6372,230,4155,5,103,14,8,3,82,120,128,98,986,189,157,87,225,61,3326,316,1338,4882,32,28,10,2,4,463,288,141,127,370,50,37,40,241,32,10,31,11,0,20,19,12,40,33,28,27,"Higham Hill Medical Centre","WF","WF-7","Walthamstow West"]
["WF_LDP",44652,44655,"F86689",4395,118,2969,2,74,7,7,0,51,99,60,30,718,100,70,51,78,30,2669,281,684,3309,27,25,5,0,4,297,200,108,71,264,57,31,33,127,44,2,41,15,1,31,26,25,35,24,23,19,"The Bailey Practice","WF","WF-1","Chingford/ Walthamstow"]
["WF_LDP",44652,44655,"F86696",6883,307,4826,5,145,7,2,1,77,166,210,153,1889,217,224,57,128,35,3324,265,786,5690,54,42,10,0,5,585,349,223,172,513,101,60,70,360,25,3,21,5,0,13,13,16,61,51,44,31,"Francis Road Medical Centre","WF","WF-4","Forest Integrated Health"]
["WF_LDP",44652,44655,"Y01839",6236,231,4176,2,107,16,7,0,82,191,185,88,1142,173,174,77,174,61,3083,263,791,4970,82,66,14,0,4,706,235,207,148,373,110,45,52,417,77,5,53,26,0,53,64,21,39,59,38,32,"Lime Tree & Sinnott Healthcare Ltd","WF","WF-1","Chingford/ Walthamstow"]
["WF_LDP",44652,44655,"Total",269929,12456,181906,352,6312,1014,568,182,4428,8232,9378,5459,63078,9858,8365,3934,9584,2445,139372,11914,50850,217516,3204,2709,901,20,222,28424,14988,8978,7255,22014,4648,2515,2981,15139,2214,360,1895,659,22,1539,1654,1131,2761,2522,2027,1466]
["WF_LDP",44652,44655,"F86626",7021,196,4750,0,70,9,6,2,49,120,180,85,1471,140,132,79,177,42,3425,261,1104,5602,51,44,8,1,3,544,240,160,129,349,90,38,49,310,26,7,18,4,0,15,18,10,50,25,18,13,"Dr Shantir Practice","WF","WF-1","Chingford/ Walthamstow"]
["WF_LDP",44652,44655,"F86708",2782,164,1766,3,73,7,5,1,51,98,121,63,813,126,104,49,141,34,1471,104,633,2250,26,22,5,0,0,370,183,119,92,279,57,31,35,205,17,3,14,1,1,13,13,11,29,29,24,14,"Claremont Medical Centre","WF","WF-6","Central Walthamstow"]
["WF_LDP",44652,44655,"F86712",3395,178,2450,7,80,5,2,2,51,98,54,31,529,141,130,42,108,21,1720,96,644,2868,15,13,3,0,3,350,192,143,112,303,49,30,34,220,14,4,11,3,0,11,11,6,29,16,15,8,"Hampton Medical Centre","WF","WF-4","Forest Integrated Health"]
["WF_LDP",44652,44655,"Y01291",9173,456,5911,87,499,25,13,4,340,605,397,268,2651,376,321,213,566,150,4887,500,2731,7387,96,79,26,1,6,1326,736,300,260,1197,207,129,154,503,113,24,89,27,0,83,90,96,116,128,108,73,"Chingford Medical Practice","WF","WF-2","Chingford E4"]
["WF_LDP",44652,44655,"F86666",14983,732,10347,15,342,90,55,22,247,414,691,451,4719,613,501,274,629,172,7964,827,3240,12213,224,190,71,0,24,1829,1041,499,429,1481,194,114,145,884,122,38,115,60,1,83,91,50,131,124,101,69,"The Harrow Road Surgery","WF","WF-5","South Leytonstone"]
["WF_LDP",44652,44655,"F86086",6265,234,3956,1,70,19,13,6,55,103,138,70,790,192,145,66,171,38,2847,197,785,4757,85,65,21,0,3,504,238,147,118,321,90,41,49,322,30,2,23,5,0,15,16,11,56,45,29,26,"Dr Dhital Practice","WF","WF-6","Central Walthamstow"]
["WF_LDP",44652,44655,"F86088",5027,263,3562,5,128,4,1,1,88,185,131,75,851,188,223,48,137,35,2487,161,649,4278,56,41,7,0,1,678,305,202,159,458,104,70,74,372,36,7,24,7,0,21,28,19,55,32,22,11,"The Lyndhurst Surgery","WF","WF-4","Forest Integrated Health"]
["WF_LDP",44652,44655,"F86078",6869,222,4716,4,93,14,0,4,66,156,351,140,1581,170,164,69,143,36,3585,171,745,5847,63,44,8,0,3,1076,372,227,154,595,175,86,101,342,72,6,47,14,0,59,53,10,61,108,61,46,"The Ridgeway Surgery","WF","WF-2","Chingford E4"]
["WF_LDP",44652,44655,"F86058",16561,678,11214,12,286,93,51,10,231,348,471,290,3724,570,439,224,555,155,8558,857,3490,13173,196,156,59,2,13,1475,901,393,386,1212,217,115,133,775,108,14,99,30,0,70,85,45,152,118,102,83,"St James Medical Practice Ltd","WF","WF-7","Walthamstow West"]
["WF_LDP",44652,44655,"F86062",7155,305,4926,16,124,35,23,8,75,167,283,143,1408,205,228,106,250,58,4109,462,1760,5831,84,74,27,4,8,804,324,192,180,524,139,81,93,452,61,16,60,21,2,34,43,25,79,70,65,45,"Grove Surgery","WF","WF-7","Walthamstow West"]
["WF_LDP",44652,44655,"F86607",15547,580,10546,20,284,109,55,14,183,370,515,271,4778,446,356,196,458,111,8894,803,2711,12163,211,192,63,3,11,1311,685,457,296,1042,195,105,118,693,88,10,77,34,3,66,72,57,118,123,88,53,"Addison Road Medical Practice","WF","WF-6","Central Walthamstow"]
["WF_LDP",44652,44655,"F86644",9254,402,5999,38,213,41,22,8,144,330,343,149,2411,265,224,121,228,80,4521,345,1232,7352,137,107,31,0,16,1097,417,317,245,713,185,82,95,518,89,10,77,19,1,59,68,36,95,71,51,41,"Waltham Forest Community & Family Health Services Ltd","WF","WF-6","Central Walthamstow"]
["WF_LDP",44652,44655,"F86627",13283,672,8666,2,538,38,18,5,349,712,688,424,3178,507,469,286,709,173,6748,714,3015,10885,211,159,57,0,11,1831,972,471,397,1526,362,210,258,818,223,35,186,76,0,142,164,108,178,208,164,114,"Churchill Medical Centre","WF","WF-2","Chingford E4"]
["WF_LDP",44652,44655,"F86625",5882,380,3947,7,171,18,7,3,113,210,145,94,1056,247,275,114,204,81,2770,218,1087,4827,91,83,33,1,6,685,341,257,218,556,134,63,74,431,50,13,41,17,0,32,31,47,86,70,62,47,"LL Medical Care (Agarwal & Agrwal Practice)","WF","WF-5","South Leytonstone"]
["WF_LDP",44652,44655,"F86616",7996,347,5180,11,306,21,11,2,236,345,319,181,2239,277,266,134,342,64,4118,311,1698,6212,54,45,19,0,2,846,522,249,230,789,162,93,101,379,69,6,58,15,0,52,59,21,103,87,78,66,"Old Church Surgery","WF","WF-2","Chingford E4"]
["WF_LDP",44652,44655,"F86621",6445,265,4719,3,147,28,22,4,110,204,130,85,777,218,213,52,186,45,3527,272,1121,5429,81,71,15,0,4,597,268,254,195,399,108,63,76,322,28,1,26,11,2,20,24,24,59,54,41,28,"Green Man Medical Centre","WF","WF-5","South Leytonstone"]
["WF_LDP",44652,44655,"F86005",9510,298,6477,7,245,14,10,2,168,338,229,151,2245,232,205,124,331,86,4499,452,2001,7491,62,56,25,0,3,808,449,213,172,624,87,45,55,362,105,11,90,33,0,80,81,52,60,59,43,27," The Penryhn Surgery","WF","WF-1","Chingford/ Walthamstow"]
["WF_LDP",44652,44655,"F86006",6825,362,4620,0,130,12,4,0,66,154,137,69,1272,241,239,60,130,63,3073,195,567,5530,62,50,14,0,4,847,393,261,197,688,99,55,70,440,56,18,35,17,1,33,31,35,51,63,56,36,"Seymour Medical Centre","WF","WF-7","Walthamstow West"]
["WF_LDP",44652,44655,"F86001",7729,465,5286,8,223,23,18,4,154,305,233,119,2087,393,263,126,266,74,4014,271,1445,6363,99,85,29,0,7,898,493,292,265,707,160,68,89,554,84,11,64,17,0,48,55,30,89,80,64,43," The Firs","WF","WF-6","Central Walthamstow"]
["WF_LDP",44652,44655,"F86664",8471,309,5496,33,180,26,24,4,143,267,246,104,2496,287,179,137,361,65,4696,389,1746,6798,99,82,28,0,8,876,411,245,153,563,173,70,88,424,96,14,89,24,0,75,81,32,101,96,68,56,"Larkshall Medical Centre","WF","WF-1","Chingford/ Walthamstow"]
["WF_LDP",44652,44655,"F86650",8080,362,5506,6,156,26,17,9,100,225,297,143,1701,301,254,133,359,79,4229,396,1959,6547,117,96,29,1,9,690,384,266,242,536,115,54,65,515,57,12,50,13,0,42,37,42,83,79,60,42,"Lime Tree Surgery","WF","WF-4","Forest Integrated Health"]
["WF_LDP",44652,44655,"F86011",9698,649,6502,9,211,83,20,22,132,254,445,256,1875,473,394,144,351,92,5163,502,1673,8066,173,164,73,4,17,1141,588,434,337,922,223,107,131,747,93,18,91,27,6,62,70,60,142,145,125,89,"The Manor Practice","WF","WF-3","Leyton Collaborative"]
["WF_LDP",44652,44655,"F86044",10802,387,7735,5,148,11,3,3,94,227,279,168,1466,328,244,99,248,72,4877,397,1567,8879,123,95,31,0,4,764,430,214,227,593,88,38,45,428,35,5,33,8,0,19,26,15,51,64,49,28," Crawley Road Medical Centre","WF","WF-4","Forest Integrated Health"]
["WF_LDP",44652,44655,"F86045",2026,121,1440,2,51,22,8,2,43,60,104,79,810,108,103,52,126,19,1127,125,577,1742,37,34,12,0,4,261,152,93,80,210,53,37,49,135,20,1,19,8,0,16,17,4,37,22,17,14,"High Road Surgery","WF","WF-5","South Leytonstone"]
["WF_LDP",44652,44655,"F86038",11105,749,6781,8,219,69,60,14,170,250,482,315,2616,676,430,270,590,145,5319,401,2508,8534,129,127,36,0,15,1065,731,518,364,941,252,154,179,798,46,7,44,12,1,37,30,22,183,106,93,76,"Sma Medical Centre","WF","WF-3","Leyton Collaborative"]
["WF_LDP",44652,44655,"F86030",8161,525,5408,6,191,23,12,6,144,216,388,300,1635,475,415,76,198,37,4496,232,1090,6518,49,44,13,1,4,739,547,417,340,689,157,131,146,556,38,4,36,10,0,30,29,13,113,52,50,39," Queens Road Medical Centre","WF","WF-7","Walthamstow West"]
["WF_LDP",44652,44655,"F86036",14732,628,10148,3,257,62,27,10,193,320,526,296,3632,499,435,182,500,121,7846,539,2782,11844,217,190,63,0,9,1419,717,442,363,980,230,115,141,787,105,20,100,37,3,74,85,81,136,131,110,74,"The Allum Medical Centre","WF","WF-4","Forest Integrated Health"]