{"text_format":"1","workbook":"xlsx","n_sheets":12,"sheets":["Cover Sheet","Network Summary","Patients becoming 12m","Patients becoming 24m","Patients becoming 5y","Trending","Rows","Lookup","Data","01072021","Control Panel","Sheet2"],"not_rendered":{"charts":1,"images":7,"macros":1,"external_links":1,"defined_names":9,"comments":0,"pivot_tables":0},"unopened":[],"bounds":{"document_bytes":16777216,"sheet_cells":100000,"rows_first":2000,"rows_last":500,"rows_between":2000,"halvings":0,"cell_chars":16384,"cell_head_chars":4096},"cells_cut":0,"cells_raw":0,"read":"whole","date_system":"1900"}

{"sheet":"Cover Sheet","index":0,"n_rows":51,"n_cols":13,"rows_kept":51,"cut":false,"hidden":false,"merged":[]}
[]
[]
[]
[null,null,null,null,null,"Waltham Forest Childhood Immunisations Dashboard"]
[]
[null,null,null,null,null,"Report designed following the parameters of the Public Health England COVER programme"]
[]
[null,null,null,null,null,"Contains data on immunisation uptake for children becoming 12m, 24m and 5yrs in the quarter"]
[]
[null,null,null,null,null,"Patients becoming 12m"]
{"$rows_left_out":42}
{"sheet":"Network Summary","index":1,"n_rows":36,"n_cols":37,"rows_kept":36,"cut":false,"hidden":false,"merged":[[4,7,4,10],[10,31,10,33],[10,35,10,37],[10,4,10,5],[10,7,10,9],[10,11,10,13],[10,15,10,17],[10,19,10,21],[10,23,10,25],[10,27,10,29]]}
[]
[null,null,null,null,null,null,null,null,null,null,null,null,"March 2022"]
[null,null,null,null,"Waltham Forest Childhood Immunisations Dashboard: Metric Details"]
[null,null,null,null,"Network Summary"]
[]
[]
[null,null,null,null,"Coverage","Percentage of target population immunised",null,null,null,null,null,null,null,null,null,null,null,"NHSE Targets"]
[null,null,null,null,"Activty","Number of patients immunised",null,null,null,null,null,null,null,null,null,null,0.96,"90% and over"]
[null,null,null,null,"Required","Number of patients requiring immunisation for network to attain 95% coverage",null,null,null,null,null,null,null,null,null,null,0.1,"Less than 90%"]
[null,null,null,null,null,null,null,null,"WF-1",null,null,null,"WF-2",null,null,null,"WF-3",null,null,null,"WF-4",null,null,null,"WF-5",null,null,null,"WF-6",null,null,null,"WF-7",null,null,null,"NW8"]
{"$rows_left_out":27}
{"sheet":"Patients becoming 12m","index":2,"n_rows":57,"n_cols":16,"rows_kept":57,"cut":false,"hidden":false,"merged":[[15,0,16,2],[15,4,16,4]]}
[]
[null,null,null,"Waltham Forest Childhood Immunisations Dashboard: Metric Details"]
[null,{"$f":"VLOOKUP(C5,'Control Panel'!Y49:Z60,2,FALSE)","v":{"$error":"#N/A"}},null,"Patients becoming 12m",null,{"$f":"E15","v":944}]
[null,"2020-02-01"]
[null,null,"March 2022","All Patients","(01) 12 MONTH COHORT","(01.01) DTaP/IPV/Hib 6in1","DTaP/IPV/Hib(%)","Patients required to achieve NHSE Target (90%)","(01.02) Men B (1st and 2nd)","Men B(%)","Patients required to achieve NHSE Target (90%)","(01.03) PCV","PCV(%)","Patients required to achieve NHSE Target (90%)","(01.04) Rotavirus","Rotavirus(%)"]
[null,"Home",null,"Listsize ","Patients becoming 12m","DTaP/IPV/Hib/HepB","DTaP/IPV/Hib/HepB(%)","Patients required to achieve CCG Target (95%)","Men B","Men B(%)","Patients required to achieve CCG Target (95%)","PCV","PCV(%)","Patients required to achieve CCG Target (95%)","Rotavirus","Rotavirus(%)"]
["Cluster"]
["WF-1","Chingford/ Walthamstow",null,{"$f":"SUM(IF($A8=$A$19:$A$57,D$19:D$57))","v":51956},{"$f":"SUM(IF($A8=$A$19:$A$57,E$19:E$57))","v":170},{"$f":"SUM(IF($A8=$A$19:$A$57,F$19:F$57))","v":150},{"$f":"IF(OR(ISTEXT($E8),$E8=0),\"N/A\",F8/$E8)","v":0.88235294117647056},null,{"$f":"SUM(IF($A8=$A$19:$A$57,I$19:I$57))","v":150},{"$f":"IF(OR(ISTEXT($E8),$E8=0),\"N/A\",I8/$E8)","v":0.88235294117647056},null,{"$f":"SUM(IF($A8=$A$19:$A$57,L$19:L$57))","v":154},{"$f":"IF(OR(ISTEXT($E8),$E8=0),\"N/A\",L8/$E8)","v":0.90588235294117647},null,{"$f":"SUM(IF($A8=$A$19:$A$57,O$19:O$57))","v":134},{"$f":"IF(OR(ISTEXT($E8),$E8=0),\"N/A\",O8/$E8)","v":0.78823529411764703}]
["WF-2","Chingford E4",null,{"$f":"SUM(IF($A9=$A$19:$A$57,D$19:D$57))","v":53291},{"$f":"SUM(IF($A9=$A$19:$A$57,E$19:E$57))","v":149},{"$f":"SUM(IF($A9=$A$19:$A$57,F$19:F$57))","v":144},0.96644295302013428,null,{"$f":"SUM(IF($A9=$A$19:$A$57,I$19:I$57))","v":144},{"$f":"IF(OR(ISTEXT($E9),$E9=0),\"N/A\",I9/$E9)","v":0.96644295302013428},null,{"$f":"SUM(IF($A9=$A$19:$A$57,L$19:L$57))","v":144},{"$f":"IF(OR(ISTEXT($E9),$E9=0),\"N/A\",L9/$E9)","v":0.96644295302013428},null,{"$f":"SUM(IF($A9=$A$19:$A$57,O$19:O$57))","v":135},{"$f":"IF(OR(ISTEXT($E9),$E9=0),\"N/A\",O9/$E9)","v":0.90604026845637586}]
["WF-3","Leyton Collaborative",null,{"$f":"SUM(IF($A10=$A$19:$A$57,D$19:D$57))","v":35895},{"$f":"SUM(IF($A10=$A$19:$A$57,E$19:E$57))","v":88},{"$f":"SUM(IF($A10=$A$19:$A$57,F$19:F$57))","v":78},0.88636363636363635,null,{"$f":"SUM(IF($A10=$A$19:$A$57,I$19:I$57))","v":75},0.85227272727272729,null,{"$f":"SUM(IF($A10=$A$19:$A$57,L$19:L$57))","v":78},0.88636363636363635,null,{"$f":"SUM(IF($A10=$A$19:$A$57,O$19:O$57))","v":67},0.76136363636363635]
{"$rows_left_out":48}
{"sheet":"Patients becoming 24m","index":3,"n_rows":57,"n_cols":18,"rows_kept":57,"cut":false,"hidden":false,"merged":[[15,0,16,2]]}
[]
[null,null,null,"Waltham Forest Childhood Immunisations Dashboard: Metric Details"]
[null,{"$f":"VLOOKUP(C5,'Control Panel'!Y49:Z60,2,FALSE)","v":{"$error":"#N/A"}},null,"Patients becoming 24m",null,{"$f":"E15","v":981}]
[null,"2020-02-01"]
[null,null,"March 2022","All Patients","(02) 24 MONTH COHORT","(02.01) DTaP/IPV/Hib or DTaP/IPV/Hib/HepB","DTaP/IPV/Hib(%)","(02.02) MMR","MMR(%)","Patients required to achieve NHSE Target (90%)","(02.03) HiB/Men C","HiB/Men C (%)","Patients required to achieve NHSE Target (90%)","(02.04) PCV (Booster)","PCV (Booster)(%)","Patients required to achieve NHSE Target (90%)","(02.05) Men B (Booster)","Men B (Booster)(%)"]
[null,"Home",null,"Listsize ","Patients becoming 24m","DTaP/IPV/Hib/HepB","DTaP/IPV/Hib/HepB(%)","MMR","MMR(%)","Patients required to achieve CCG Target (95%)","HiB/Men C","HiB/Men C (%)","Patients required to achieve CCG Target (95%)","PCV (Booster)","PCV (Booster)(%)","Patients required to achieve CCG Target (95%)","Men B (Booster)","Men B (Booster)(%)"]
["Cluster"]
["WF-1","Chingford/ Walthamstow",null,{"$f":"SUM(IF($A8=$A$19:$A$57,D$19:D$57))","v":51956},{"$f":"SUM(IF($A8=$A$19:$A$57,E$19:E$57))","v":200},{"$f":"SUM(IF($A8=$A$19:$A$57,F$19:F$57))","v":178},{"$f":"IF(OR(ISTEXT($E8),$E8=0),\"N/A\",F8/$E8)","v":0.89},{"$f":"SUM(IF($A8=$A$19:$A$57,H$19:H$57))","v":152},{"$f":"IF(OR(ISTEXT($E8),$E8=0),\"N/A\",H8/$E8)","v":0.76},null,{"$f":"SUM(IF($A8=$A$19:$A$57,K$19:K$57))","v":177},{"$f":"IF(OR(ISTEXT($E8),$E8=0),\"N/A\",K8/$E8)","v":0.88500000000000001},null,{"$f":"SUM(IF($A8=$A$19:$A$57,N$19:N$57))","v":178},{"$f":"IF(OR(ISTEXT($E8),$E8=0),\"N/A\",N8/$E8)","v":0.89},null,{"$f":"SUM(IF($A8=$A$19:$A$57,Q$19:Q$57))","v":178},{"$f":"IF(OR(ISTEXT($E8),$E8=0),\"N/A\",Q8/$E8)","v":0.89}]
["WF-2","Chingford E4",null,{"$f":"SUM(IF($A9=$A$19:$A$57,D$19:D$57))","v":53291},{"$f":"SUM(IF($A9=$A$19:$A$57,E$19:E$57))","v":152},{"$f":"SUM(IF($A9=$A$19:$A$57,F$19:F$57))","v":141},{"$f":"IF(OR(ISTEXT($E9),$E9=0),\"N/A\",F9/$E9)","v":0.92763157894736847},{"$f":"SUM(IF($A9=$A$19:$A$57,H$19:H$57))","v":109},{"$f":"IF(OR(ISTEXT($E9),$E9=0),\"N/A\",H9/$E9)","v":0.71710526315789469},null,{"$f":"SUM(IF($A9=$A$19:$A$57,K$19:K$57))","v":136},{"$f":"IF(OR(ISTEXT($E9),$E9=0),\"N/A\",K9/$E9)","v":0.89473684210526316},null,{"$f":"SUM(IF($A9=$A$19:$A$57,N$19:N$57))","v":135},{"$f":"IF(OR(ISTEXT($E9),$E9=0),\"N/A\",N9/$E9)","v":0.88815789473684215},null,{"$f":"SUM(IF($A9=$A$19:$A$57,Q$19:Q$57))","v":135},{"$f":"IF(OR(ISTEXT($E9),$E9=0),\"N/A\",Q9/$E9)","v":0.88815789473684215}]
["WF-3","Leyton Collaborative",null,{"$f":"SUM(IF($A10=$A$19:$A$57,D$19:D$57))","v":35895},{"$f":"SUM(IF($A10=$A$19:$A$57,E$19:E$57))","v":102},{"$f":"SUM(IF($A10=$A$19:$A$57,F$19:F$57))","v":88},0.86274509803921573,{"$f":"SUM(IF($A10=$A$19:$A$57,H$19:H$57))","v":60},0.58823529411764708,null,{"$f":"SUM(IF($A10=$A$19:$A$57,K$19:K$57))","v":75},0.73529411764705888,null,{"$f":"SUM(IF($A10=$A$19:$A$57,N$19:N$57))","v":87},0.8529411764705882,null,{"$f":"SUM(IF($A10=$A$19:$A$57,Q$19:Q$57))","v":85},0.83333333333333337]
{"$rows_left_out":48}
{"sheet":"Patients becoming 5y","index":4,"n_rows":57,"n_cols":17,"rows_kept":57,"cut":false,"hidden":false,"merged":[[15,0,16,2],[15,4,16,4]]}
[]
[null,null,null,"Waltham Forest Childhood Immunisations Dashboard: Metric Details"]
[null,{"$f":"VLOOKUP(C5,'Control Panel'!Y49:Z60,2,FALSE)","v":{"$error":"#N/A"}},null,"Patients becoming 5y",null,{"$f":"E15","v":950}]
[null,"2020-02-01"]
[null,null,"March 2022","All Patients","(03) 5 YEAR COHORT","(03.01) DTaP/IPV/Hib or DTaP/IPV/Hib/HepB","DTaP/IPV/Hib(%)","(03.02) MMR (Primary)","MMR (Primary)(%)","(03.03) DTaP/IPV (Booster)","DTaP/IPV (Booster)(%)","Patients required to achieve NHSE Target (90%)","(03.05) MMR (Booster)","MMR (Booster)(%)","Patients required to achieve NHSE Target (90%)","(03.04) HiB/Men C","HiB/Men C(%)"]
[null,"Home",null,"Listsize ","Patients becoming 5y","DTaP/IPV/Hib","DTaP/IPV/Hib(%)","MMR (Primary)","MMR (Primary)(%)","DTaP/IPV (Booster)","DTaP/IPV (Booster)(%)","Patients required to achieve CCG Target (95%)","MMR (Booster)","MMR (Booster)(%)","Patients required to achieve CCG Target (95%)","HiB/Men C","HiB/Men C(%)"]
["Cluster"]
["WF-1","Chingford/ Walthamstow",null,{"$f":"SUM(IF($A8=$A$19:$A$57,D$19:D$57))","v":51956},{"$f":"SUM(IF($A8=$A$19:$A$57,E$19:E$57))","v":162},{"$f":"SUM(IF($A8=$A$19:$A$57,F$19:F$57))","v":134},{"$f":"IF(OR(ISTEXT($E8),$E8=0),\"N/A\",F8/$E8)","v":0.8271604938271605},{"$f":"SUM(IF($A8=$A$19:$A$57,H$19:H$57))","v":117},{"$f":"IF(OR(ISTEXT($E8),$E8=0),\"N/A\",H8/$E8)","v":0.72222222222222221},{"$f":"SUM(IF($A8=$A$19:$A$57,J$19:J$57))","v":116},{"$f":"IF(OR(ISTEXT($E8),$E8=0),\"N/A\",J8/$E8)","v":0.71604938271604934},null,{"$f":"SUM(IF($A8=$A$19:$A$57,M$19:M$57))","v":94},{"$f":"IF(OR(ISTEXT($E8),$E8=0),\"N/A\",M8/$E8)","v":0.58024691358024694},null,{"$f":"SUM(IF($A8=$A$19:$A$57,P$19:P$57))","v":134},{"$f":"IF(OR(ISTEXT($E8),$E8=0),\"N/A\",P8/$E8)","v":0.8271604938271605}]
["WF-2","Chingford E4",null,{"$f":"SUM(IF($A9=$A$19:$A$57,D$19:D$57))","v":53291},{"$f":"SUM(IF($A9=$A$19:$A$57,E$19:E$57))","v":163},{"$f":"SUM(IF($A9=$A$19:$A$57,F$19:F$57))","v":137},{"$f":"IF(OR(ISTEXT($E9),$E9=0),\"N/A\",F9/$E9)","v":0.8404907975460123},{"$f":"SUM(IF($A9=$A$19:$A$57,H$19:H$57))","v":135},{"$f":"IF(OR(ISTEXT($E9),$E9=0),\"N/A\",H9/$E9)","v":0.82822085889570551},{"$f":"SUM(IF($A9=$A$19:$A$57,J$19:J$57))","v":141},{"$f":"IF(OR(ISTEXT($E9),$E9=0),\"N/A\",J9/$E9)","v":0.86503067484662577},null,{"$f":"SUM(IF($A9=$A$19:$A$57,M$19:M$57))","v":94},{"$f":"IF(OR(ISTEXT($E9),$E9=0),\"N/A\",M9/$E9)","v":0.57668711656441718},null,{"$f":"SUM(IF($A9=$A$19:$A$57,P$19:P$57))","v":139},{"$f":"IF(OR(ISTEXT($E9),$E9=0),\"N/A\",P9/$E9)","v":0.85276073619631898}]
["WF-3","Leyton Collaborative",null,{"$f":"SUM(IF($A10=$A$19:$A$57,D$19:D$57))","v":35895},{"$f":"SUM(IF($A10=$A$19:$A$57,E$19:E$57))","v":94},{"$f":"SUM(IF($A10=$A$19:$A$57,F$19:F$57))","v":67},0.71276595744680848,{"$f":"SUM(IF($A10=$A$19:$A$57,H$19:H$57))","v":67},0.71276595744680848,{"$f":"SUM(IF($A10=$A$19:$A$57,J$19:J$57))","v":64},0.68085106382978722,null,{"$f":"SUM(IF($A10=$A$19:$A$57,M$19:M$57))","v":33},0.35106382978723405,null,{"$f":"SUM(IF($A10=$A$19:$A$57,P$19:P$57))","v":67},0.71276595744680848]
{"$rows_left_out":48}
{"sheet":"Trending","index":5,"n_rows":80,"n_cols":13,"rows_kept":80,"cut":false,"hidden":false,"merged":[[1,3,1,4]]}
[null,null,null,"Waltham Forest - Childhood Immunisations",null,null,null,null,null,null,null,null,{"$f":"\"'\"&K3&\"'!$C$9:$AT$71\"","v":"'1st April 2016'!$C$9:$AT$71"}]
[null,null,null,null,null,null,"Waltham Forest"]
[null,"2015/16 Q1",null,{"$f":"VLOOKUP(G2,'Control Panel'!I77:J119,2,FALSE)","v":"Total"},{"$f":"IF(D3=\"Total\",TRUE,IF(LEFT($D$3,1)=\"P\",TRUE,FALSE))","v":true},{"$f":"IF(D3=\"Total\",\"WF\",D3)","v":"WF"},"FHV",null,null,null,"1st April 2016"]
[null,null,null,null,null,null,"Patient becoming 12m","Control Panel'!J34:J36"]
[]
[null,{"$f":"INDEX(INDIRECT(VLOOKUP($G$4,'Control Panel'!$J$41:$K$43,2,FALSE)),COLUMN(Rows!A1))","v":"(01) 12 MONTH COHORT"},{"$f":"INDEX(INDIRECT(VLOOKUP($G$4,'Control Panel'!$J$41:$K$43,2,FALSE)),COLUMN(Rows!B1))","v":"(01.01) DTaP/IPV/Hib 6in1"},{"$f":"INDEX(INDIRECT(VLOOKUP($G$4,'Control Panel'!$J$41:$K$43,2,FALSE)),COLUMN(Rows!C1))","v":"(01.02) Men B (1st and 2nd)"},{"$f":"INDEX(INDIRECT(VLOOKUP($G$4,'Control Panel'!$J$41:$K$43,2,FALSE)),COLUMN(Rows!D1))","v":"(01.03) PCV"}]
["Time Stamp",{"$f":"IFERROR(INDEX(INDIRECT(VLOOKUP($G$4,'Control Panel'!$J$36:$L$38,3,FALSE)),COLUMN(Rows!B17)),\"\")","v":"DTaP/IPV/Hib %"},{"$f":"IFERROR(INDEX(INDIRECT(VLOOKUP($G$4,'Control Panel'!$J$36:$L$38,3,FALSE)),COLUMN(Rows!C17)),\"\")","v":"Men C / Men B %"},{"$f":"IFERROR(INDEX(INDIRECT(VLOOKUP($G$4,'Control Panel'!$J$36:$L$38,3,FALSE)),COLUMN(Rows!D17)),\"\")","v":"PCV %"}]
["March 2019 (Baseline)",{"$f":"IFERROR(C42/B42,\"\")","v":0.97767332549941255},{"$f":"IFERROR(D42/B42,\"\")","v":1.0011750881316099},{"$f":"IFERROR(E42/B42,NA())","v":815.91069330199764}]
["April 2019",{"$f":"IFERROR(C45/B45,\"\")","v":0.84968017057569301},{"$f":"IFERROR(D45/B45,\"\")","v":0.84221748400852881},{"$f":"IFERROR(E45/B45,NA())","v":0.85927505330490406}]
["May 2019",0.85378868729989332,0.84738527214514403,0.86552828175026686]
{"$rows_left_out":71}
{"sheet":"Rows","index":6,"n_rows":0,"n_cols":0,"rows_kept":0,"cut":false,"hidden":true,"merged":[]}

{"sheet":"Lookup","index":7,"n_rows":40,"n_cols":24,"rows_kept":40,"cut":false,"hidden":true,"merged":[]}
["listsize.csv","All Patients"]
["(01)_12_MONTH_COHORT.csv","(01) 12 MONTH COHORT"]
["(01.01)_DTaP_IPV_Hib_HepB.csv","(01.01) DTaP/IPV/Hib 6in1"]
["(01.02)_Men_B_(1st_and_2nd).csv","(01.02) Men B (1st and 2nd)"]
["(01.03)_PCV.csv","(01.03) PCV"]
["(01.04)_Rotavirus.csv","(01.04) Rotavirus"]
["(01.05)_BCG.csv","(01.05) BCG"]
["(02)_24_MONTH_COHORT.csv","(02) 24 MONTH COHORT"]
["(02.01)_DTaP_IPV_Hib_or_DTaP_IPV_Hib_HepB.csv","(02.01) DTaP/IPV/Hib Combined"]
["(02.02)_MMR.csv","(02.02) MMR"]
{"$rows_left_out":31}
{"sheet":"Data","index":8,"n_rows":1435,"n_cols":30,"rows_kept":1435,"cut":false,"hidden":true,"merged":[]}
["2019-04-01",{"$f":"VLOOKUP(J1,'Control Panel'!$G$132:$K$171,5,FALSE)","v":{"$error":"#N/A"}},"Childhood Immunisations Q1",null,"Last Run:",null,"Population Count",283256,null,null,"Search","All Patients","(01) 12 MONTH COHORT","(01.01) DTaP/IPV/Hib 6in1","(01.02) Men B (1st and 2nd)","(01.03) PCV","(01.04) Rotavirus","(01.05) BCG","(02) 24 MONTH COHORT","(02.01) DTaP/IPV/Hib or DTaP/IPV/Hib/HepB","(02.02) MMR","(02.03) HiB/Men C","(02.04) PCV (Booster)","(02.05) Men B (Booster)","(03) 5 YEAR COHORT","(03.01) DTaP/IPV/Hib or DTaP/IPV/Hib/HepB","(03.02) MMR (Primary)","(03.03) DTaP/IPV (Booster)","(03.04) HiB/Men C","(03.05) MMR (Booster)"]
["2019-04-01",{"$f":"VLOOKUP(J2,'Control Panel'!$G$132:$K$171,5,FALSE)","v":{"$error":"#N/A"}},null,null,"2019-05-14T11:19:00",null,"Males",144492,null,"Organisation Code"]
["2019-04-01",{"$f":"VLOOKUP(J3,'Control Panel'!$G$132:$K$171,5,FALSE)","v":"WF-6"},"WF",null,"Relative Date:",null,"Females",138764,null,"F86001",null,7940,21,21,21,21,19,3,30,25,20,20,20,20,22,17,15,10,16,12]
["2019-04-01",{"$f":"VLOOKUP(J4,'Control Panel'!$G$132:$K$171,5,FALSE)","v":"WF-1"},"WF",null,"2019-05-01",null,null,null,null,"F86005",null,8200,54,45,45,46,47,3,31,31,30,29,29,30,28,27,26,19,26,20]
["2019-04-01",{"$f":"VLOOKUP(J5,'Control Panel'!$G$132:$K$171,5,FALSE)","v":"WF-7"},"WF",null,null,null,null,null,null,"F86006",null,6199,23,17,17,17,18,3,26,24,22,22,23,22,19,17,16,11,15,11]
["2019-04-01",{"$f":"VLOOKUP(J6,'Control Panel'!$G$132:$K$171,5,FALSE)","v":"WF-3"},"WF",null,null,null,null,null,null,"F86011",null,9264,29,22,23,23,20,2,28,23,21,20,21,20,17,14,15,14,14,14]
["2019-04-01",{"$f":"VLOOKUP(J7,'Control Panel'!$G$132:$K$171,5,FALSE)","v":"WF-7"},"WF",null,null,null,null,null,null,"F86030",null,8091,39,34,34,35,33,13,41,40,40,40,40,40,22,20,21,18,21,20]
["2019-04-01",{"$f":"VLOOKUP(J8,'Control Panel'!$G$132:$K$171,5,FALSE)","v":"WF-4"},"WF",null,null,null,null,null,null,"F86036",null,15793,44,41,41,41,40,20,50,48,45,45,45,45,43,39,40,38,39,37]
["2019-04-01",{"$f":"VLOOKUP(J9,'Control Panel'!$G$132:$K$171,5,FALSE)","v":"WF-3"},"WF",null,null,null,null,null,null,"F86038",null,10989,47,37,37,38,37,3,43,38,34,35,35,34,38,32,32,24,30,25]
["2019-04-01",{"$f":"VLOOKUP(J10,'Control Panel'!$G$132:$K$171,5,FALSE)","v":"WF-4"},"WF",null,null,null,null,null,null,"F86044",null,8955,35,27,27,27,26,7,35,27,25,26,26,25,22,16,17,13,16,14]
{"$rows_left_out":1426}
{"sheet":"01072021","index":9,"n_rows":72,"n_cols":20,"rows_kept":72,"cut":false,"hidden":true,"merged":[]}
["Registered practice ID","(01)_12_MONTH_COHORT_(WF_Dashboards_CEG___COVER_Audit_Child_Imms).csv","(01.01)_DTaP_IPV_Hib_HepB_(WF_Dashboards_CEG___COVER_Audit_Child_Imms).csv","(01.02)_Men_B_(1st_and_2nd)_(WF_Dashboards_CEG___COVER_Audit_Child_Imms).csv","(01.03)_PCV_(WF_Dashboards_CEG___COVER_Audit_Child_Imms).csv","(01.04)_Rotavirus_(WF_Dashboards_CEG___COVER_Audit_Child_Imms).csv","(01.05)_BCG_(WF_Dashboards_CEG___COVER_Audit_Child_Imms).csv","(02)_24_MONTH_COHORT_(WF_Dashboards_CEG___COVER_Audit_Child_Imms).csv","(02.01)_DTaP_IPV_Hib_or_DTaP_IPV_Hib_HepB_(WF_Dashboards_CEG___COVER_Audit_Child_Imms).csv","(02.02)_MMR_(WF_Dashboards_CEG___COVER_Audit_Child_Imms).csv","(02.03)_HiB_Men_C_(WF_Dashboards_CEG___COVER_Audit_Child_Imms).csv","(02.04)_PCV_(Booster)_(WF_Dashboards_CEG___COVER_Audit_Child_Imms).csv","(02.05)_Men_B_(Booster)_(WF_Dashboards_CEG___COVER_Audit_Child_Imms).csv","(03)_5_YEAR_COHORT_(WF_Dashboards_CEG___COVER_Audit_Child_Imms).csv","(03.01)_DTaP_IPV_Hib_or_DTaP_IPV_Hib_HepB_(WF_Dashboards_CEG___COVER_Audit_Child_Imms).csv","(03.02)_MMR_(Primary)_(WF_Dashboards_CEG___COVER_Audit_Child_Imms).csv","(03.03)_DTaP_IPV_(Booster)_(WF_Dashboards_CEG___COVER_Audit_Child_Imms).csv","(03.04)_HiB_Men_C_(WF_Dashboards_CEG___COVER_Audit_Child_Imms).csv","(03.05)_MMR_(Booster)_(WF_Dashboards_CEG___COVER_Audit_Child_Imms).csv","listsize_(WF_Dashboards_CEG___COVER_Audit_Child_Imms).csv"]
["A83635",null,null,null,null,null,null,null,null,null,null,null,null,null,null,null,null,null,null,1]
["B82012",null,null,null,null,null,null,null,null,null,null,null,null,null,null,null,null,null,null,2]
["E82068",null,null,null,null,null,null,null,null,null,null,null,null,null,null,null,null,null,null,1]
["E82638",null,null,null,null,null,null,null,null,null,null,null,null,null,null,null,null,null,null,1]
["E83017",null,null,null,null,null,null,null,null,null,null,null,null,null,null,null,null,null,null,1]
["E84066",null,null,null,null,null,null,null,null,null,null,null,null,null,null,null,null,null,null,1]
["E85030",null,null,null,null,null,null,null,null,null,null,null,null,null,null,null,null,null,null,1]
["E85107",null,null,null,null,null,null,null,null,null,null,null,null,null,null,null,null,null,null,1]
["E85657",null,null,null,null,null,null,null,null,null,null,null,null,null,null,null,null,null,null,1]
{"$rows_left_out":63}
{"sheet":"Control Panel","index":10,"n_rows":171,"n_cols":26,"rows_kept":171,"cut":false,"hidden":true,"merged":[]}
[null,"Q4",null,null,"Search Title","Report Title",null,null,"2019-03-01"]
[null,null,null,null,"All Patients","Listsize ",null,null,"April 2021","Q1","Q1: April 2017 - June 2017",null,"Select Dates",null,null,null,null,null,null,null,"total",2,{"$f":"$V$7&ADDRESS(1,V2)&\":\"&ADDRESS($V$8,V2)","v":"'Data'!$B$1:$B$2000"}]
[null,null,null,null,"(01) 12 MONTH COHORT","Patients becoming 12m",null,null,"May 2021","Q1","Q1: April 2017 - June 2017",null,"2017-04-01",null," -","Select Practice","DN Team","Patch","Network",null,"OrgID",10,{"$f":"$V$7&ADDRESS(1,V3)&\":\"&ADDRESS($V$8,V3)","v":"'Data'!$J$1:$J$2000"}]
[null,null,null,null,"(01.01) DTaP/IPV/Hib 6in1","DTaP/IPV/Hib/HepB",null,null,"June 2021","Q1","Q1: April 2017 - June 2017",null,"2017-05-01","Bethnal Green Health Centre","F84083","Bethnal Green Health Centre",null,null,"NW1",null,"REL_D",1,{"$f":"$V$7&ADDRESS(1,V4)&\":\"&ADDRESS($V$8,V4)","v":"'Data'!$A$1:$A$2000"}]
[null,null,null,null,"DTaP/IPV/Hib(%)","DTaP/IPV/Hib/HepB(%)",null,null,"July 2021","Q2","Q2: July 2017 - September 2017",null,"2017-06-01","The Mission Practice","F84016","The Mission Practice",null,null,"NW1",null,"IND"," -",{"$f":"$V$7&ADDRESS(V12,1)&\":\"&ADDRESS(V12,V9)","v":"'Data'!$A$1:$AD$1"}]
[null,null,null,null,"Patients required to achieve NHSE Target (90%)","Patients required to achieve NHSE Target (90%)",null,null,"August 2021","Q2","Q2: July 2017 - September 2017",null,"2017-07-01","Globe Town Surgery","F84123","Globe Town Surgery",null,null,"NW1",null,"NwID",3,{"$f":"$V$7&ADDRESS(1,V6)&\":\"&ADDRESS($V$8,V6)","v":"'Data'!$C$1:$C$2000"}]
[null,null,null,null,"Patients required to achieve CCG Target (95%)","Patients required to achieve CCG Target (95%)",null,null,"September 2021","Q2","Q2: July 2017 - September 2017",null,"2017-08-01","Pollard Row Surgery","Y00212","Pollard Row Surgery",null,null,"NW1",null,"Data",{"$f":"IF(V10=\"N\",\"BLANK!\",\"'\"&V11&\"'!\")","v":"'Data'!"}]
[null,null,null,null,"(01.02) Men B (1st and 2nd)","Men B",null,null,"October 2021","Q3","Q3: October 2017 - December 2017",null,"2017-09-01","Strouts Place Medical Centre","F84051","Strouts Place Medical Centre",null,null,"NW1",null,"Rows",2000]
[null,"Waltham Forest","Total",null,"Men B(%)","Men B(%)",null,null,"November 2021","Q3","Q3: October 2017 - December 2017",null,"2017-10-01","Spitalfields Practice","F84081","Spitalfields Practice",null,null,"NW2",null,"Columns",30]
["LC1","Chingford Locality","LC1",null,"Patients required to achieve NHSE Target (90%)","Patients required to achieve NHSE Target (90%)",null,null,"December 2021","Q3","Q3: October 2017 - December 2017",null,"2017-11-01","Blithehale Medical Centre","F84718","Blithehale Medical Centre",null,null,"NW2",null,"Data (Y/N)","Y"]
{"$rows_left_out":162}
{"sheet":"Sheet2","index":11,"n_rows":274,"n_cols":15,"rows_kept":274,"cut":false,"hidden":true,"merged":[]}
["Practice ID","Practice","Locality ID","Locality","SubLocality ID","SubLocality","Clinical System","Address 1","Address 2","Postcode","Grid Reference","X (easting)","Y (northing)","Latitude","Longitude"]
["F82001","Halbutt Street Surgery","BK","Barking and Dagenham","BK-1","East","EMISweb","2 Halbutt Street","Dagenham","RM9 5AS","TQ 48956 85305",548956,185305,51.546982999999997,0.14681208000000001]
["F82005","Church Elm Lane Medical Practice","BK","Barking and Dagenham","BK-1","East","EMISweb","Church Elm Lane","Dagenham","RM10 9RR","TQ 49667 84556",549667,184556,51.540066000000003,0.15673988]
["Y01719","Broad Street Medical Centre","BK","Barking and Dagenham","BK-1","East","EMISweb","Broad Street Resource Centre","Dagenham","RM10 9HU","TQ 49367 83962",549367,183962,51.534807999999998,0.15216547999999999]
["Y02575","Porters Avenue Doctors Surgery","BK","Barking and Dagenham","BK-1","East","EMISweb","234 Porters Avenue","Dagenham","RM8 2EQ","TQ 47283 85077",547283,185077,51.545372999999998,0.12260706]
["F82003","First Avenue Surgery","BK","Barking and Dagenham","BK-2","East One","EMISweb","2 First Avenue","Dagenham","RM10 9AT","TQ 49762 83388",549762,183388,51.529546000000003,0.15761231000000001]
["F82015","Hedgemans Surgery","BK","Barking and Dagenham","BK-2","East One","EMISweb","92 Hedgemans Road","Dagenham","RM9 6HT","TQ 48734 84495",548734,184495,51.539763999999998,0.14327081999999999]
["F82017","St Albans Surgery ","BK","Barking and Dagenham","BK-2","East One","EMISweb","Urswick Road","Dagenham","RM9 6EA","TQ 48052 84181",548052,184181,51.537121999999997,0.13331214999999999]
["F82621","The Surgery (Dr Ola)","BK","Barking and Dagenham","BK-2","East One","EMISweb","36 Dewey Road","Dagenham","RM10 8AR","TQ 50141 84824",550141,184824,51.542347999999997,0.16368373999999999]
["F82634","Heathway Medical Centre","BK","Barking and Dagenham","BK-2","East One","EMISweb","Morland Road ","Dagenham","RM10 9HU","TQ 49367 83962",549367,183962,51.534807999999998,0.15216547999999999]
{"$rows_left_out":264}