{"text_format":"1","workbook":"xlsx","n_sheets":12,"sheets":["Cover Sheet","Network Summary","Patients becoming 12m","Patients becoming 24m","Patients becoming 5y","Trending","Rows","Lookup","Data","01072021","Control Panel","Sheet2"],"not_rendered":{"charts":1,"images":7,"macros":1,"external_links":1,"defined_names":9,"comments":0,"pivot_tables":0},"unopened":[],"bounds":{"document_bytes":16777216,"sheet_cells":100000,"rows_first":2000,"rows_last":500,"rows_between":2000,"halvings":0,"cell_chars":16384,"cell_head_chars":4096},"cells_cut":0,"cells_raw":0,"read":"whole","date_system":"1900"}

{"sheet":"Cover Sheet","index":0,"n_rows":51,"n_cols":13,"rows_kept":51,"cut":false,"hidden":false,"merged":[]}
[]
[]
[]
[null,null,null,null,null,"Waltham Forest Childhood Immunisations Dashboard"]
[]
[null,null,null,null,null,"Report designed following the parameters of the Public Health England COVER programme"]
[]
[null,null,null,null,null,"Contains data on immunisation uptake for children becoming 12m, 24m and 5yrs in the quarter"]
[]
[null,null,null,null,null,"Patients becoming 12m"]
[]
[null,null,null,null,null,"DTaP/IPV/Hib/HepB"]
[null,null,null,null,null,"Men B"]
[null,null,null,null,null,"PCV"]
[null,null,null,null,null,"Rotavirus"]
[]
[]
[null,null,null,null,null,"Patients becoming 24m"]
[]
[null,null,null,null,null,"DTaP/IPV/Hib/HepB"]
[null,null,null,null,null,"MMR"]
[null,null,null,null,null,"HiB/Men C"]
[null,null,null,null,null,"PCV (Booster)"]
[null,null,null,null,null,"Men B (Booster)"]
[null,null,null,null,null,"Patients becoming 5y"]
[]
[null,null,null,null,null,"DTaP/IPV/Hib"]
[null,null,null,null,null,"MMR (Primary)"]
[null,null,null,null,null,"DTaP/IPV (Booster)"]
[null,null,null,null,null,"MMR (Booster)"]
[null,null,null,null,null,"HiB/Men C"]
[]
[null,null,null,null,null,"N.B. Rotavirus not included in performance target"]
[null,null,null,null,null,"Version tracking"]
[null,null,null,null,null,"Version 2.8","- PCV Schedule updated",null,null,null,null,null,"December 2020"]
[]
[null,null,null,null,null,"Version 2.7","- Removed the 5in1 from Patients becoming 12m, now only 6in1",null,null,null,null,null,"April 2019"]
[]
[null,null,null,null,null,"Version 2.6","- Men B (Booster) included and 5in1 to have to become 6in1 for patients born after 01/08/2017",null,null,null,null,null,"April 2018"]
[]
[null,null,null,null,null,"Version 2.5","- Men C removed Men B included",null,null,null,null,null,"May 2017"]
[]
[null,null,null,null,null,"Version 2.4","- DTaP/IPV (Booster) (NO LOWER AGE LIMIT) Removed",null,null,null,null,null,"May 2016"]
[]
[null,null,null,null,null,"Version 2.3","- Lower age limit for MMR, HiB/Men C and PCV adjusted to 1 year in line with NHSE guidance",null,null,null,null,null,"May 2015"]
[]
[null,null,null,null,null,"Version 2.2","- Cluster configuration and practice names updated",null,null,null,null,null,"April 2015"]
[]
[null,null,null,null,null,"Version 2.1","- DTaP/IPV/Hib (No lower age limit) added to 5yr cohort",null,null,null,null,null,"October 2014"]
[]
[null,null,null,null,null,"Version 2.0","- Specification and presentation used from CEG report for Tower Hamlets",null,null,null,null,null,"September 2014"]

{"sheet":"Network Summary","index":1,"n_rows":36,"n_cols":37,"rows_kept":36,"cut":false,"hidden":false,"merged":[[4,7,4,10],[10,31,10,33],[10,35,10,37],[10,4,10,5],[10,7,10,9],[10,11,10,13],[10,15,10,17],[10,19,10,21],[10,23,10,25],[10,27,10,29]]}
[]
[null,null,null,null,null,null,null,null,null,null,null,null,"March 2022"]
[null,null,null,null,"Waltham Forest Childhood Immunisations Dashboard: Metric Details"]
[null,null,null,null,"Network Summary"]
[]
[]
[null,null,null,null,"Coverage","Percentage of target population immunised",null,null,null,null,null,null,null,null,null,null,null,"NHSE Targets"]
[null,null,null,null,"Activty","Number of patients immunised",null,null,null,null,null,null,null,null,null,null,0.96,"90% and over"]
[null,null,null,null,"Required","Number of patients requiring immunisation for network to attain 95% coverage",null,null,null,null,null,null,null,null,null,null,0.1,"Less than 90%"]
[null,null,null,null,null,null,null,null,"WF-1",null,null,null,"WF-2",null,null,null,"WF-3",null,null,null,"WF-4",null,null,null,"WF-5",null,null,null,"WF-6",null,null,null,"WF-7",null,null,null,"NW8"]
[null,null,null,null,"Waltham Forest Total",null,null,{"$f":"'Control Panel'!I78","v":"Chingford/ Walthamstow"},null,null,null,{"$f":"'Control Panel'!I79","v":"Chingford E4"},null,null,null,{"$f":"'Control Panel'!I80","v":"Leyton Collaborative"},null,null,null,{"$f":"'Control Panel'!I81","v":"Forest Integrated Health"},null,null,null,{"$f":"'Control Panel'!I82","v":"South Leytonstone"},null,null,null,{"$f":"'Control Panel'!I83","v":"Central Walthamstow"},null,null,null,{"$f":"'Control Panel'!I84","v":"Walthamstow West"}]
[]
[]
[null,"(01) 12 MONTH COHORT",{"$f":"\"Patients becoming 12m within \"&'Control Panel'!$B$1","v":"Patients becoming 12m within Q4"},null,null,{"$f":"I14+M14+Q14+U14+Y14+AC14+AG14","v":944},null,null,{"$f":"SUMIFS(OFFSET(REL_D,,MATCH(B14,IND,0)-1),REL_D,$M$2,total,$I$10)","v":170},null,null,null,{"$f":"SUMIFS(OFFSET(REL_D,,MATCH(B14,IND,0)-1),REL_D,$M$2,total,$M$10)","v":149},null,null,null,{"$f":"SUMIFS(OFFSET(REL_D,,MATCH($B14,IND,0)-1),REL_D,$M$2,total,$Q$10)","v":88},null,null,null,{"$f":"SUMIFS(OFFSET(REL_D,,MATCH($B14,IND,0)-1),REL_D,$M$2,total,$U$10)","v":175},null,null,null,{"$f":"SUMIFS(OFFSET(REL_D,,MATCH($B14,IND,0)-1),REL_D,$M$2,total,$Y$10)","v":87},null,null,null,{"$f":"SUMIFS(OFFSET(REL_D,,MATCH($B14,IND,0)-1),REL_D,$M$2,total,$AC$10)","v":119},null,null,null,{"$f":"SUMIFS(OFFSET(REL_D,,MATCH($B14,IND,0)-1),REL_D,$M$2,total,$AG$10)","v":156}]
[null,null,null,null,"Coverage","Activty",null,"Coverage","Activty","Required",null,"Coverage","Activty","Required",null,"Coverage","Activty","Required",null,"Coverage","Activty","Required",null,"Coverage","Activty","Required",null,"Coverage","Activty","Required",null,"Coverage","Activty","Required"]
[null,{"$f":"'Control Panel'!E4","v":"(01.01) DTaP/IPV/Hib 6in1"},"DTaP/IPV/Hib/HepB",null,{"$f":"IFERROR(F16/F$14,\"-\")","v":0.89406779661016944},{"$f":"I16+M16+Q16+U16+Y16+AC16+AG16","v":844},null,{"$f":"IFERROR(I16/I$14,\"-\")","v":0.88235294117647056},{"$f":"SUMIFS(OFFSET(REL_D,,MATCH(B16,IND,0)-1),REL_D,$M$2,total,$I$10)","v":150},{"$f":"IF(AND(I$14*0.9-I16<1,(I$14*0.9-I16>0)),1,IF(I$14*0.9-I16<=0,\"\",I$14*0.9-I16))","v":3},null,{"$f":"IFERROR(M16/M$14,\"-\")","v":0.96644295302013428},{"$f":"SUMIFS(OFFSET(REL_D,,MATCH(B16,IND,0)-1),REL_D,$M$2,total,$M$10)","v":144},{"$f":"IF(AND(M$14*0.9-M16<1,(M$14*0.9-M16>0)),1,IF(M$14*0.9-M16<=0,\"\",M$14*0.9-M16))","v":""},null,{"$f":"IFERROR(Q16/Q$14,\"-\")","v":0.88636363636363635},{"$f":"SUMIFS(OFFSET(REL_D,,MATCH($B16,IND,0)-1),REL_D,$M$2,total,$Q$10)","v":78},{"$f":"IF(AND(Q$14*0.9-Q16<1,(Q$14*0.9-Q16>0)),1,IF(Q$14*0.9-Q16<=0,\"\",Q$14*0.9-Q16))","v":1.2000000000000028},null,{"$f":"IFERROR(U16/U$14,\"-\")","v":0.87428571428571433},{"$f":"SUMIFS(OFFSET(REL_D,,MATCH($B16,IND,0)-1),REL_D,$M$2,total,$U$10)","v":153},{"$f":"IF(AND(U$14*0.9-U16<1,(U$14*0.9-U16>0)),1,IF(U$14*0.9-U16<=0,\"\",U$14*0.9-U16))","v":4.5},null,{"$f":"IFERROR(Y16/Y$14,\"-\")","v":0.88505747126436785},{"$f":"SUMIFS(OFFSET(REL_D,,MATCH($B16,IND,0)-1),REL_D,$M$2,total,$Y$10)","v":77},{"$f":"IF(AND(Y$14*0.9-Y16<1,(Y$14*0.9-Y16>0)),1,IF(Y$14*0.9-Y16<=0,\"\",Y$14*0.9-Y16))","v":1.2999999999999972},null,{"$f":"IFERROR(AC16/AC$14,\"-\")","v":0.91596638655462181},{"$f":"SUMIFS(OFFSET(REL_D,,MATCH($B16,IND,0)-1),REL_D,$M$2,total,$AC$10)","v":109},{"$f":"IF(AND(AC$14*0.9-AC16<1,(AC$14*0.9-AC16>0)),1,IF(AC$14*0.9-AC16<=0,\"\",AC$14*0.9-AC16))","v":""},null,{"$f":"IFERROR(AG16/AG$14,\"-\")","v":0.85256410256410253},{"$f":"SUMIFS(OFFSET(REL_D,,MATCH($B16,IND,0)-1),REL_D,$M$2,total,$AG$10)","v":133},{"$f":"IF(AND(AG$14*0.9-AG16<1,(AG$14*0.9-AG16>0)),1,IF(AG$14*0.9-AG16<=0,\"\",AG$14*0.9-AG16))","v":7.4000000000000057}]
[null,"(01.02) Men B (1st and 2nd)","Men B",null,{"$f":"IFERROR(F17/F$14,\"-\")","v":0.88241525423728817},{"$f":"I17+M17+Q17+U17+Y17+AC17+AG17","v":833},null,{"$f":"IFERROR(I17/I$14,\"-\")","v":0.88235294117647056},{"$f":"SUMIFS(OFFSET(REL_D,,MATCH(B17,IND,0)-1),REL_D,$M$2,total,$I$10)","v":150},{"$f":"IF(AND(I$14*0.9-I17<1,(I$14*0.9-I17>0)),1,IF(I$14*0.9-I17<=0,\"\",I$14*0.9-I17))","v":3},null,{"$f":"IFERROR(M17/M$14,\"-\")","v":0.96644295302013428},{"$f":"SUMIFS(OFFSET(REL_D,,MATCH(B17,IND,0)-1),REL_D,$M$2,total,$M$10)","v":144},{"$f":"IF(AND(M$14*0.9-M17<1,(M$14*0.9-M17>0)),1,IF(M$14*0.9-M17<=0,\"\",M$14*0.9-M17))","v":""},null,{"$f":"IFERROR(Q17/Q$14,\"-\")","v":0.85227272727272729},{"$f":"SUMIFS(OFFSET(REL_D,,MATCH($B17,IND,0)-1),REL_D,$M$2,total,$Q$10)","v":75},{"$f":"IF(AND(Q$14*0.9-Q17<1,(Q$14*0.9-Q17>0)),1,IF(Q$14*0.9-Q17<=0,\"\",Q$14*0.9-Q17))","v":4.2000000000000028},null,{"$f":"IFERROR(U17/U$14,\"-\")","v":0.8571428571428571},{"$f":"SUMIFS(OFFSET(REL_D,,MATCH($B17,IND,0)-1),REL_D,$M$2,total,$U$10)","v":150},{"$f":"IF(AND(U$14*0.9-U17<1,(U$14*0.9-U17>0)),1,IF(U$14*0.9-U17<=0,\"\",U$14*0.9-U17))","v":7.5},null,{"$f":"IFERROR(Y17/Y$14,\"-\")","v":0.87356321839080464},{"$f":"SUMIFS(OFFSET(REL_D,,MATCH($B17,IND,0)-1),REL_D,$M$2,total,$Y$10)","v":76},{"$f":"IF(AND(Y$14*0.9-Y17<1,(Y$14*0.9-Y17>0)),1,IF(Y$14*0.9-Y17<=0,\"\",Y$14*0.9-Y17))","v":2.2999999999999972},null,{"$f":"IFERROR(AC17/AC$14,\"-\")","v":0.91596638655462181},{"$f":"SUMIFS(OFFSET(REL_D,,MATCH($B17,IND,0)-1),REL_D,$M$2,total,$AC$10)","v":109},{"$f":"IF(AND(AC$14*0.9-AC17<1,(AC$14*0.9-AC17>0)),1,IF(AC$14*0.9-AC17<=0,\"\",AC$14*0.9-AC17))","v":""},null,{"$f":"IFERROR(AG17/AG$14,\"-\")","v":0.82692307692307687},{"$f":"SUMIFS(OFFSET(REL_D,,MATCH($B17,IND,0)-1),REL_D,$M$2,total,$AG$10)","v":129},{"$f":"IF(AND(AG$14*0.9-AG17<1,(AG$14*0.9-AG17>0)),1,IF(AG$14*0.9-AG17<=0,\"\",AG$14*0.9-AG17))","v":11.400000000000006}]
[null,"(01.03) PCV","PCV",null,0.91631355932203384,865,null,0.90588235294117647,{"$f":"SUMIFS(OFFSET(REL_D,,MATCH(B18,IND,0)-1),REL_D,$M$2,total,$I$10)","v":154},{"$f":"IF(AND(I$14*0.9-I18<1,(I$14*0.9-I18>0)),1,IF(I$14*0.9-I18<=0,\"\",I$14*0.9-I18))","v":""},null,0.96644295302013428,{"$f":"SUMIFS(OFFSET(REL_D,,MATCH(B18,IND,0)-1),REL_D,$M$2,total,$M$10)","v":144},{"$f":"IF(AND(M$14*0.9-M18<1,(M$14*0.9-M18>0)),1,IF(M$14*0.9-M18<=0,\"\",M$14*0.9-M18))","v":""},null,0.88636363636363635,{"$f":"SUMIFS(OFFSET(REL_D,,MATCH($B18,IND,0)-1),REL_D,$M$2,total,$Q$10)","v":78},{"$f":"IF(AND(Q$14*0.9-Q18<1,(Q$14*0.9-Q18>0)),1,IF(Q$14*0.9-Q18<=0,\"\",Q$14*0.9-Q18))","v":1.2000000000000028},null,0.9028571428571428,{"$f":"SUMIFS(OFFSET(REL_D,,MATCH($B18,IND,0)-1),REL_D,$M$2,total,$U$10)","v":158},{"$f":"IF(AND(U$14*0.9-U18<1,(U$14*0.9-U18>0)),1,IF(U$14*0.9-U18<=0,\"\",U$14*0.9-U18))","v":""},null,0.91954022988505746,{"$f":"SUMIFS(OFFSET(REL_D,,MATCH($B18,IND,0)-1),REL_D,$M$2,total,$Y$10)","v":80},{"$f":"IF(AND(Y$14*0.9-Y18<1,(Y$14*0.9-Y18>0)),1,IF(Y$14*0.9-Y18<=0,\"\",Y$14*0.9-Y18))","v":""},null,0.95798319327731096,{"$f":"SUMIFS(OFFSET(REL_D,,MATCH($B18,IND,0)-1),REL_D,$M$2,total,$AC$10)","v":114},{"$f":"IF(AND(AC$14*0.9-AC18<1,(AC$14*0.9-AC18>0)),1,IF(AC$14*0.9-AC18<=0,\"\",AC$14*0.9-AC18))","v":""},null,0.87820512820512819,{"$f":"SUMIFS(OFFSET(REL_D,,MATCH($B18,IND,0)-1),REL_D,$M$2,total,$AG$10)","v":137},{"$f":"IF(AND(AG$14*0.9-AG18<1,(AG$14*0.9-AG18>0)),1,IF(AG$14*0.9-AG18<=0,\"\",AG$14*0.9-AG18))","v":3.4000000000000057}]
[null,"(01.04) Rotavirus","Rotavirus",null,0.83686440677966101,790,null,0.78823529411764703,{"$f":"SUMIFS(OFFSET(REL_D,,MATCH(B19,IND,0)-1),REL_D,$M$2,total,$I$10)","v":134},{"$f":"IF(AND(I$14*0.9-I19<1,(I$14*0.9-I19>0)),1,IF(I$14*0.9-I19<=0,\"\",I$14*0.9-I19))","v":19},null,0.90604026845637586,{"$f":"SUMIFS(OFFSET(REL_D,,MATCH(B19,IND,0)-1),REL_D,$M$2,total,$M$10)","v":135},{"$f":"IF(AND(M$14*0.9-M19<1,(M$14*0.9-M19>0)),1,IF(M$14*0.9-M19<=0,\"\",M$14*0.9-M19))","v":""},null,0.76136363636363635,{"$f":"SUMIFS(OFFSET(REL_D,,MATCH($B19,IND,0)-1),REL_D,$M$2,total,$Q$10)","v":67},{"$f":"IF(AND(Q$14*0.9-Q19<1,(Q$14*0.9-Q19>0)),1,IF(Q$14*0.9-Q19<=0,\"\",Q$14*0.9-Q19))","v":12.200000000000003},null,0.76,{"$f":"SUMIFS(OFFSET(REL_D,,MATCH($B19,IND,0)-1),REL_D,$M$2,total,$U$10)","v":133},{"$f":"IF(AND(U$14*0.9-U19<1,(U$14*0.9-U19>0)),1,IF(U$14*0.9-U19<=0,\"\",U$14*0.9-U19))","v":24.5},null,0.89655172413793105,{"$f":"SUMIFS(OFFSET(REL_D,,MATCH($B19,IND,0)-1),REL_D,$M$2,total,$Y$10)","v":78},{"$f":"IF(AND(Y$14*0.9-Y19<1,(Y$14*0.9-Y19>0)),1,IF(Y$14*0.9-Y19<=0,\"\",Y$14*0.9-Y19))","v":1},null,0.90756302521008403,{"$f":"SUMIFS(OFFSET(REL_D,,MATCH($B19,IND,0)-1),REL_D,$M$2,total,$AC$10)","v":108},{"$f":"IF(AND(AC$14*0.9-AC19<1,(AC$14*0.9-AC19>0)),1,IF(AC$14*0.9-AC19<=0,\"\",AC$14*0.9-AC19))","v":""},null,0.86538461538461542,{"$f":"SUMIFS(OFFSET(REL_D,,MATCH($B19,IND,0)-1),REL_D,$M$2,total,$AG$10)","v":135},{"$f":"IF(AND(AG$14*0.9-AG19<1,(AG$14*0.9-AG19>0)),1,IF(AG$14*0.9-AG19<=0,\"\",AG$14*0.9-AG19))","v":5.4000000000000057}]
[null,"(01.05) BCG","BCG",null,0,{"$f":"I20+M20+Q20+U20+Y20+AC20+AG20+AK20","v":0},null,0,{"$f":"SUMIFS(OFFSET(REL_D,,MATCH(B20,IND,0)-1),REL_D,$M$2,IF(LEFT($I$10,1)=\"W\",NwID,OrgID),$I$10)","v":0},{"$f":"IF(AND(I$14*0.9-I20<1,(I$14*0.9-I20>0)),1,IF(I$14*0.9-I20<=0,\"\",I$14*0.9-I20))","v":153},null,0,{"$f":"SUMIFS(OFFSET(REL_D,,MATCH($B20,IND,0)-1),REL_D,$M$2,IF(LEFT($M$10,1)=\"W\",NwID,OrgID),$M$10)","v":0},{"$f":"IF(AND(M$14*0.9-M20<1,(M$14*0.9-M20>0)),1,IF(M$14*0.9-M20<=0,\"\",M$14*0.9-M20))","v":134.1},null,0,{"$f":"SUMIFS(OFFSET(REL_D,,MATCH($B20,IND,0)-1),REL_D,$M$2,IF(LEFT($Q$10,1)=\"W\",NwID,OrgID),$Q$10)","v":0},{"$f":"IF(AND(Q$14*0.9-Q20<1,(Q$14*0.9-Q20>0)),1,IF(Q$14*0.9-Q20<=0,\"\",Q$14*0.9-Q20))","v":79.2},null,0,{"$f":"SUMIFS(OFFSET(REL_D,,MATCH($B20,IND,0)-1),REL_D,$M$2,IF(LEFT($U$10,1)=\"W\",NwID,OrgID),$U$10)","v":0},{"$f":"IF(AND(U$14*0.9-U20<1,(U$14*0.9-U20>0)),1,IF(U$14*0.9-U20<=0,\"\",U$14*0.9-U20))","v":157.5},null,0,{"$f":"SUMIFS(OFFSET(REL_D,,MATCH($B20,IND,0)-1),REL_D,$M$2,IF(LEFT($Y$10,1)=\"W\",NwID,OrgID),$Y$10)","v":0},{"$f":"IF(AND(Y$14*0.9-Y20<1,(Y$14*0.9-Y20>0)),1,IF(Y$14*0.9-Y20<=0,\"\",Y$14*0.9-Y20))","v":78.3},null,0,{"$f":"SUMIFS(OFFSET(REL_D,,MATCH($B20,IND,0)-1),REL_D,$M$2,IF(LEFT($AC$10,1)=\"W\",NwID,OrgID),$AC$10)","v":0},{"$f":"IF(AND(AC$14*0.9-AC20<1,(AC$14*0.9-AC20>0)),1,IF(AC$14*0.9-AC20<=0,\"\",AC$14*0.9-AC20))","v":107.10000000000001},null,0,{"$f":"SUMIFS(OFFSET(REL_D,,MATCH($B20,IND,0)-1),REL_D,$M$2,IF(LEFT($AG$10,1)=\"W\",NwID,OrgID),$AG$10)","v":0},{"$f":"IF(AND(AG$14*0.9-AG20<1,(AG$14*0.9-AG20>0)),1,IF(AG$14*0.9-AG20<=0,\"\",AG$14*0.9-AG20))","v":140.4}]
[]
[null,"(02) 24 MONTH COHORT",{"$f":"\"Patients becoming 24m within \"&'Control Panel'!$B$1","v":"Patients becoming 24m within Q4"},null,null,{"$f":"I22+M22+Q22+U22+Y22+AC22+AG22","v":981},null,null,{"$f":"SUMIFS(OFFSET(REL_D,,MATCH(B22,IND,0)-1),REL_D,$M$2,total,$I$10)","v":200},null,null,null,{"$f":"SUMIFS(OFFSET(REL_D,,MATCH(B22,IND,0)-1),REL_D,$M$2,total,$M$10)","v":152},null,null,null,{"$f":"SUMIFS(OFFSET(REL_D,,MATCH($B22,IND,0)-1),REL_D,$M$2,total,$Q$10)","v":102},null,null,null,{"$f":"SUMIFS(OFFSET(REL_D,,MATCH($B22,IND,0)-1),REL_D,$M$2,total,$U$10)","v":159},null,null,null,{"$f":"SUMIFS(OFFSET(REL_D,,MATCH($B22,IND,0)-1),REL_D,$M$2,total,$Y$10)","v":100},null,null,null,{"$f":"SUMIFS(OFFSET(REL_D,,MATCH($B22,IND,0)-1),REL_D,$M$2,total,$AC$10)","v":123},null,null,null,{"$f":"SUMIFS(OFFSET(REL_D,,MATCH($B22,IND,0)-1),REL_D,$M$2,total,$AG$10)","v":145}]
[null,null,null,null,"Coverage","Activty",null,"Coverage","Activty","Required",null,"Coverage","Activty","Required",null,"Coverage","Activty","Required",null,"Coverage","Activty","Required",null,"Coverage","Activty","Required",null,"Coverage","Activty","Required",null,"Coverage","Activty","Required"]
[null,{"$f":"'Control Panel'!E27","v":"(02.01) DTaP/IPV/Hib or DTaP/IPV/Hib/HepB"},"DTaP/IPV/Hib/HepB",null,{"$f":"IFERROR(F24/F$22,\"-\")","v":0.88888888888888884},{"$f":"I24+M24+Q24+U24+Y24+AC24+AG24","v":872},null,{"$f":"IFERROR(I24/I$22,\"-\")","v":0.89},{"$f":"SUMIFS(OFFSET(REL_D,,MATCH(B24,IND,0)-1),REL_D,$M$2,total,$I$10)","v":178},{"$f":"IF(AND(I$22*0.9-I24<1,(I$22*0.9-I24>0)),1,IF(I$22*0.9-I24<=0,\"\",I$22*0.9-I24))","v":2},null,{"$f":"IFERROR(M24/M$22,\"-\")","v":0.92763157894736847},{"$f":"SUMIFS(OFFSET(REL_D,,MATCH(B24,IND,0)-1),REL_D,$M$2,total,$M$10)","v":141},{"$f":"IF(AND(M$22*0.9-M24<1,(M$22*0.9-M24>0)),1,IF(M$22*0.9-M24<=0,\"\",M$22*0.9-M24))","v":""},null,{"$f":"IFERROR(Q24/Q$22,\"-\")","v":0.86274509803921573},{"$f":"SUMIFS(OFFSET(REL_D,,MATCH($B24,IND,0)-1),REL_D,$M$2,total,$Q$10)","v":88},{"$f":"IF(AND(Q$22*0.9-Q24<1,(Q$22*0.9-Q24>0)),1,IF(Q$22*0.9-Q24<=0,\"\",Q$22*0.9-Q24))","v":3.7999999999999972},null,{"$f":"IFERROR(U24/U$22,\"-\")","v":0.88050314465408808},{"$f":"SUMIFS(OFFSET(REL_D,,MATCH($B24,IND,0)-1),REL_D,$M$2,total,$U$10)","v":140},{"$f":"IF(AND(U$22*0.9-U24<1,(U$22*0.9-U24>0)),1,IF(U$22*0.9-U24<=0,\"\",U$22*0.9-U24))","v":3.0999999999999943},null,{"$f":"IFERROR(Y24/Y$22,\"-\")","v":0.89},{"$f":"SUMIFS(OFFSET(REL_D,,MATCH($B24,IND,0)-1),REL_D,$M$2,total,$Y$10)","v":89},{"$f":"IF(AND(Y$22*0.9-Y24<1,(Y$22*0.9-Y24>0)),1,IF(Y$22*0.9-Y24<=0,\"\",Y$22*0.9-Y24))","v":1},null,{"$f":"IFERROR(AC24/AC$22,\"-\")","v":0.90243902439024393},{"$f":"SUMIFS(OFFSET(REL_D,,MATCH($B24,IND,0)-1),REL_D,$M$2,total,$AC$10)","v":111},{"$f":"IF(AND(AC$22*0.9-AC24<1,(AC$22*0.9-AC24>0)),1,IF(AC$22*0.9-AC24<=0,\"\",AC$22*0.9-AC24))","v":""},null,{"$f":"IFERROR(AG24/AG$22,\"-\")","v":0.86206896551724133},{"$f":"SUMIFS(OFFSET(REL_D,,MATCH($B24,IND,0)-1),REL_D,$M$2,total,$AG$10)","v":125},{"$f":"IF(AND(AG$22*0.9-AG24<1,(AG$22*0.9-AG24>0)),1,IF(AG$22*0.9-AG24<=0,\"\",AG$22*0.9-AG24))","v":5.5}]
[null,"(02.02) MMR","MMR",null,{"$f":"IFERROR(F25/F$22,\"-\")","v":0.75025484199796122},736,null,{"$f":"IFERROR(I25/I$22,\"-\")","v":0.76},{"$f":"SUMIFS(OFFSET(REL_D,,MATCH(B25,IND,0)-1),REL_D,$M$2,total,$I$10)","v":152},{"$f":"IF(AND(I$22*0.9-I25<1,(I$22*0.9-I25>0)),1,IF(I$22*0.9-I25<=0,\"\",I$22*0.9-I25))","v":28},null,{"$f":"IFERROR(M25/M$22,\"-\")","v":0.71710526315789469},{"$f":"SUMIFS(OFFSET(REL_D,,MATCH(B25,IND,0)-1),REL_D,$M$2,total,$M$10)","v":109},{"$f":"IF(AND(M$22*0.9-M25<1,(M$22*0.9-M25>0)),1,IF(M$22*0.9-M25<=0,\"\",M$22*0.9-M25))","v":27.800000000000011},null,{"$f":"IFERROR(Q25/Q$22,\"-\")","v":0.58823529411764708},{"$f":"SUMIFS(OFFSET(REL_D,,MATCH($B25,IND,0)-1),REL_D,$M$2,total,$Q$10)","v":60},{"$f":"IF(AND(Q$22*0.9-Q25<1,(Q$22*0.9-Q25>0)),1,IF(Q$22*0.9-Q25<=0,\"\",Q$22*0.9-Q25))","v":31.799999999999997},null,{"$f":"IFERROR(U25/U$22,\"-\")","v":0.71069182389937102},{"$f":"SUMIFS(OFFSET(REL_D,,MATCH($B25,IND,0)-1),REL_D,$M$2,total,$U$10)","v":113},{"$f":"IF(AND(U$22*0.9-U25<1,(U$22*0.9-U25>0)),1,IF(U$22*0.9-U25<=0,\"\",U$22*0.9-U25))","v":30.099999999999994},null,{"$f":"IFERROR(Y25/Y$22,\"-\")","v":0.84},{"$f":"SUMIFS(OFFSET(REL_D,,MATCH($B25,IND,0)-1),REL_D,$M$2,total,$Y$10)","v":84},{"$f":"IF(AND(Y$22*0.9-Y25<1,(Y$22*0.9-Y25>0)),1,IF(Y$22*0.9-Y25<=0,\"\",Y$22*0.9-Y25))","v":6},null,{"$f":"IFERROR(AC25/AC$22,\"-\")","v":0.81300813008130079},{"$f":"SUMIFS(OFFSET(REL_D,,MATCH($B25,IND,0)-1),REL_D,$M$2,total,$AC$10)","v":100},{"$f":"IF(AND(AC$22*0.9-AC25<1,(AC$22*0.9-AC25>0)),1,IF(AC$22*0.9-AC25<=0,\"\",AC$22*0.9-AC25))","v":10.700000000000003},null,{"$f":"IFERROR(AG25/AG$22,\"-\")","v":0.81379310344827582},{"$f":"SUMIFS(OFFSET(REL_D,,MATCH($B25,IND,0)-1),REL_D,$M$2,total,$AG$10)","v":118},{"$f":"IF(AND(AG$22*0.9-AG25<1,(AG$22*0.9-AG25>0)),1,IF(AG$22*0.9-AG25<=0,\"\",AG$22*0.9-AG25))","v":12.5}]
[null,"(02.03) HiB/Men C","HiB/Men C",null,0.84403669724770647,828,null,{"$f":"IFERROR(I26/I$22,\"-\")","v":0.88500000000000001},{"$f":"SUMIFS(OFFSET(REL_D,,MATCH(B26,IND,0)-1),REL_D,$M$2,total,$I$10)","v":177},{"$f":"IF(AND(I$22*0.9-I26<1,(I$22*0.9-I26>0)),1,IF(I$22*0.9-I26<=0,\"\",I$22*0.9-I26))","v":3},null,0.89473684210526316,{"$f":"SUMIFS(OFFSET(REL_D,,MATCH(B26,IND,0)-1),REL_D,$M$2,total,$M$10)","v":136},{"$f":"IF(AND(M$22*0.9-M26<1,(M$22*0.9-M26>0)),1,IF(M$22*0.9-M26<=0,\"\",M$22*0.9-M26))","v":1},null,0.73529411764705888,{"$f":"SUMIFS(OFFSET(REL_D,,MATCH($B26,IND,0)-1),REL_D,$M$2,total,$Q$10)","v":75},{"$f":"IF(AND(Q$22*0.9-Q26<1,(Q$22*0.9-Q26>0)),1,IF(Q$22*0.9-Q26<=0,\"\",Q$22*0.9-Q26))","v":16.799999999999997},null,0.85534591194968557,{"$f":"SUMIFS(OFFSET(REL_D,,MATCH($B26,IND,0)-1),REL_D,$M$2,total,$U$10)","v":136},{"$f":"IF(AND(U$22*0.9-U26<1,(U$22*0.9-U26>0)),1,IF(U$22*0.9-U26<=0,\"\",U$22*0.9-U26))","v":7.0999999999999943},null,0.84,{"$f":"SUMIFS(OFFSET(REL_D,,MATCH($B26,IND,0)-1),REL_D,$M$2,total,$Y$10)","v":84},{"$f":"IF(AND(Y$22*0.9-Y26<1,(Y$22*0.9-Y26>0)),1,IF(Y$22*0.9-Y26<=0,\"\",Y$22*0.9-Y26))","v":6},null,0.82926829268292679,{"$f":"SUMIFS(OFFSET(REL_D,,MATCH($B26,IND,0)-1),REL_D,$M$2,total,$AC$10)","v":102},{"$f":"IF(AND(AC$22*0.9-AC26<1,(AC$22*0.9-AC26>0)),1,IF(AC$22*0.9-AC26<=0,\"\",AC$22*0.9-AC26))","v":8.7000000000000028},null,0.81379310344827582,{"$f":"SUMIFS(OFFSET(REL_D,,MATCH($B26,IND,0)-1),REL_D,$M$2,total,$AG$10)","v":118},{"$f":"IF(AND(AG$22*0.9-AG26<1,(AG$22*0.9-AG26>0)),1,IF(AG$22*0.9-AG26<=0,\"\",AG$22*0.9-AG26))","v":12.5}]
[null,"(02.04) PCV (Booster)","PCV (Booster)",null,0.85932721712538229,843,null,{"$f":"IFERROR(I27/I$22,\"-\")","v":0.89},{"$f":"SUMIFS(OFFSET(REL_D,,MATCH(B27,IND,0)-1),REL_D,$M$2,total,$I$10)","v":178},{"$f":"IF(AND(I$22*0.9-I27<1,(I$22*0.9-I27>0)),1,IF(I$22*0.9-I27<=0,\"\",I$22*0.9-I27))","v":2},null,0.88815789473684215,{"$f":"SUMIFS(OFFSET(REL_D,,MATCH(B27,IND,0)-1),REL_D,$M$2,total,$M$10)","v":135},{"$f":"IF(AND(M$22*0.9-M27<1,(M$22*0.9-M27>0)),1,IF(M$22*0.9-M27<=0,\"\",M$22*0.9-M27))","v":1.8000000000000114},null,0.8529411764705882,{"$f":"SUMIFS(OFFSET(REL_D,,MATCH($B27,IND,0)-1),REL_D,$M$2,total,$Q$10)","v":87},{"$f":"IF(AND(Q$22*0.9-Q27<1,(Q$22*0.9-Q27>0)),1,IF(Q$22*0.9-Q27<=0,\"\",Q$22*0.9-Q27))","v":4.7999999999999972},null,0.86163522012578619,{"$f":"SUMIFS(OFFSET(REL_D,,MATCH($B27,IND,0)-1),REL_D,$M$2,total,$U$10)","v":137},{"$f":"IF(AND(U$22*0.9-U27<1,(U$22*0.9-U27>0)),1,IF(U$22*0.9-U27<=0,\"\",U$22*0.9-U27))","v":6.0999999999999943},null,0.86,{"$f":"SUMIFS(OFFSET(REL_D,,MATCH($B27,IND,0)-1),REL_D,$M$2,total,$Y$10)","v":86},{"$f":"IF(AND(Y$22*0.9-Y27<1,(Y$22*0.9-Y27>0)),1,IF(Y$22*0.9-Y27<=0,\"\",Y$22*0.9-Y27))","v":4},null,0.82926829268292679,{"$f":"SUMIFS(OFFSET(REL_D,,MATCH($B27,IND,0)-1),REL_D,$M$2,total,$AC$10)","v":102},{"$f":"IF(AND(AC$22*0.9-AC27<1,(AC$22*0.9-AC27>0)),1,IF(AC$22*0.9-AC27<=0,\"\",AC$22*0.9-AC27))","v":8.7000000000000028},null,0.81379310344827582,{"$f":"SUMIFS(OFFSET(REL_D,,MATCH($B27,IND,0)-1),REL_D,$M$2,total,$AG$10)","v":118},{"$f":"IF(AND(AG$22*0.9-AG27<1,(AG$22*0.9-AG27>0)),1,IF(AG$22*0.9-AG27<=0,\"\",AG$22*0.9-AG27))","v":12.5}]
[null,"(02.05) Men B (Booster)","MenB (Booster) ",null,0.85626911314984711,840,null,{"$f":"IFERROR(I28/I$22,\"-\")","v":0.89},{"$f":"SUMIFS(OFFSET(REL_D,,MATCH(B28,IND,0)-1),REL_D,$M$2,total,$I$10)","v":178},{"$f":"IF(AND(I$22*0.9-I28<1,(I$22*0.9-I28>0)),1,IF(I$22*0.9-I28<=0,\"\",I$22*0.9-I28))","v":2},null,0.88815789473684215,{"$f":"SUMIFS(OFFSET(REL_D,,MATCH(B28,IND,0)-1),REL_D,$M$2,total,$M$10)","v":135},{"$f":"IF(AND(M$22*0.9-M28<1,(M$22*0.9-M28>0)),1,IF(M$22*0.9-M28<=0,\"\",M$22*0.9-M28))","v":1.8000000000000114},null,0.83333333333333337,{"$f":"SUMIFS(OFFSET(REL_D,,MATCH($B28,IND,0)-1),REL_D,$M$2,total,$Q$10)","v":85},{"$f":"IF(AND(Q$22*0.9-Q28<1,(Q$22*0.9-Q28>0)),1,IF(Q$22*0.9-Q28<=0,\"\",Q$22*0.9-Q28))","v":6.7999999999999972},null,0.85534591194968557,{"$f":"SUMIFS(OFFSET(REL_D,,MATCH($B28,IND,0)-1),REL_D,$M$2,total,$U$10)","v":136},{"$f":"IF(AND(U$22*0.9-U28<1,(U$22*0.9-U28>0)),1,IF(U$22*0.9-U28<=0,\"\",U$22*0.9-U28))","v":7.0999999999999943},null,0.85,{"$f":"SUMIFS(OFFSET(REL_D,,MATCH($B28,IND,0)-1),REL_D,$M$2,total,$Y$10)","v":85},{"$f":"IF(AND(Y$22*0.9-Y28<1,(Y$22*0.9-Y28>0)),1,IF(Y$22*0.9-Y28<=0,\"\",Y$22*0.9-Y28))","v":5},null,0.83739837398373984,{"$f":"SUMIFS(OFFSET(REL_D,,MATCH($B28,IND,0)-1),REL_D,$M$2,total,$AC$10)","v":103},{"$f":"IF(AND(AC$22*0.9-AC28<1,(AC$22*0.9-AC28>0)),1,IF(AC$22*0.9-AC28<=0,\"\",AC$22*0.9-AC28))","v":7.7000000000000028},null,0.81379310344827582,{"$f":"SUMIFS(OFFSET(REL_D,,MATCH($B28,IND,0)-1),REL_D,$M$2,total,$AG$10)","v":118},{"$f":"IF(AND(AG$22*0.9-AG28<1,(AG$22*0.9-AG28>0)),1,IF(AG$22*0.9-AG28<=0,\"\",AG$22*0.9-AG28))","v":12.5}]
[]
[null,"(03) 5 YEAR COHORT",{"$f":"\"Patients becoming 5y within \"&'Control Panel'!$B$1","v":"Patients becoming 5y within Q4"},null,null,{"$f":"I30+M30+Q30+U30+Y30+AC30+AG30","v":950},null,null,{"$f":"SUMIFS(OFFSET(REL_D,,MATCH(B30,IND,0)-1),REL_D,$M$2,total,$I$10)","v":162},null,null,null,{"$f":"SUMIFS(OFFSET(REL_D,,MATCH(B30,IND,0)-1),REL_D,$M$2,total,$M$10)","v":163},null,null,null,{"$f":"SUMIFS(OFFSET(REL_D,,MATCH($B30,IND,0)-1),REL_D,$M$2,total,$Q$10)","v":94},null,null,null,{"$f":"SUMIFS(OFFSET(REL_D,,MATCH($B30,IND,0)-1),REL_D,$M$2,total,$U$10)","v":153},null,null,null,{"$f":"SUMIFS(OFFSET(REL_D,,MATCH($B30,IND,0)-1),REL_D,$M$2,total,$Y$10)","v":97},null,null,null,{"$f":"SUMIFS(OFFSET(REL_D,,MATCH($B30,IND,0)-1),REL_D,$M$2,total,$AC$10)","v":141},null,null,null,{"$f":"SUMIFS(OFFSET(REL_D,,MATCH($B30,IND,0)-1),REL_D,$M$2,total,$AG$10)","v":140}]
[null,null,null,null,"Coverage","Activty",null,"Coverage","Activty","Required",null,"Coverage","Activty","Required",null,"Coverage","Activty","Required",null,"Coverage","Activty","Required",null,"Coverage","Activty","Required",null,"Coverage","Activty","Required",null,"Coverage","Activty","Required"]
[null,{"$f":"'Control Panel'!E50","v":"(03.01) DTaP/IPV/Hib or DTaP/IPV/Hib/HepB"},"DTaP/IPV/Hib",null,{"$f":"IFERROR(F32/F$30,\"-\")","v":0.85473684210526313},{"$f":"I32+M32+Q32+U32+Y32+AC32+AG32","v":812},null,{"$f":"IFERROR(I32/I$30,\"-\")","v":0.8271604938271605},{"$f":"SUMIFS(OFFSET(REL_D,,MATCH(B32,IND,0)-1),REL_D,$M$2,total,$I$10)","v":134},{"$f":"IF(AND(I$30*0.9-I32<1,(I$30*0.9-I32>0)),1,IF(I$30*0.9-I32<=0,\"\",I$30*0.9-I32))","v":11.800000000000011},null,{"$f":"IFERROR(M32/M$30,\"-\")","v":0.8404907975460123},{"$f":"SUMIFS(OFFSET(REL_D,,MATCH(B32,IND,0)-1),REL_D,$M$2,total,$M$10)","v":137},{"$f":"IF(AND(M$30*0.9-M32<1,(M$30*0.9-M32>0)),1,IF(M$30*0.9-M32<=0,\"\",M$30*0.9-M32))","v":9.7000000000000171},null,{"$f":"IFERROR(Q32/Q$30,\"-\")","v":0.71276595744680848},{"$f":"SUMIFS(OFFSET(REL_D,,MATCH($B32,IND,0)-1),REL_D,$M$2,total,$Q$10)","v":67},{"$f":"IF(AND(Q$30*0.9-Q32<1,(Q$30*0.9-Q32>0)),1,IF(Q$30*0.9-Q32<=0,\"\",Q$30*0.9-Q32))","v":17.600000000000009},null,{"$f":"IFERROR(U32/U$30,\"-\")","v":0.88235294117647056},{"$f":"SUMIFS(OFFSET(REL_D,,MATCH($B32,IND,0)-1),REL_D,$M$2,total,$U$10)","v":135},{"$f":"IF(AND(U$30*0.9-U32<1,(U$30*0.9-U32>0)),1,IF(U$30*0.9-U32<=0,\"\",U$30*0.9-U32))","v":2.7000000000000171},null,{"$f":"IFERROR(Y32/Y$30,\"-\")","v":0.88659793814432986},{"$f":"SUMIFS(OFFSET(REL_D,,MATCH($B32,IND,0)-1),REL_D,$M$2,total,$Y$10)","v":86},{"$f":"IF(AND(Y$30*0.9-Y32<1,(Y$30*0.9-Y32>0)),1,IF(Y$30*0.9-Y32<=0,\"\",Y$30*0.9-Y32))","v":1.2999999999999972},null,{"$f":"IFERROR(AC32/AC$30,\"-\")","v":0.92198581560283688},{"$f":"SUMIFS(OFFSET(REL_D,,MATCH($B32,IND,0)-1),REL_D,$M$2,total,$AC$10)","v":130},{"$f":"IF(AND(AC$30*0.9-AC32<1,(AC$30*0.9-AC32>0)),1,IF(AC$30*0.9-AC32<=0,\"\",AC$30*0.9-AC32))","v":""},null,{"$f":"IFERROR(AG32/AG$30,\"-\")","v":0.87857142857142856},{"$f":"SUMIFS(OFFSET(REL_D,,MATCH($B32,IND,0)-1),REL_D,$M$2,total,$AG$10)","v":123},{"$f":"IF(AND(AG$30*0.9-AG32<1,(AG$30*0.9-AG32>0)),1,IF(AG$30*0.9-AG32<=0,\"\",AG$30*0.9-AG32))","v":3}]
[null,"(03.02) MMR (Primary)","MMR (Primary)",null,{"$f":"IFERROR(F33/F$30,\"-\")","v":0.81157894736842107},771,null,{"$f":"IFERROR(I33/I$30,\"-\")","v":0.72222222222222221},{"$f":"SUMIFS(OFFSET(REL_D,,MATCH(B33,IND,0)-1),REL_D,$M$2,total,$I$10)","v":117},{"$f":"IF(AND(I$30*0.9-I33<1,(I$30*0.9-I33>0)),1,IF(I$30*0.9-I33<=0,\"\",I$30*0.9-I33))","v":28.800000000000011},null,{"$f":"IFERROR(M33/M$30,\"-\")","v":0.82822085889570551},{"$f":"SUMIFS(OFFSET(REL_D,,MATCH(B33,IND,0)-1),REL_D,$M$2,total,$M$10)","v":135},{"$f":"IF(AND(M$30*0.9-M33<1,(M$30*0.9-M33>0)),1,IF(M$30*0.9-M33<=0,\"\",M$30*0.9-M33))","v":11.700000000000017},null,{"$f":"IFERROR(Q33/Q$30,\"-\")","v":0.71276595744680848},{"$f":"SUMIFS(OFFSET(REL_D,,MATCH($B33,IND,0)-1),REL_D,$M$2,total,$Q$10)","v":67},{"$f":"IF(AND(Q$30*0.9-Q33<1,(Q$30*0.9-Q33>0)),1,IF(Q$30*0.9-Q33<=0,\"\",Q$30*0.9-Q33))","v":17.600000000000009},null,{"$f":"IFERROR(U33/U$30,\"-\")","v":0.79084967320261434},{"$f":"SUMIFS(OFFSET(REL_D,,MATCH($B33,IND,0)-1),REL_D,$M$2,total,$U$10)","v":121},{"$f":"IF(AND(U$30*0.9-U33<1,(U$30*0.9-U33>0)),1,IF(U$30*0.9-U33<=0,\"\",U$30*0.9-U33))","v":16.700000000000017},null,{"$f":"IFERROR(Y33/Y$30,\"-\")","v":0.84536082474226804},{"$f":"SUMIFS(OFFSET(REL_D,,MATCH($B33,IND,0)-1),REL_D,$M$2,total,$Y$10)","v":82},{"$f":"IF(AND(Y$30*0.9-Y33<1,(Y$30*0.9-Y33>0)),1,IF(Y$30*0.9-Y33<=0,\"\",Y$30*0.9-Y33))","v":5.2999999999999972},null,{"$f":"IFERROR(AC33/AC$30,\"-\")","v":0.90780141843971629},{"$f":"SUMIFS(OFFSET(REL_D,,MATCH($B33,IND,0)-1),REL_D,$M$2,total,$AC$10)","v":128},{"$f":"IF(AND(AC$30*0.9-AC33<1,(AC$30*0.9-AC33>0)),1,IF(AC$30*0.9-AC33<=0,\"\",AC$30*0.9-AC33))","v":""},null,{"$f":"IFERROR(AG33/AG$30,\"-\")","v":0.86428571428571432},{"$f":"SUMIFS(OFFSET(REL_D,,MATCH($B33,IND,0)-1),REL_D,$M$2,total,$AG$10)","v":121},{"$f":"IF(AND(AG$30*0.9-AG33<1,(AG$30*0.9-AG33>0)),1,IF(AG$30*0.9-AG33<=0,\"\",AG$30*0.9-AG33))","v":5}]
[null,"(03.03) DTaP/IPV (Booster)","DTaP/IPV (Booster)",null,0.72947368421052627,693,null,{"$f":"IFERROR(I34/I$30,\"-\")","v":0.71604938271604934},{"$f":"SUMIFS(OFFSET(REL_D,,MATCH(B34,IND,0)-1),REL_D,$M$2,total,$I$10)","v":116},{"$f":"IF(AND(I$30*0.9-I34<1,(I$30*0.9-I34>0)),1,IF(I$30*0.9-I34<=0,\"\",I$30*0.9-I34))","v":29.800000000000011},null,0.86503067484662577,{"$f":"SUMIFS(OFFSET(REL_D,,MATCH(B34,IND,0)-1),REL_D,$M$2,total,$M$10)","v":141},{"$f":"IF(AND(M$30*0.9-M34<1,(M$30*0.9-M34>0)),1,IF(M$30*0.9-M34<=0,\"\",M$30*0.9-M34))","v":5.7000000000000171},null,0.68085106382978722,{"$f":"SUMIFS(OFFSET(REL_D,,MATCH($B34,IND,0)-1),REL_D,$M$2,total,$Q$10)","v":64},{"$f":"IF(AND(Q$30*0.9-Q34<1,(Q$30*0.9-Q34>0)),1,IF(Q$30*0.9-Q34<=0,\"\",Q$30*0.9-Q34))","v":20.600000000000009},null,0.71895424836601307,{"$f":"SUMIFS(OFFSET(REL_D,,MATCH($B34,IND,0)-1),REL_D,$M$2,total,$U$10)","v":110},{"$f":"IF(AND(U$30*0.9-U34<1,(U$30*0.9-U34>0)),1,IF(U$30*0.9-U34<=0,\"\",U$30*0.9-U34))","v":27.700000000000017},null,0.60824742268041232,{"$f":"SUMIFS(OFFSET(REL_D,,MATCH($B34,IND,0)-1),REL_D,$M$2,total,$Y$10)","v":59},{"$f":"IF(AND(Y$30*0.9-Y34<1,(Y$30*0.9-Y34>0)),1,IF(Y$30*0.9-Y34<=0,\"\",Y$30*0.9-Y34))","v":28.299999999999997},null,0.8014184397163121,{"$f":"SUMIFS(OFFSET(REL_D,,MATCH($B34,IND,0)-1),REL_D,$M$2,total,$AC$10)","v":113},{"$f":"IF(AND(AC$30*0.9-AC34<1,(AC$30*0.9-AC34>0)),1,IF(AC$30*0.9-AC34<=0,\"\",AC$30*0.9-AC34))","v":13.900000000000006},null,0.6428571428571429,{"$f":"SUMIFS(OFFSET(REL_D,,MATCH($B34,IND,0)-1),REL_D,$M$2,total,$AG$10)","v":90},{"$f":"IF(AND(AG$30*0.9-AG34<1,(AG$30*0.9-AG34>0)),1,IF(AG$30*0.9-AG34<=0,\"\",AG$30*0.9-AG34))","v":36}]
[null,"(03.05) MMR (Booster)","MMR (Booster)",null,0.63684210526315788,605,null,0.58024691358024694,{"$f":"SUMIFS(OFFSET(REL_D,,MATCH(B35,IND,0)-1),REL_D,$M$2,total,$I$10)","v":94},{"$f":"IF(AND(I$30*0.9-I35<1,(I$30*0.9-I35>0)),1,IF(I$30*0.9-I35<=0,\"\",I$30*0.9-I35))","v":51.800000000000011},null,0.57668711656441718,{"$f":"SUMIFS(OFFSET(REL_D,,MATCH(B35,IND,0)-1),REL_D,$M$2,total,$M$10)","v":94},{"$f":"IF(AND(M$30*0.9-M35<1,(M$30*0.9-M35>0)),1,IF(M$30*0.9-M35<=0,\"\",M$30*0.9-M35))","v":52.700000000000017},null,0.35106382978723405,{"$f":"SUMIFS(OFFSET(REL_D,,MATCH($B35,IND,0)-1),REL_D,$M$2,total,$Q$10)","v":33},{"$f":"IF(AND(Q$30*0.9-Q35<1,(Q$30*0.9-Q35>0)),1,IF(Q$30*0.9-Q35<=0,\"\",Q$30*0.9-Q35))","v":51.600000000000009},null,0.64052287581699341,{"$f":"SUMIFS(OFFSET(REL_D,,MATCH($B35,IND,0)-1),REL_D,$M$2,total,$U$10)","v":98},{"$f":"IF(AND(U$30*0.9-U35<1,(U$30*0.9-U35>0)),1,IF(U$30*0.9-U35<=0,\"\",U$30*0.9-U35))","v":39.700000000000017},null,0.77319587628865982,{"$f":"SUMIFS(OFFSET(REL_D,,MATCH($B35,IND,0)-1),REL_D,$M$2,total,$Y$10)","v":75},{"$f":"IF(AND(Y$30*0.9-Y35<1,(Y$30*0.9-Y35>0)),1,IF(Y$30*0.9-Y35<=0,\"\",Y$30*0.9-Y35))","v":12.299999999999997},null,0.84397163120567376,{"$f":"SUMIFS(OFFSET(REL_D,,MATCH($B35,IND,0)-1),REL_D,$M$2,total,$AC$10)","v":119},{"$f":"IF(AND(AC$30*0.9-AC35<1,(AC$30*0.9-AC35>0)),1,IF(AC$30*0.9-AC35<=0,\"\",AC$30*0.9-AC35))","v":7.9000000000000057},null,0.65714285714285714,{"$f":"SUMIFS(OFFSET(REL_D,,MATCH($B35,IND,0)-1),REL_D,$M$2,total,$AG$10)","v":92},{"$f":"IF(AND(AG$30*0.9-AG35<1,(AG$30*0.9-AG35>0)),1,IF(AG$30*0.9-AG35<=0,\"\",AG$30*0.9-AG35))","v":34}]
[null,"(03.04) HiB/Men C","HiB/Men C",null,0.84210526315789469,800,null,0.8271604938271605,{"$f":"SUMIFS(OFFSET(REL_D,,MATCH(B36,IND,0)-1),REL_D,$M$2,total,$I$10)","v":134},{"$f":"IF(AND(I$30*0.9-I36<1,(I$30*0.9-I36>0)),1,IF(I$30*0.9-I36<=0,\"\",I$30*0.9-I36))","v":11.800000000000011},null,0.85276073619631898,{"$f":"SUMIFS(OFFSET(REL_D,,MATCH(B36,IND,0)-1),REL_D,$M$2,total,$M$10)","v":139},{"$f":"IF(AND(M$30*0.9-M36<1,(M$30*0.9-M36>0)),1,IF(M$30*0.9-M36<=0,\"\",M$30*0.9-M36))","v":7.7000000000000171},null,0.71276595744680848,{"$f":"SUMIFS(OFFSET(REL_D,,MATCH($B36,IND,0)-1),REL_D,$M$2,total,$Q$10)","v":67},{"$f":"IF(AND(Q$30*0.9-Q36<1,(Q$30*0.9-Q36>0)),1,IF(Q$30*0.9-Q36<=0,\"\",Q$30*0.9-Q36))","v":17.600000000000009},null,0.86928104575163401,{"$f":"SUMIFS(OFFSET(REL_D,,MATCH($B36,IND,0)-1),REL_D,$M$2,total,$U$10)","v":133},{"$f":"IF(AND(U$30*0.9-U36<1,(U$30*0.9-U36>0)),1,IF(U$30*0.9-U36<=0,\"\",U$30*0.9-U36))","v":4.7000000000000171},null,0.83505154639175261,{"$f":"SUMIFS(OFFSET(REL_D,,MATCH($B36,IND,0)-1),REL_D,$M$2,total,$Y$10)","v":81},{"$f":"IF(AND(Y$30*0.9-Y36<1,(Y$30*0.9-Y36>0)),1,IF(Y$30*0.9-Y36<=0,\"\",Y$30*0.9-Y36))","v":6.2999999999999972},null,0.91489361702127658,{"$f":"SUMIFS(OFFSET(REL_D,,MATCH($B36,IND,0)-1),REL_D,$M$2,total,$AC$10)","v":129},{"$f":"IF(AND(AC$30*0.9-AC36<1,(AC$30*0.9-AC36>0)),1,IF(AC$30*0.9-AC36<=0,\"\",AC$30*0.9-AC36))","v":""},null,0.83571428571428574,{"$f":"SUMIFS(OFFSET(REL_D,,MATCH($B36,IND,0)-1),REL_D,$M$2,total,$AG$10)","v":117},{"$f":"IF(AND(AG$30*0.9-AG36<1,(AG$30*0.9-AG36>0)),1,IF(AG$30*0.9-AG36<=0,\"\",AG$30*0.9-AG36))","v":9}]

{"sheet":"Patients becoming 12m","index":2,"n_rows":57,"n_cols":16,"rows_kept":57,"cut":false,"hidden":false,"merged":[[15,0,16,2],[15,4,16,4]]}
[]
[null,null,null,"Waltham Forest Childhood Immunisations Dashboard: Metric Details"]
[null,{"$f":"VLOOKUP(C5,'Control Panel'!Y49:Z60,2,FALSE)","v":{"$error":"#N/A"}},null,"Patients becoming 12m",null,{"$f":"E15","v":944}]
[null,"2020-02-01"]
[null,null,"March 2022","All Patients","(01) 12 MONTH COHORT","(01.01) DTaP/IPV/Hib 6in1","DTaP/IPV/Hib(%)","Patients required to achieve NHSE Target (90%)","(01.02) Men B (1st and 2nd)","Men B(%)","Patients required to achieve NHSE Target (90%)","(01.03) PCV","PCV(%)","Patients required to achieve NHSE Target (90%)","(01.04) Rotavirus","Rotavirus(%)"]
[null,"Home",null,"Listsize ","Patients becoming 12m","DTaP/IPV/Hib/HepB","DTaP/IPV/Hib/HepB(%)","Patients required to achieve CCG Target (95%)","Men B","Men B(%)","Patients required to achieve CCG Target (95%)","PCV","PCV(%)","Patients required to achieve CCG Target (95%)","Rotavirus","Rotavirus(%)"]
["Cluster"]
["WF-1","Chingford/ Walthamstow",null,{"$f":"SUM(IF($A8=$A$19:$A$57,D$19:D$57))","v":51956},{"$f":"SUM(IF($A8=$A$19:$A$57,E$19:E$57))","v":170},{"$f":"SUM(IF($A8=$A$19:$A$57,F$19:F$57))","v":150},{"$f":"IF(OR(ISTEXT($E8),$E8=0),\"N/A\",F8/$E8)","v":0.88235294117647056},null,{"$f":"SUM(IF($A8=$A$19:$A$57,I$19:I$57))","v":150},{"$f":"IF(OR(ISTEXT($E8),$E8=0),\"N/A\",I8/$E8)","v":0.88235294117647056},null,{"$f":"SUM(IF($A8=$A$19:$A$57,L$19:L$57))","v":154},{"$f":"IF(OR(ISTEXT($E8),$E8=0),\"N/A\",L8/$E8)","v":0.90588235294117647},null,{"$f":"SUM(IF($A8=$A$19:$A$57,O$19:O$57))","v":134},{"$f":"IF(OR(ISTEXT($E8),$E8=0),\"N/A\",O8/$E8)","v":0.78823529411764703}]
["WF-2","Chingford E4",null,{"$f":"SUM(IF($A9=$A$19:$A$57,D$19:D$57))","v":53291},{"$f":"SUM(IF($A9=$A$19:$A$57,E$19:E$57))","v":149},{"$f":"SUM(IF($A9=$A$19:$A$57,F$19:F$57))","v":144},0.96644295302013428,null,{"$f":"SUM(IF($A9=$A$19:$A$57,I$19:I$57))","v":144},{"$f":"IF(OR(ISTEXT($E9),$E9=0),\"N/A\",I9/$E9)","v":0.96644295302013428},null,{"$f":"SUM(IF($A9=$A$19:$A$57,L$19:L$57))","v":144},{"$f":"IF(OR(ISTEXT($E9),$E9=0),\"N/A\",L9/$E9)","v":0.96644295302013428},null,{"$f":"SUM(IF($A9=$A$19:$A$57,O$19:O$57))","v":135},{"$f":"IF(OR(ISTEXT($E9),$E9=0),\"N/A\",O9/$E9)","v":0.90604026845637586}]
["WF-3","Leyton Collaborative",null,{"$f":"SUM(IF($A10=$A$19:$A$57,D$19:D$57))","v":35895},{"$f":"SUM(IF($A10=$A$19:$A$57,E$19:E$57))","v":88},{"$f":"SUM(IF($A10=$A$19:$A$57,F$19:F$57))","v":78},0.88636363636363635,null,{"$f":"SUM(IF($A10=$A$19:$A$57,I$19:I$57))","v":75},0.85227272727272729,null,{"$f":"SUM(IF($A10=$A$19:$A$57,L$19:L$57))","v":78},0.88636363636363635,null,{"$f":"SUM(IF($A10=$A$19:$A$57,O$19:O$57))","v":67},0.76136363636363635]
["WF-4","Forest Integrated Health",null,{"$f":"SUM(IF($A11=$A$19:$A$57,D$19:D$57))","v":58885},{"$f":"SUM(IF($A11=$A$19:$A$57,E$19:E$57))","v":175},{"$f":"SUM(IF($A11=$A$19:$A$57,F$19:F$57))","v":153},0.87428571428571433,null,{"$f":"SUM(IF($A11=$A$19:$A$57,I$19:I$57))","v":150},0.8571428571428571,null,{"$f":"SUM(IF($A11=$A$19:$A$57,L$19:L$57))","v":158},0.9028571428571428,null,{"$f":"SUM(IF($A11=$A$19:$A$57,O$19:O$57))","v":133},0.76]
["WF-5","South Leytonstone",null,{"$f":"SUM(IF($A12=$A$19:$A$57,D$19:D$57))","v":36701},{"$f":"SUM(IF($A12=$A$19:$A$57,E$19:E$57))","v":87},{"$f":"SUM(IF($A12=$A$19:$A$57,F$19:F$57))","v":77},0.88505747126436785,null,{"$f":"SUM(IF($A12=$A$19:$A$57,I$19:I$57))","v":76},0.87356321839080464,null,{"$f":"SUM(IF($A12=$A$19:$A$57,L$19:L$57))","v":80},0.91954022988505746,null,{"$f":"SUM(IF($A12=$A$19:$A$57,O$19:O$57))","v":78},0.89655172413793105]
["WF-6","Central Walthamstow",null,{"$f":"SUM(IF($A13=$A$19:$A$57,D$19:D$57))","v":41577},{"$f":"SUM(IF($A13=$A$19:$A$57,E$19:E$57))","v":119},{"$f":"SUM(IF($A13=$A$19:$A$57,F$19:F$57))","v":109},0.91596638655462181,null,{"$f":"SUM(IF($A13=$A$19:$A$57,I$19:I$57))","v":109},0.91596638655462181,null,{"$f":"SUM(IF($A13=$A$19:$A$57,L$19:L$57))","v":114},0.95798319327731096,null,{"$f":"SUM(IF($A13=$A$19:$A$57,O$19:O$57))","v":108},0.90756302521008403]
["WF-7","Walthamstow West",null,{"$f":"SUM(IF($A14=$A$19:$A$57,D$19:D$57))","v":45074},{"$f":"SUM(IF($A14=$A$19:$A$57,E$19:E$57))","v":156},{"$f":"SUM(IF($A14=$A$19:$A$57,F$19:F$57))","v":133},0.85256410256410253,null,{"$f":"SUM(IF($A14=$A$19:$A$57,I$19:I$57))","v":129},0.82692307692307687,null,{"$f":"SUM(IF($A14=$A$19:$A$57,L$19:L$57))","v":137},0.87820512820512819,null,{"$f":"SUM(IF($A14=$A$19:$A$57,O$19:O$57))","v":135},0.86538461538461542]
["Total",null,null,{"$f":"SUM(D8:D14)","v":323379},{"$f":"SUM(E8:E14)","v":944},{"$f":"SUM(F8:F14)","v":844},0.89406779661016944,null,{"$f":"SUM(I8:I14)","v":833},0.88241525423728817,null,{"$f":"SUM(L8:L14)","v":865},0.91631355932203384,null,{"$f":"SUM(O8:O14)","v":790},0.83686440677966101]
["Minimum and Maximum %",null,null,null,null,"Min","Max",null,"Min","Max",null,"Min","Max",null,"Min","Max"]
[null,null,null,null,null,{"$f":"SMALL(G19:G51,COUNTIF(G19:G51,0)+1)","v":0.66666666666666663},{"$f":"MAX(G19:G51)","v":1},null,{"$f":"SMALL(J19:J51,COUNTIF(J19:J51,0)+1)","v":0.6},{"$f":"MAX(J19:J51)","v":1},null,{"$f":"SMALL(M19:M51,COUNTIF(M19:M51,0)+1)","v":0.7},{"$f":"MAX(M19:M51)","v":1},null,{"$f":"SMALL(P19:P51,COUNTIF(P19:P51,0)+1)","v":5.8823529411764705E-2},{"$f":"MAX(P19:P51)","v":1}]
["Practices","* SystmOne Practices - No Data"]
[{"$f":"VLOOKUP(C19,'Control Panel'!$G$132:$K$171,5,FALSE)","v":"WF-1"},{"$f":"VLOOKUP(C19,'Control Panel'!$A$85:$F$124,2,FALSE)","v":"Kings Head Medical Practice"},"F86700",{"$f":"SUMIFS(OFFSET(REL_D,,MATCH($D$5,IND,0)-1),REL_D,$C$5,OrgID,$C19)","v":3901},{"$f":"SUMIFS(OFFSET(REL_D,,MATCH($E$5,IND,0)-1),REL_D,$C$5,OrgID,$C19)","v":8},{"$f":"SUMIFS(OFFSET(REL_D,,MATCH($F$5,IND,0)-1),REL_D,$C$5,OrgID,$C19)","v":6},{"$f":"IF(OR(ISTEXT($E19),$E19=0),\"N/A\",F19/$E19)","v":0.75},{"$f":"IFERROR(ROUNDUP(IF($E19*0.95-F19>=0,$E19*0.95-F19,\"\"),0),\"\")","v":2},{"$f":"SUMIFS(OFFSET(REL_D,,MATCH($I$5,IND,0)-1),REL_D,$C$5,OrgID,$C19)","v":6},{"$f":"IF(OR(ISTEXT($E19),$E19=0),\"N/A\",I19/$E19)","v":0.75},{"$f":"IFERROR(ROUNDUP(IF($E19*0.95-I19>=0,$E19*0.95-I19,\"\"),0),\"\")","v":2},{"$f":"SUMIFS(OFFSET(REL_D,,MATCH($L$5,IND,0)-1),REL_D,$C$5,OrgID,$C19)","v":7},{"$f":"IF(OR(ISTEXT($E19),$E19=0),\"N/A\",L19/$E19)","v":0.875},{"$f":"IFERROR(ROUNDUP(IF($E19*0.95-L19>=0,$E19*0.95-L19,\"\"),0),\"\")","v":1},{"$f":"SUMIFS(OFFSET(REL_D,,MATCH($O$5,IND,0)-1),REL_D,$C$5,OrgID,$C19)","v":6},{"$f":"IF(OR(ISTEXT($E19),$E19=0),\"N/A\",O19/$E19)","v":0.75}]
[{"$f":"VLOOKUP(C20,'Control Panel'!$G$132:$K$171,5,FALSE)","v":"WF-1"},{"$f":"VLOOKUP(C20,'Control Panel'!$A$85:$F$124,2,FALSE)","v":"Larkshall Medical Centre"},"F86664",8471,17,17,1,{"$f":"IFERROR(ROUNDUP(IF($E20*0.95-F20>=0,$E20*0.95-F20,\"\"),0),\"\")","v":""},17,1,{"$f":"IFERROR(ROUNDUP(IF($E20*0.95-I20>=0,$E20*0.95-I20,\"\"),0),\"\")","v":""},17,1,{"$f":"IFERROR(ROUNDUP(IF($E20*0.95-L20>=0,$E20*0.95-L20,\"\"),0),\"\")","v":""},17,{"$f":"IF(OR(ISTEXT($E20),$E20=0),\"N/A\",O20/$E20)","v":1}]
[{"$f":"VLOOKUP(C21,'Control Panel'!$G$132:$K$171,5,FALSE)","v":"WF-1"},{"$f":"VLOOKUP(C21,'Control Panel'!$A$85:$F$124,2,FALSE)","v":"The Microfaculty*"},"F86638",5199,17,12,{"$f":"IF(OR(ISTEXT($E21),$E21=0),\"N/A\",F21/$E21)","v":0.70588235294117652},5,12,{"$f":"IF(OR(ISTEXT($E21),$E21=0),\"N/A\",I21/$E21)","v":0.70588235294117652},5,12,{"$f":"IF(OR(ISTEXT($E21),$E21=0),\"N/A\",L21/$E21)","v":0.70588235294117652},5,1,{"$f":"IF(OR(ISTEXT($E21),$E21=0),\"N/A\",O21/$E21)","v":5.8823529411764705E-2}]
[{"$f":"VLOOKUP(C22,'Control Panel'!$G$132:$K$171,5,FALSE)","v":"WF-1"},{"$f":"VLOOKUP(C22,'Control Panel'!$A$85:$F$124,2,FALSE)","v":" The Penryhn Surgery"},"F86005",9510,42,40,0.95238095238095233,"",39,0.9285714285714286,1,41,0.97619047619047616,"",38,0.90476190476190477]
[{"$f":"VLOOKUP(C23,'Control Panel'!$G$132:$K$171,5,FALSE)","v":"WF-1"},{"$f":"VLOOKUP(C23,'Control Panel'!$A$85:$F$124,2,FALSE)","v":"Dr Shantir Practice"},"F86626",7021,23,21,0.91304347826086951,1,22,0.95652173913043481,"",22,0.95652173913043481,"",20,0.86956521739130432]
[{"$f":"VLOOKUP(C24,'Control Panel'!$G$132:$K$171,5,FALSE)","v":"WF-1"},{"$f":"VLOOKUP(C24,'Control Panel'!$A$85:$F$124,2,FALSE)","v":"Lime Tree & Sinnott Healthcare Ltd"},"Y01839",6236,19,17,{"$f":"IF(OR(ISTEXT($E24),$E24=0),\"N/A\",F24/$E24)","v":0.89473684210526316},2,17,{"$f":"IF(OR(ISTEXT($E24),$E24=0),\"N/A\",I24/$E24)","v":0.89473684210526316},2,18,{"$f":"IF(OR(ISTEXT($E24),$E24=0),\"N/A\",L24/$E24)","v":0.94736842105263153},1,17,{"$f":"IF(OR(ISTEXT($E24),$E24=0),\"N/A\",O24/$E24)","v":0.89473684210526316}]
[{"$f":"VLOOKUP(C25,'Control Panel'!$G$132:$K$171,5,FALSE)","v":"WF-1"},{"$f":"VLOOKUP(C25,'Control Panel'!$A$85:$F$124,2,FALSE)","v":"The Bailey Practice"},"F86689",4395,33,28,0.84848484848484851,4,28,0.84848484848484851,4,28,0.84848484848484851,4,27,0.81818181818181823]
[{"$f":"VLOOKUP(C26,'Control Panel'!$G$132:$K$171,5,FALSE)","v":"WF-1"},{"$f":"VLOOKUP(C26,'Control Panel'!$A$85:$F$124,2,FALSE)","v":"Forest Surgery*"},"F86026",7223,11,9,{"$f":"IF(OR(ISTEXT($E26),$E26=0),\"N/A\",F26/$E26)","v":0.81818181818181823},2,9,{"$f":"IF(OR(ISTEXT($E26),$E26=0),\"N/A\",I26/$E26)","v":0.81818181818181823},2,9,{"$f":"IF(OR(ISTEXT($E26),$E26=0),\"N/A\",L26/$E26)","v":0.81818181818181823},2,8,{"$f":"IF(OR(ISTEXT($E26),$E26=0),\"N/A\",O26/$E26)","v":0.72727272727272729}]
[{"$f":"VLOOKUP(C27,'Control Panel'!$G$132:$K$171,5,FALSE)","v":"WF-2"},{"$f":"VLOOKUP(C27,'Control Panel'!$A$85:$F$124,2,FALSE)","v":"Handsworth Medical Centre*"},"F86004",15970,51,47,0.92156862745098034,2,46,0.90196078431372551,3,46,0.90196078431372551,3,46,0.90196078431372551]
[{"$f":"VLOOKUP(C28,'Control Panel'!$G$132:$K$171,5,FALSE)","v":"WF-2"},{"$f":"VLOOKUP(C28,'Control Panel'!$A$85:$F$124,2,FALSE)","v":"Chingford Medical Practice"},"Y01291",9173,26,26,1,"",26,1,"",26,1,"",24,0.92307692307692313]
[{"$f":"VLOOKUP(C29,'Control Panel'!$G$132:$K$171,5,FALSE)","v":"WF-2"},{"$f":"VLOOKUP(C29,'Control Panel'!$A$85:$F$124,2,FALSE)","v":"Churchill Medical Centre"},"F86627",13283,24,24,1,"",24,1,"",24,1,"",21,0.875]
[{"$f":"VLOOKUP(C30,'Control Panel'!$G$132:$K$171,5,FALSE)","v":"WF-2"},{"$f":"VLOOKUP(C30,'Control Panel'!$A$85:$F$124,2,FALSE)","v":"The Ridgeway Surgery"},"F86078",6869,12,11,0.91666666666666663,1,12,1,"",12,1,"",11,0.91666666666666663]
[{"$f":"VLOOKUP(C31,'Control Panel'!$G$132:$K$171,5,FALSE)","v":"WF-2"},{"$f":"VLOOKUP(C31,'Control Panel'!$A$85:$F$124,2,FALSE)","v":"Old Church Surgery"},"F86616",7996,36,36,1,"",36,1,"",36,1,"",33,0.91666666666666663]
[{"$f":"VLOOKUP(C32,'Control Panel'!$G$132:$K$171,5,FALSE)","v":"WF-3"},{"$f":"VLOOKUP(C32,'Control Panel'!$A$85:$F$124,2,FALSE)","v":"The Manor Practice"},"F86011",9698,21,18,0.8571428571428571,2,18,0.8571428571428571,2,19,0.90476190476190477,1,18,0.8571428571428571]
[{"$f":"VLOOKUP(C33,'Control Panel'!$G$132:$K$171,5,FALSE)","v":"WF-3"},{"$f":"VLOOKUP(C33,'Control Panel'!$A$85:$F$124,2,FALSE)","v":"Sma Medical Centre"},"F86038",11105,28,23,0.8214285714285714,4,23,0.8214285714285714,4,25,0.8928571428571429,2,24,0.8571428571428571]
[{"$f":"VLOOKUP(C34,'Control Panel'!$G$132:$K$171,5,FALSE)","v":"WF-3"},{"$f":"VLOOKUP(C34,'Control Panel'!$A$85:$F$124,2,FALSE)","v":"Leyton Healthcare (Oliver Road)*"},"F86074",15092,39,37,0.94871794871794868,1,34,0.87179487179487181,4,34,0.87179487179487181,4,25,0.64102564102564108]
[{"$f":"VLOOKUP(C35,'Control Panel'!$G$132:$K$171,5,FALSE)","v":"WF-4"},{"$f":"VLOOKUP(C35,'Control Panel'!$A$85:$F$124,2,FALSE)","v":"The Allum Medical Centre"},"F86036",14732,42,40,0.95238095238095233,"",40,0.95238095238095233,"",40,0.95238095238095233,"",40,0.95238095238095233]
[{"$f":"VLOOKUP(C36,'Control Panel'!$G$132:$K$171,5,FALSE)","v":"WF-4"},{"$f":"VLOOKUP(C36,'Control Panel'!$A$85:$F$124,2,FALSE)","v":" Crawley Road Medical Centre"},"F86044",10802,35,30,0.8571428571428571,4,30,0.8571428571428571,4,32,0.91428571428571426,2,30,0.8571428571428571]
[{"$f":"VLOOKUP(C37,'Control Panel'!$G$132:$K$171,5,FALSE)","v":"WF-4"},{"$f":"VLOOKUP(C37,'Control Panel'!$A$85:$F$124,2,FALSE)","v":"Francis Road Medical Centre"},"F86696",6883,32,23,0.71875,8,22,0.6875,9,26,0.8125,5,23,0.71875]
[{"$f":"VLOOKUP(C38,'Control Panel'!$G$132:$K$171,5,FALSE)","v":"WF-4"},{"$f":"VLOOKUP(C38,'Control Panel'!$A$85:$F$124,2,FALSE)","v":"Hampton Medical Centre"},"F86712",3395,10,10,1,"",9,0.9,1,10,1,"",10,1]
[{"$f":"VLOOKUP(C39,'Control Panel'!$G$132:$K$171,5,FALSE)","v":"WF-4"},{"$f":"VLOOKUP(C39,'Control Panel'!$A$85:$F$124,2,FALSE)","v":"Lime Tree Surgery"},"F86650",8080,23,18,0.78260869565217395,4,18,0.78260869565217395,4,19,0.82608695652173914,3,16,0.69565217391304346]
[{"$f":"VLOOKUP(C40,'Control Panel'!$G$132:$K$171,5,FALSE)","v":"WF-4"},{"$f":"VLOOKUP(C40,'Control Panel'!$A$85:$F$124,2,FALSE)","v":"The Lyndhurst Surgery"},"F86088",5027,16,15,0.9375,1,15,0.9375,1,15,0.9375,1,14,0.875]
[{"$f":"VLOOKUP(C41,'Control Panel'!$G$132:$K$171,5,FALSE)","v":"WF-4"},{"$f":"VLOOKUP(C41,'Control Panel'!$A$85:$F$124,2,FALSE)","v":"The Ecclesbourne Practice*"},"F86018",9966,17,17,1,"",16,0.94117647058823528,1,16,0.94117647058823528,1,0,0]
[{"$f":"VLOOKUP(C42,'Control Panel'!$G$132:$K$171,5,FALSE)","v":"WF-5"},{"$f":"VLOOKUP(C42,'Control Panel'!$A$85:$F$124,2,FALSE)","v":"Green Man Medical Centre"},"F86621",6445,12,9,0.75,3,8,0.66666666666666663,4,10,0.83333333333333337,2,10,0.83333333333333337]
[{"$f":"VLOOKUP(C43,'Control Panel'!$G$132:$K$171,5,FALSE)","v":"WF-5"},{"$f":"VLOOKUP(C43,'Control Panel'!$A$85:$F$124,2,FALSE)","v":"High Road Surgery"},"F86045",2026,4,4,1,"",4,1,"",4,1,"",4,1]
[{"$f":"VLOOKUP(C44,'Control Panel'!$G$132:$K$171,5,FALSE)","v":"WF-5"},{"$f":"VLOOKUP(C44,'Control Panel'!$A$85:$F$124,2,FALSE)","v":"Kiyani Medical Practice"},"F86701",3853,10,7,0.7,3,7,0.7,3,7,0.7,3,8,0.8]
[{"$f":"VLOOKUP(C45,'Control Panel'!$G$132:$K$171,5,FALSE)","v":"WF-5"},{"$f":"VLOOKUP(C45,'Control Panel'!$A$85:$F$124,2,FALSE)","v":"LL Medical Care (Agarwal & Agrwal Practice)"},"F86625",5882,6,5,0.83333333333333337,1,5,0.83333333333333337,1,5,0.83333333333333337,1,4,0.66666666666666663]
[{"$f":"VLOOKUP(C46,'Control Panel'!$G$132:$K$171,5,FALSE)","v":"WF-5"},{"$f":"VLOOKUP(C46,'Control Panel'!$A$85:$F$124,2,FALSE)","v":"The Harrow Road Surgery"},"F86666",14983,41,39,0.95121951219512191,"",39,0.95121951219512191,"",40,0.97560975609756095,"",38,0.92682926829268297]
[{"$f":"VLOOKUP(C47,'Control Panel'!$G$132:$K$171,5,FALSE)","v":"WF-5"},{"$f":"VLOOKUP(C47,'Control Panel'!$A$85:$F$124,2,FALSE)","v":"The Langthorne Sharma Family Practice"},"F86705",3512,14,13,0.9285714285714286,1,13,0.9285714285714286,1,14,1,"",14,1]
[{"$f":"VLOOKUP(C48,'Control Panel'!$G$132:$K$171,5,FALSE)","v":"WF-6"},{"$f":"VLOOKUP(C48,'Control Panel'!$A$85:$F$124,2,FALSE)","v":"Addison Road Medical Practice"},"F86607",15547,57,56,0.98245614035087714,"",57,1,"",57,1,"",54,0.94736842105263153]
[{"$f":"VLOOKUP(C49,'Control Panel'!$G$132:$K$171,5,FALSE)","v":"WF-6"},{"$f":"VLOOKUP(C49,'Control Panel'!$A$85:$F$124,2,FALSE)","v":"Claremont Medical Centre"},"F86708",2782,6,5,0.83333333333333337,1,5,0.83333333333333337,1,5,0.83333333333333337,1,5,0.83333333333333337]
[{"$f":"VLOOKUP(C50,'Control Panel'!$G$132:$K$171,5,FALSE)","v":"WF-6"},{"$f":"VLOOKUP(C50,'Control Panel'!$A$85:$F$124,2,FALSE)","v":" The Firs"},"F86001",7729,15,10,0.66666666666666663,5,9,0.6,6,11,0.73333333333333328,4,12,0.8]
[{"$f":"VLOOKUP(C51,'Control Panel'!$G$132:$K$171,5,FALSE)","v":"WF-6"},{"$f":"VLOOKUP(C51,'Control Panel'!$A$85:$F$124,2,FALSE)","v":"Dr Dhital Practice"},"F86086",6265,22,19,0.86363636363636365,2,19,0.86363636363636365,2,22,1,"",19,0.86363636363636365]
[{"$f":"VLOOKUP(C52,'Control Panel'!$G$132:$K$171,5,FALSE)","v":"WF-6"},{"$f":"VLOOKUP(C52,'Control Panel'!$A$85:$F$124,2,FALSE)","v":"Waltham Forest Community & Family Health Services Ltd"},"F86644",9254,19,19,1,"",19,1,"",19,1,"",18,0.94736842105263153]
[{"$f":"VLOOKUP(C53,'Control Panel'!$G$132:$K$171,5,FALSE)","v":"WF-7"},{"$f":"VLOOKUP(C53,'Control Panel'!$A$85:$F$124,2,FALSE)","v":"Seymour Medical centre "},"F86006",6825,19,15,0.78947368421052633,4,15,0.78947368421052633,4,15,0.78947368421052633,4,15,0.78947368421052633]
[{"$f":"VLOOKUP(C54,'Control Panel'!$G$132:$K$171,5,FALSE)","v":"WF-7"},{"$f":"VLOOKUP(C54,'Control Panel'!$A$85:$F$124,2,FALSE)","v":" Queens Road Medical Centre"},"F86030",8161,23,21,0.91304347826086951,1,21,0.91304347826086951,1,23,1,"",22,0.95652173913043481]
[{"$f":"VLOOKUP(C55,'Control Panel'!$G$132:$K$171,5,FALSE)","v":"WF-7"},{"$f":"VLOOKUP(C55,'Control Panel'!$A$85:$F$124,2,FALSE)","v":"The Grove Road Medical Centre "},"F86062",7155,24,20,0.83333333333333337,3,17,0.70833333333333337,6,20,0.83333333333333337,3,21,0.875]
[{"$f":"VLOOKUP(C56,'Control Panel'!$G$132:$K$171,5,FALSE)","v":"WF-7"},{"$f":"VLOOKUP(C56,'Control Panel'!$A$85:$F$124,2,FALSE)","v":"Higham Hill Medical Centre"},"F86679",6372,29,26,0.89655172413793105,2,26,0.89655172413793105,2,26,0.89655172413793105,2,26,0.89655172413793105]
[{"$f":"VLOOKUP(C57,'Control Panel'!$G$132:$K$171,5,FALSE)","v":"WF-7"},{"$f":"VLOOKUP(C57,'Control Panel'!$A$85:$F$124,2,FALSE)","v":"St James Medical Practice Ltd"},"F86058",16561,61,51,0.83606557377049184,7,50,0.81967213114754101,8,53,0.86885245901639341,5,51,0.83606557377049184]

{"sheet":"Patients becoming 24m","index":3,"n_rows":57,"n_cols":18,"rows_kept":57,"cut":false,"hidden":false,"merged":[[15,0,16,2]]}
[]
[null,null,null,"Waltham Forest Childhood Immunisations Dashboard: Metric Details"]
[null,{"$f":"VLOOKUP(C5,'Control Panel'!Y49:Z60,2,FALSE)","v":{"$error":"#N/A"}},null,"Patients becoming 24m",null,{"$f":"E15","v":981}]
[null,"2020-02-01"]
[null,null,"March 2022","All Patients","(02) 24 MONTH COHORT","(02.01) DTaP/IPV/Hib or DTaP/IPV/Hib/HepB","DTaP/IPV/Hib(%)","(02.02) MMR","MMR(%)","Patients required to achieve NHSE Target (90%)","(02.03) HiB/Men C","HiB/Men C (%)","Patients required to achieve NHSE Target (90%)","(02.04) PCV (Booster)","PCV (Booster)(%)","Patients required to achieve NHSE Target (90%)","(02.05) Men B (Booster)","Men B (Booster)(%)"]
[null,"Home",null,"Listsize ","Patients becoming 24m","DTaP/IPV/Hib/HepB","DTaP/IPV/Hib/HepB(%)","MMR","MMR(%)","Patients required to achieve CCG Target (95%)","HiB/Men C","HiB/Men C (%)","Patients required to achieve CCG Target (95%)","PCV (Booster)","PCV (Booster)(%)","Patients required to achieve CCG Target (95%)","Men B (Booster)","Men B (Booster)(%)"]
["Cluster"]
["WF-1","Chingford/ Walthamstow",null,{"$f":"SUM(IF($A8=$A$19:$A$57,D$19:D$57))","v":51956},{"$f":"SUM(IF($A8=$A$19:$A$57,E$19:E$57))","v":200},{"$f":"SUM(IF($A8=$A$19:$A$57,F$19:F$57))","v":178},{"$f":"IF(OR(ISTEXT($E8),$E8=0),\"N/A\",F8/$E8)","v":0.89},{"$f":"SUM(IF($A8=$A$19:$A$57,H$19:H$57))","v":152},{"$f":"IF(OR(ISTEXT($E8),$E8=0),\"N/A\",H8/$E8)","v":0.76},null,{"$f":"SUM(IF($A8=$A$19:$A$57,K$19:K$57))","v":177},{"$f":"IF(OR(ISTEXT($E8),$E8=0),\"N/A\",K8/$E8)","v":0.88500000000000001},null,{"$f":"SUM(IF($A8=$A$19:$A$57,N$19:N$57))","v":178},{"$f":"IF(OR(ISTEXT($E8),$E8=0),\"N/A\",N8/$E8)","v":0.89},null,{"$f":"SUM(IF($A8=$A$19:$A$57,Q$19:Q$57))","v":178},{"$f":"IF(OR(ISTEXT($E8),$E8=0),\"N/A\",Q8/$E8)","v":0.89}]
["WF-2","Chingford E4",null,{"$f":"SUM(IF($A9=$A$19:$A$57,D$19:D$57))","v":53291},{"$f":"SUM(IF($A9=$A$19:$A$57,E$19:E$57))","v":152},{"$f":"SUM(IF($A9=$A$19:$A$57,F$19:F$57))","v":141},{"$f":"IF(OR(ISTEXT($E9),$E9=0),\"N/A\",F9/$E9)","v":0.92763157894736847},{"$f":"SUM(IF($A9=$A$19:$A$57,H$19:H$57))","v":109},{"$f":"IF(OR(ISTEXT($E9),$E9=0),\"N/A\",H9/$E9)","v":0.71710526315789469},null,{"$f":"SUM(IF($A9=$A$19:$A$57,K$19:K$57))","v":136},{"$f":"IF(OR(ISTEXT($E9),$E9=0),\"N/A\",K9/$E9)","v":0.89473684210526316},null,{"$f":"SUM(IF($A9=$A$19:$A$57,N$19:N$57))","v":135},{"$f":"IF(OR(ISTEXT($E9),$E9=0),\"N/A\",N9/$E9)","v":0.88815789473684215},null,{"$f":"SUM(IF($A9=$A$19:$A$57,Q$19:Q$57))","v":135},{"$f":"IF(OR(ISTEXT($E9),$E9=0),\"N/A\",Q9/$E9)","v":0.88815789473684215}]
["WF-3","Leyton Collaborative",null,{"$f":"SUM(IF($A10=$A$19:$A$57,D$19:D$57))","v":35895},{"$f":"SUM(IF($A10=$A$19:$A$57,E$19:E$57))","v":102},{"$f":"SUM(IF($A10=$A$19:$A$57,F$19:F$57))","v":88},0.86274509803921573,{"$f":"SUM(IF($A10=$A$19:$A$57,H$19:H$57))","v":60},0.58823529411764708,null,{"$f":"SUM(IF($A10=$A$19:$A$57,K$19:K$57))","v":75},0.73529411764705888,null,{"$f":"SUM(IF($A10=$A$19:$A$57,N$19:N$57))","v":87},0.8529411764705882,null,{"$f":"SUM(IF($A10=$A$19:$A$57,Q$19:Q$57))","v":85},0.83333333333333337]
["WF-4","Forest Integrated Health",null,{"$f":"SUM(IF($A11=$A$19:$A$57,D$19:D$57))","v":58885},{"$f":"SUM(IF($A11=$A$19:$A$57,E$19:E$57))","v":159},{"$f":"SUM(IF($A11=$A$19:$A$57,F$19:F$57))","v":140},0.88050314465408808,{"$f":"SUM(IF($A11=$A$19:$A$57,H$19:H$57))","v":113},0.71069182389937102,null,{"$f":"SUM(IF($A11=$A$19:$A$57,K$19:K$57))","v":136},0.85534591194968557,null,{"$f":"SUM(IF($A11=$A$19:$A$57,N$19:N$57))","v":137},0.86163522012578619,null,{"$f":"SUM(IF($A11=$A$19:$A$57,Q$19:Q$57))","v":136},0.85534591194968557]
["WF-5","South Leytonstone",null,{"$f":"SUM(IF($A12=$A$19:$A$57,D$19:D$57))","v":36701},{"$f":"SUM(IF($A12=$A$19:$A$57,E$19:E$57))","v":100},{"$f":"SUM(IF($A12=$A$19:$A$57,F$19:F$57))","v":89},0.89,{"$f":"SUM(IF($A12=$A$19:$A$57,H$19:H$57))","v":84},0.84,null,{"$f":"SUM(IF($A12=$A$19:$A$57,K$19:K$57))","v":84},0.84,null,{"$f":"SUM(IF($A12=$A$19:$A$57,N$19:N$57))","v":86},0.86,null,{"$f":"SUM(IF($A12=$A$19:$A$57,Q$19:Q$57))","v":85},0.85]
["WF-6","Central Walthamstow",null,{"$f":"SUM(IF($A13=$A$19:$A$57,D$19:D$57))","v":41577},{"$f":"SUM(IF($A13=$A$19:$A$57,E$19:E$57))","v":123},{"$f":"SUM(IF($A13=$A$19:$A$57,F$19:F$57))","v":111},0.90243902439024393,{"$f":"SUM(IF($A13=$A$19:$A$57,H$19:H$57))","v":100},0.81300813008130079,null,{"$f":"SUM(IF($A13=$A$19:$A$57,K$19:K$57))","v":102},0.82926829268292679,null,{"$f":"SUM(IF($A13=$A$19:$A$57,N$19:N$57))","v":102},0.82926829268292679,null,{"$f":"SUM(IF($A13=$A$19:$A$57,Q$19:Q$57))","v":103},0.83739837398373984]
["WF-7","Walthamstow West",null,{"$f":"SUM(IF($A14=$A$19:$A$57,D$19:D$57))","v":45074},{"$f":"SUM(IF($A14=$A$19:$A$57,E$19:E$57))","v":145},{"$f":"SUM(IF($A14=$A$19:$A$57,F$19:F$57))","v":125},0.86206896551724133,{"$f":"SUM(IF($A14=$A$19:$A$57,H$19:H$57))","v":118},0.81379310344827582,null,{"$f":"SUM(IF($A14=$A$19:$A$57,K$19:K$57))","v":118},0.81379310344827582,null,{"$f":"SUM(IF($A14=$A$19:$A$57,N$19:N$57))","v":118},0.81379310344827582,null,{"$f":"SUM(IF($A14=$A$19:$A$57,Q$19:Q$57))","v":118},0.81379310344827582]
["Total",null,null,{"$f":"SUM(D8:D14)","v":323379},{"$f":"SUM(E8:E14)","v":981},{"$f":"SUM(F8:F14)","v":872},0.88888888888888884,{"$f":"SUM(H8:H14)","v":736},0.75025484199796122,null,{"$f":"SUM(K8:K14)","v":828},0.84403669724770647,null,{"$f":"SUM(N8:N14)","v":843},0.85932721712538229,null,{"$f":"SUM(Q8:Q14)","v":840},0.85626911314984711]
["Minimum and Maximum %",null,null,null,null,"Min","Max","Min","Max",null,"Min","Max",null,"Min","Max",null,"Min","Max"]
[null,null,null,null,null,{"$f":"SMALL(G19:G51,COUNTIF(G19:G51,0)+1)","v":0.72222222222222221},{"$f":"MAX(G19:G51)","v":1},{"$f":"SMALL(I19:I51,COUNTIF(I19:I51,0)+1)","v":4.7619047619047616E-2},{"$f":"MAX(I19:I51)","v":1},null,{"$f":"SMALL(L19:L51,COUNTIF(L19:L51,0)+1)","v":0.61538461538461542},{"$f":"MAX(L19:L51)","v":1},null,{"$f":"SMALL(O19:O51,COUNTIF(O19:O51,0)+1)","v":0.72222222222222221},{"$f":"MAX(O19:O51)","v":1},null,{"$f":"SMALL(R19:R51,COUNTIF(R19:R51,0)+1)","v":0.75},{"$f":"MAX(R19:R51)","v":1}]
["Practices","* SystmOne Practices - No Data"]
[{"$f":"VLOOKUP(C19,'Control Panel'!$G$132:$K$171,5,FALSE)","v":"WF-1"},{"$f":"VLOOKUP(C19,'Control Panel'!$A$85:$F$124,2,FALSE)","v":"Kings Head Medical Practice"},"F86700",{"$f":"SUMIFS(OFFSET(REL_D,,MATCH($D$5,IND,0)-1),REL_D,$C$5,OrgID,$C19)","v":3901},{"$f":"SUMIFS(OFFSET(REL_D,,MATCH($E$5,IND,0)-1),REL_D,$C$5,OrgID,$C19)","v":12},{"$f":"SUMIFS(OFFSET(REL_D,,MATCH($F$5,IND,0)-1),REL_D,$C$5,OrgID,$C19)","v":10},{"$f":"IF(OR(ISTEXT($E19),$E19=0),\"N/A\",F19/$E19)","v":0.83333333333333337},{"$f":"SUMIFS(OFFSET(REL_D,,MATCH($H$5,IND,0)-1),REL_D,$C$5,OrgID,$C19)","v":9},{"$f":"IF(OR(ISTEXT($E19),$E19=0),\"N/A\",H19/$E19)","v":0.75},{"$f":"IFERROR(ROUNDUP(IF($E19*0.95-H19>=0,$E19*0.95-H19,\"\"),0),\"\")","v":3},{"$f":"SUMIFS(OFFSET(REL_D,,MATCH($K$5,IND,0)-1),REL_D,$C$5,OrgID,$C19)","v":9},{"$f":"IF(OR(ISTEXT($E19),$E19=0),\"N/A\",K19/$E19)","v":0.75},{"$f":"IFERROR(ROUNDUP(IF($E19*0.95-K19>=0,$E19*0.95-K19,\"\"),0),\"\")","v":3},{"$f":"SUMIFS(OFFSET(REL_D,,MATCH($N$5,IND,0)-1),REL_D,$C$5,OrgID,$C19)","v":9},{"$f":"IF(OR(ISTEXT($E19),$E19=0),\"N/A\",N19/$E19)","v":0.75},{"$f":"IFERROR(ROUNDUP(IF($E19*0.95-N19>=0,$E19*0.95-N19,\"\"),0),\"\")","v":3},{"$f":"SUMIFS(OFFSET(REL_D,,MATCH($Q$5,IND,0)-1),REL_D,$C$5,OrgID,$C19)","v":9},{"$f":"IF(OR(ISTEXT($E19),$E19=0),\"N/A\",Q19/$E19)","v":0.75}]
[{"$f":"VLOOKUP(C20,'Control Panel'!$G$132:$K$171,5,FALSE)","v":"WF-1"},{"$f":"VLOOKUP(C20,'Control Panel'!$A$85:$F$124,2,FALSE)","v":"Larkshall Medical Centre"},"F86664",8471,34,32,{"$f":"IF(OR(ISTEXT($E20),$E20=0),\"N/A\",F20/$E20)","v":0.94117647058823528},31,{"$f":"IF(OR(ISTEXT($E20),$E20=0),\"N/A\",H20/$E20)","v":0.91176470588235292},{"$f":"IFERROR(ROUNDUP(IF($E20*0.95-H20>=0,$E20*0.95-H20,\"\"),0),\"\")","v":2},31,{"$f":"IF(OR(ISTEXT($E20),$E20=0),\"N/A\",K20/$E20)","v":0.91176470588235292},{"$f":"IFERROR(ROUNDUP(IF($E20*0.95-K20>=0,$E20*0.95-K20,\"\"),0),\"\")","v":2},{"$f":"SUMIFS(OFFSET(REL_D,,MATCH($N$5,IND,0)-1),REL_D,$C$5,OrgID,$C20)","v":31},{"$f":"IF(OR(ISTEXT($E20),$E20=0),\"N/A\",N20/$E20)","v":0.91176470588235292},{"$f":"IFERROR(ROUNDUP(IF($E20*0.95-N20>=0,$E20*0.95-N20,\"\"),0),\"\")","v":2},31,{"$f":"IF(OR(ISTEXT($E20),$E20=0),\"N/A\",Q20/$E20)","v":0.91176470588235292}]
[{"$f":"VLOOKUP(C21,'Control Panel'!$G$132:$K$171,5,FALSE)","v":"WF-1"},{"$f":"VLOOKUP(C21,'Control Panel'!$A$85:$F$124,2,FALSE)","v":"The Microfaculty*"},"F86638",5199,18,13,0.72222222222222221,1,5.5555555555555552E-2,17,12,0.66666666666666663,6,{"$f":"SUMIFS(OFFSET(REL_D,,MATCH($N$5,IND,0)-1),REL_D,$C$5,OrgID,$C21)","v":13},0.72222222222222221,5,14,0.77777777777777779]
[{"$f":"VLOOKUP(C22,'Control Panel'!$G$132:$K$171,5,FALSE)","v":"WF-1"},{"$f":"VLOOKUP(C22,'Control Panel'!$A$85:$F$124,2,FALSE)","v":" The Penryhn Surgery"},"F86005",9510,51,49,0.96078431372549022,49,0.96078431372549022,"",49,0.96078431372549022,"",{"$f":"SUMIFS(OFFSET(REL_D,,MATCH($N$5,IND,0)-1),REL_D,$C$5,OrgID,$C22)","v":48},0.94117647058823528,1,48,0.94117647058823528]
[{"$f":"VLOOKUP(C23,'Control Panel'!$G$132:$K$171,5,FALSE)","v":"WF-1"},{"$f":"VLOOKUP(C23,'Control Panel'!$A$85:$F$124,2,FALSE)","v":"Dr Shantir Practice"},"F86626",7021,23,20,0.86956521739130432,21,0.91304347826086951,1,19,0.82608695652173914,3,{"$f":"SUMIFS(OFFSET(REL_D,,MATCH($N$5,IND,0)-1),REL_D,$C$5,OrgID,$C23)","v":19},0.82608695652173914,3,20,0.86956521739130432]
[{"$f":"VLOOKUP(C24,'Control Panel'!$G$132:$K$171,5,FALSE)","v":"WF-1"},{"$f":"VLOOKUP(C24,'Control Panel'!$A$85:$F$124,2,FALSE)","v":"Lime Tree & Sinnott Healthcare Ltd"},"Y01839",6236,17,15,0.88235294117647056,16,0.94117647058823528,1,16,0.94117647058823528,1,{"$f":"SUMIFS(OFFSET(REL_D,,MATCH($N$5,IND,0)-1),REL_D,$C$5,OrgID,$C24)","v":16},0.94117647058823528,1,16,0.94117647058823528]
[{"$f":"VLOOKUP(C25,'Control Panel'!$G$132:$K$171,5,FALSE)","v":"WF-1"},{"$f":"VLOOKUP(C25,'Control Panel'!$A$85:$F$124,2,FALSE)","v":"The Bailey Practice"},"F86689",4395,24,22,0.91666666666666663,24,1,"",24,1,"",{"$f":"SUMIFS(OFFSET(REL_D,,MATCH($N$5,IND,0)-1),REL_D,$C$5,OrgID,$C25)","v":24},1,"",23,0.95833333333333337]
[{"$f":"VLOOKUP(C26,'Control Panel'!$G$132:$K$171,5,FALSE)","v":"WF-1"},{"$f":"VLOOKUP(C26,'Control Panel'!$A$85:$F$124,2,FALSE)","v":"Forest Surgery*"},"F86026",7223,21,17,0.80952380952380953,1,4.7619047619047616E-2,19,17,0.80952380952380953,3,{"$f":"SUMIFS(OFFSET(REL_D,,MATCH($N$5,IND,0)-1),REL_D,$C$5,OrgID,$C26)","v":18},0.8571428571428571,2,17,0.80952380952380953]
[{"$f":"VLOOKUP(C27,'Control Panel'!$G$132:$K$171,5,FALSE)","v":"WF-2"},{"$f":"VLOOKUP(C27,'Control Panel'!$A$85:$F$124,2,FALSE)","v":"Handsworth Medical Centre*"},"F86004",15970,53,50,0.94339622641509435,27,0.50943396226415094,24,53,1,"",{"$f":"SUMIFS(OFFSET(REL_D,,MATCH($N$5,IND,0)-1),REL_D,$C$5,OrgID,$C27)","v":53},1,"",52,0.98113207547169812]
[{"$f":"VLOOKUP(C28,'Control Panel'!$G$132:$K$171,5,FALSE)","v":"WF-2"},{"$f":"VLOOKUP(C28,'Control Panel'!$A$85:$F$124,2,FALSE)","v":"Chingford Medical Practice"},"Y01291",9173,25,23,0.92,22,0.88,2,22,0.88,2,{"$f":"SUMIFS(OFFSET(REL_D,,MATCH($N$5,IND,0)-1),REL_D,$C$5,OrgID,$C28)","v":22},0.88,2,22,0.88]
[{"$f":"VLOOKUP(C29,'Control Panel'!$G$132:$K$171,5,FALSE)","v":"WF-2"},{"$f":"VLOOKUP(C29,'Control Panel'!$A$85:$F$124,2,FALSE)","v":"Churchill Medical Centre"},"F86627",13283,30,29,0.96666666666666667,25,0.83333333333333337,4,25,0.83333333333333337,4,{"$f":"SUMIFS(OFFSET(REL_D,,MATCH($N$5,IND,0)-1),REL_D,$C$5,OrgID,$C29)","v":24},0.8,5,25,0.83333333333333337]
[{"$f":"VLOOKUP(C30,'Control Panel'!$G$132:$K$171,5,FALSE)","v":"WF-2"},{"$f":"VLOOKUP(C30,'Control Panel'!$A$85:$F$124,2,FALSE)","v":"The Ridgeway Surgery"},"F86078",6869,9,9,1,9,1,"",9,1,"",{"$f":"SUMIFS(OFFSET(REL_D,,MATCH($N$5,IND,0)-1),REL_D,$C$5,OrgID,$C30)","v":9},1,"",9,1]
[{"$f":"VLOOKUP(C31,'Control Panel'!$G$132:$K$171,5,FALSE)","v":"WF-2"},{"$f":"VLOOKUP(C31,'Control Panel'!$A$85:$F$124,2,FALSE)","v":"Old Church Surgery"},"F86616",7996,35,30,0.8571428571428571,26,0.74285714285714288,8,27,0.77142857142857146,7,{"$f":"SUMIFS(OFFSET(REL_D,,MATCH($N$5,IND,0)-1),REL_D,$C$5,OrgID,$C31)","v":27},0.77142857142857146,7,27,0.77142857142857146]
[{"$f":"VLOOKUP(C32,'Control Panel'!$G$132:$K$171,5,FALSE)","v":"WF-3"},{"$f":"VLOOKUP(C32,'Control Panel'!$A$85:$F$124,2,FALSE)","v":"The Manor Practice"},"F86011",9698,22,21,0.95454545454545459,18,0.81818181818181823,3,18,0.81818181818181823,3,{"$f":"SUMIFS(OFFSET(REL_D,,MATCH($N$5,IND,0)-1),REL_D,$C$5,OrgID,$C32)","v":18},0.81818181818181823,3,18,0.81818181818181823]
[{"$f":"VLOOKUP(C33,'Control Panel'!$G$132:$K$171,5,FALSE)","v":"WF-3"},{"$f":"VLOOKUP(C33,'Control Panel'!$A$85:$F$124,2,FALSE)","v":"Sma Medical Centre"},"F86038",11105,28,25,0.8928571428571429,25,0.8928571428571429,2,25,0.8928571428571429,2,{"$f":"SUMIFS(OFFSET(REL_D,,MATCH($N$5,IND,0)-1),REL_D,$C$5,OrgID,$C33)","v":26},0.9285714285714286,1,24,0.8571428571428571]
[{"$f":"VLOOKUP(C34,'Control Panel'!$G$132:$K$171,5,FALSE)","v":"WF-3"},{"$f":"VLOOKUP(C34,'Control Panel'!$A$85:$F$124,2,FALSE)","v":"Leyton Healthcare (Oliver Road)*"},"F86074",15092,52,42,0.80769230769230771,17,0.32692307692307693,33,32,0.61538461538461542,18,{"$f":"SUMIFS(OFFSET(REL_D,,MATCH($N$5,IND,0)-1),REL_D,$C$5,OrgID,$C34)","v":43},0.82692307692307687,7,43,0.82692307692307687]
[{"$f":"VLOOKUP(C35,'Control Panel'!$G$132:$K$171,5,FALSE)","v":"WF-4"},{"$f":"VLOOKUP(C35,'Control Panel'!$A$85:$F$124,2,FALSE)","v":"The Allum Medical Centre"},"F86036",14732,32,30,0.9375,30,0.9375,1,30,0.9375,1,{"$f":"SUMIFS(OFFSET(REL_D,,MATCH($N$5,IND,0)-1),REL_D,$C$5,OrgID,$C35)","v":30},0.9375,1,30,0.9375]
[{"$f":"VLOOKUP(C36,'Control Panel'!$G$132:$K$171,5,FALSE)","v":"WF-4"},{"$f":"VLOOKUP(C36,'Control Panel'!$A$85:$F$124,2,FALSE)","v":" Crawley Road Medical Centre"},"F86044",10802,39,33,0.84615384615384615,33,0.84615384615384615,5,33,0.84615384615384615,5,{"$f":"SUMIFS(OFFSET(REL_D,,MATCH($N$5,IND,0)-1),REL_D,$C$5,OrgID,$C36)","v":33},0.84615384615384615,5,32,0.82051282051282048]
[{"$f":"VLOOKUP(C37,'Control Panel'!$G$132:$K$171,5,FALSE)","v":"WF-4"},{"$f":"VLOOKUP(C37,'Control Panel'!$A$85:$F$124,2,FALSE)","v":"Francis Road Medical Centre"},"F86696",6883,21,19,0.90476190476190477,17,0.80952380952380953,3,17,0.80952380952380953,3,{"$f":"SUMIFS(OFFSET(REL_D,,MATCH($N$5,IND,0)-1),REL_D,$C$5,OrgID,$C37)","v":17},0.80952380952380953,3,17,0.80952380952380953]
[{"$f":"VLOOKUP(C38,'Control Panel'!$G$132:$K$171,5,FALSE)","v":"WF-4"},{"$f":"VLOOKUP(C38,'Control Panel'!$A$85:$F$124,2,FALSE)","v":"Hampton Medical Centre"},"F86712",3395,7,6,0.8571428571428571,6,0.8571428571428571,1,6,0.8571428571428571,1,{"$f":"SUMIFS(OFFSET(REL_D,,MATCH($N$5,IND,0)-1),REL_D,$C$5,OrgID,$C38)","v":6},0.8571428571428571,1,6,0.8571428571428571]
[{"$f":"VLOOKUP(C39,'Control Panel'!$G$132:$K$171,5,FALSE)","v":"WF-4"},{"$f":"VLOOKUP(C39,'Control Panel'!$A$85:$F$124,2,FALSE)","v":"Lime Tree Surgery"},"F86650",8080,20,17,0.85,16,0.8,3,16,0.8,3,{"$f":"SUMIFS(OFFSET(REL_D,,MATCH($N$5,IND,0)-1),REL_D,$C$5,OrgID,$C39)","v":16},0.8,3,16,0.8]
[{"$f":"VLOOKUP(C40,'Control Panel'!$G$132:$K$171,5,FALSE)","v":"WF-4"},{"$f":"VLOOKUP(C40,'Control Panel'!$A$85:$F$124,2,FALSE)","v":"The Lyndhurst Surgery"},"F86088",5027,10,8,0.8,9,0.9,1,9,0.9,1,{"$f":"SUMIFS(OFFSET(REL_D,,MATCH($N$5,IND,0)-1),REL_D,$C$5,OrgID,$C40)","v":9},0.9,1,9,0.9]
[{"$f":"VLOOKUP(C41,'Control Panel'!$G$132:$K$171,5,FALSE)","v":"WF-4"},{"$f":"VLOOKUP(C41,'Control Panel'!$A$85:$F$124,2,FALSE)","v":"The Ecclesbourne Practice*"},"F86018",9966,30,27,0.9,2,6.6666666666666666E-2,27,25,0.83333333333333337,4,{"$f":"SUMIFS(OFFSET(REL_D,,MATCH($N$5,IND,0)-1),REL_D,$C$5,OrgID,$C41)","v":26},0.8666666666666667,3,26,0.8666666666666667]
[{"$f":"VLOOKUP(C42,'Control Panel'!$G$132:$K$171,5,FALSE)","v":"WF-5"},{"$f":"VLOOKUP(C42,'Control Panel'!$A$85:$F$124,2,FALSE)","v":"Green Man Medical Centre"},"F86621",6445,24,22,0.91666666666666663,21,0.875,2,21,0.875,2,{"$f":"SUMIFS(OFFSET(REL_D,,MATCH($N$5,IND,0)-1),REL_D,$C$5,OrgID,$C42)","v":21},0.875,2,20,0.83333333333333337]
[{"$f":"VLOOKUP(C43,'Control Panel'!$G$132:$K$171,5,FALSE)","v":"WF-5"},{"$f":"VLOOKUP(C43,'Control Panel'!$A$85:$F$124,2,FALSE)","v":"High Road Surgery"},"F86045",2026,6,6,1,5,0.83333333333333337,1,5,0.83333333333333337,1,{"$f":"SUMIFS(OFFSET(REL_D,,MATCH($N$5,IND,0)-1),REL_D,$C$5,OrgID,$C43)","v":5},0.83333333333333337,1,5,0.83333333333333337]
[{"$f":"VLOOKUP(C44,'Control Panel'!$G$132:$K$171,5,FALSE)","v":"WF-5"},{"$f":"VLOOKUP(C44,'Control Panel'!$A$85:$F$124,2,FALSE)","v":"Kiyani Medical Practice"},"F86701",3853,11,9,0.81818181818181823,8,0.72727272727272729,3,8,0.72727272727272729,3,{"$f":"SUMIFS(OFFSET(REL_D,,MATCH($N$5,IND,0)-1),REL_D,$C$5,OrgID,$C44)","v":9},0.81818181818181823,2,9,0.81818181818181823]
[{"$f":"VLOOKUP(C45,'Control Panel'!$G$132:$K$171,5,FALSE)","v":"WF-5"},{"$f":"VLOOKUP(C45,'Control Panel'!$A$85:$F$124,2,FALSE)","v":"LL Medical Care (Agarwal & Agrwal Practice)"},"F86625",5882,10,8,0.8,8,0.8,2,8,0.8,2,{"$f":"SUMIFS(OFFSET(REL_D,,MATCH($N$5,IND,0)-1),REL_D,$C$5,OrgID,$C45)","v":8},0.8,2,8,0.8]
[{"$f":"VLOOKUP(C46,'Control Panel'!$G$132:$K$171,5,FALSE)","v":"WF-5"},{"$f":"VLOOKUP(C46,'Control Panel'!$A$85:$F$124,2,FALSE)","v":"The Harrow Road Surgery"},"F86666",14983,46,41,0.89130434782608692,39,0.84782608695652173,5,39,0.84782608695652173,5,{"$f":"SUMIFS(OFFSET(REL_D,,MATCH($N$5,IND,0)-1),REL_D,$C$5,OrgID,$C46)","v":40},0.86956521739130432,4,40,0.86956521739130432]
[{"$f":"VLOOKUP(C47,'Control Panel'!$G$132:$K$171,5,FALSE)","v":"WF-5"},{"$f":"VLOOKUP(C47,'Control Panel'!$A$85:$F$124,2,FALSE)","v":"The Langthorne Sharma Family Practice"},"F86705",3512,3,3,1,3,1,"",3,1,"",{"$f":"SUMIFS(OFFSET(REL_D,,MATCH($N$5,IND,0)-1),REL_D,$C$5,OrgID,$C47)","v":3},1,"",3,1]
[{"$f":"VLOOKUP(C48,'Control Panel'!$G$132:$K$171,5,FALSE)","v":"WF-6"},{"$f":"VLOOKUP(C48,'Control Panel'!$A$85:$F$124,2,FALSE)","v":"Addison Road Medical Practice"},"F86607",15547,48,44,0.91666666666666663,41,0.85416666666666663,5,41,0.85416666666666663,5,{"$f":"SUMIFS(OFFSET(REL_D,,MATCH($N$5,IND,0)-1),REL_D,$C$5,OrgID,$C48)","v":41},0.85416666666666663,5,41,0.85416666666666663]
[{"$f":"VLOOKUP(C49,'Control Panel'!$G$132:$K$171,5,FALSE)","v":"WF-6"},{"$f":"VLOOKUP(C49,'Control Panel'!$A$85:$F$124,2,FALSE)","v":"Claremont Medical Centre"},"F86708",2782,6,5,0.83333333333333337,5,0.83333333333333337,1,5,0.83333333333333337,1,{"$f":"SUMIFS(OFFSET(REL_D,,MATCH($N$5,IND,0)-1),REL_D,$C$5,OrgID,$C49)","v":5},0.83333333333333337,1,5,0.83333333333333337]
[{"$f":"VLOOKUP(C50,'Control Panel'!$G$132:$K$171,5,FALSE)","v":"WF-6"},{"$f":"VLOOKUP(C50,'Control Panel'!$A$85:$F$124,2,FALSE)","v":" The Firs"},"F86001",7729,20,18,0.9,15,0.75,4,15,0.75,4,{"$f":"SUMIFS(OFFSET(REL_D,,MATCH($N$5,IND,0)-1),REL_D,$C$5,OrgID,$C50)","v":15},0.75,4,16,0.8]
[{"$f":"VLOOKUP(C51,'Control Panel'!$G$132:$K$171,5,FALSE)","v":"WF-6"},{"$f":"VLOOKUP(C51,'Control Panel'!$A$85:$F$124,2,FALSE)","v":"Dr Dhital Practice"},"F86086",6265,28,24,0.8571428571428571,21,0.75,6,21,0.75,6,{"$f":"SUMIFS(OFFSET(REL_D,,MATCH($N$5,IND,0)-1),REL_D,$C$5,OrgID,$C51)","v":21},0.75,6,21,0.75]
[{"$f":"VLOOKUP(C52,'Control Panel'!$G$132:$K$171,5,FALSE)","v":"WF-6"},{"$f":"VLOOKUP(C52,'Control Panel'!$A$85:$F$124,2,FALSE)","v":"Waltham Forest Community & Family Health Services Ltd"},"F86644",9254,21,20,0.95238095238095233,18,0.8571428571428571,2,20,0.95238095238095233,"",{"$f":"SUMIFS(OFFSET(REL_D,,MATCH($N$5,IND,0)-1),REL_D,$C$5,OrgID,$C52)","v":20},0.95238095238095233,"",20,0.95238095238095233]
[{"$f":"VLOOKUP(C53,'Control Panel'!$G$132:$K$171,5,FALSE)","v":"WF-7"},{"$f":"VLOOKUP(C53,'Control Panel'!$A$85:$F$124,2,FALSE)","v":"Seymour Medical centre "},"F86006",6825,19,17,0.89473684210526316,17,0.89473684210526316,2,17,0.89473684210526316,2,{"$f":"SUMIFS(OFFSET(REL_D,,MATCH($N$5,IND,0)-1),REL_D,$C$5,OrgID,$C53)","v":16},0.84210526315789469,3,17,0.89473684210526316]
[{"$f":"VLOOKUP(C54,'Control Panel'!$G$132:$K$171,5,FALSE)","v":"WF-7"},{"$f":"VLOOKUP(C54,'Control Panel'!$A$85:$F$124,2,FALSE)","v":" Queens Road Medical Centre"},"F86030",8161,22,21,0.95454545454545459,21,0.95454545454545459,"",21,0.95454545454545459,"",{"$f":"SUMIFS(OFFSET(REL_D,,MATCH($N$5,IND,0)-1),REL_D,$C$5,OrgID,$C54)","v":21},0.95454545454545459,"",21,0.95454545454545459]
[{"$f":"VLOOKUP(C55,'Control Panel'!$G$132:$K$171,5,FALSE)","v":"WF-7"},{"$f":"VLOOKUP(C55,'Control Panel'!$A$85:$F$124,2,FALSE)","v":"The Grove Road Medical Centre "},"F86062",7155,8,6,0.75,5,0.625,3,5,0.625,3,{"$f":"SUMIFS(OFFSET(REL_D,,MATCH($N$5,IND,0)-1),REL_D,$C$5,OrgID,$C55)","v":5},0.625,3,5,0.625]
[{"$f":"VLOOKUP(C56,'Control Panel'!$G$132:$K$171,5,FALSE)","v":"WF-7"},{"$f":"VLOOKUP(C56,'Control Panel'!$A$85:$F$124,2,FALSE)","v":"Higham Hill Medical Centre"},"F86679",6372,27,25,0.92592592592592593,22,0.81481481481481477,4,22,0.81481481481481477,4,{"$f":"SUMIFS(OFFSET(REL_D,,MATCH($N$5,IND,0)-1),REL_D,$C$5,OrgID,$C56)","v":22},0.81481481481481477,4,22,0.81481481481481477]
[{"$f":"VLOOKUP(C57,'Control Panel'!$G$132:$K$171,5,FALSE)","v":"WF-7"},{"$f":"VLOOKUP(C57,'Control Panel'!$A$85:$F$124,2,FALSE)","v":"St James Medical Practice Ltd"},"F86058",16561,69,56,0.81159420289855078,53,0.76811594202898548,13,53,0.76811594202898548,13,{"$f":"SUMIFS(OFFSET(REL_D,,MATCH($N$5,IND,0)-1),REL_D,$C$5,OrgID,$C57)","v":54},0.78260869565217395,12,53,0.76811594202898548]

{"sheet":"Patients becoming 5y","index":4,"n_rows":57,"n_cols":17,"rows_kept":57,"cut":false,"hidden":false,"merged":[[15,0,16,2],[15,4,16,4]]}
[]
[null,null,null,"Waltham Forest Childhood Immunisations Dashboard: Metric Details"]
[null,{"$f":"VLOOKUP(C5,'Control Panel'!Y49:Z60,2,FALSE)","v":{"$error":"#N/A"}},null,"Patients becoming 5y",null,{"$f":"E15","v":950}]
[null,"2020-02-01"]
[null,null,"March 2022","All Patients","(03) 5 YEAR COHORT","(03.01) DTaP/IPV/Hib or DTaP/IPV/Hib/HepB","DTaP/IPV/Hib(%)","(03.02) MMR (Primary)","MMR (Primary)(%)","(03.03) DTaP/IPV (Booster)","DTaP/IPV (Booster)(%)","Patients required to achieve NHSE Target (90%)","(03.05) MMR (Booster)","MMR (Booster)(%)","Patients required to achieve NHSE Target (90%)","(03.04) HiB/Men C","HiB/Men C(%)"]
[null,"Home",null,"Listsize ","Patients becoming 5y","DTaP/IPV/Hib","DTaP/IPV/Hib(%)","MMR (Primary)","MMR (Primary)(%)","DTaP/IPV (Booster)","DTaP/IPV (Booster)(%)","Patients required to achieve CCG Target (95%)","MMR (Booster)","MMR (Booster)(%)","Patients required to achieve CCG Target (95%)","HiB/Men C","HiB/Men C(%)"]
["Cluster"]
["WF-1","Chingford/ Walthamstow",null,{"$f":"SUM(IF($A8=$A$19:$A$57,D$19:D$57))","v":51956},{"$f":"SUM(IF($A8=$A$19:$A$57,E$19:E$57))","v":162},{"$f":"SUM(IF($A8=$A$19:$A$57,F$19:F$57))","v":134},{"$f":"IF(OR(ISTEXT($E8),$E8=0),\"N/A\",F8/$E8)","v":0.8271604938271605},{"$f":"SUM(IF($A8=$A$19:$A$57,H$19:H$57))","v":117},{"$f":"IF(OR(ISTEXT($E8),$E8=0),\"N/A\",H8/$E8)","v":0.72222222222222221},{"$f":"SUM(IF($A8=$A$19:$A$57,J$19:J$57))","v":116},{"$f":"IF(OR(ISTEXT($E8),$E8=0),\"N/A\",J8/$E8)","v":0.71604938271604934},null,{"$f":"SUM(IF($A8=$A$19:$A$57,M$19:M$57))","v":94},{"$f":"IF(OR(ISTEXT($E8),$E8=0),\"N/A\",M8/$E8)","v":0.58024691358024694},null,{"$f":"SUM(IF($A8=$A$19:$A$57,P$19:P$57))","v":134},{"$f":"IF(OR(ISTEXT($E8),$E8=0),\"N/A\",P8/$E8)","v":0.8271604938271605}]
["WF-2","Chingford E4",null,{"$f":"SUM(IF($A9=$A$19:$A$57,D$19:D$57))","v":53291},{"$f":"SUM(IF($A9=$A$19:$A$57,E$19:E$57))","v":163},{"$f":"SUM(IF($A9=$A$19:$A$57,F$19:F$57))","v":137},{"$f":"IF(OR(ISTEXT($E9),$E9=0),\"N/A\",F9/$E9)","v":0.8404907975460123},{"$f":"SUM(IF($A9=$A$19:$A$57,H$19:H$57))","v":135},{"$f":"IF(OR(ISTEXT($E9),$E9=0),\"N/A\",H9/$E9)","v":0.82822085889570551},{"$f":"SUM(IF($A9=$A$19:$A$57,J$19:J$57))","v":141},{"$f":"IF(OR(ISTEXT($E9),$E9=0),\"N/A\",J9/$E9)","v":0.86503067484662577},null,{"$f":"SUM(IF($A9=$A$19:$A$57,M$19:M$57))","v":94},{"$f":"IF(OR(ISTEXT($E9),$E9=0),\"N/A\",M9/$E9)","v":0.57668711656441718},null,{"$f":"SUM(IF($A9=$A$19:$A$57,P$19:P$57))","v":139},{"$f":"IF(OR(ISTEXT($E9),$E9=0),\"N/A\",P9/$E9)","v":0.85276073619631898}]
["WF-3","Leyton Collaborative",null,{"$f":"SUM(IF($A10=$A$19:$A$57,D$19:D$57))","v":35895},{"$f":"SUM(IF($A10=$A$19:$A$57,E$19:E$57))","v":94},{"$f":"SUM(IF($A10=$A$19:$A$57,F$19:F$57))","v":67},0.71276595744680848,{"$f":"SUM(IF($A10=$A$19:$A$57,H$19:H$57))","v":67},0.71276595744680848,{"$f":"SUM(IF($A10=$A$19:$A$57,J$19:J$57))","v":64},0.68085106382978722,null,{"$f":"SUM(IF($A10=$A$19:$A$57,M$19:M$57))","v":33},0.35106382978723405,null,{"$f":"SUM(IF($A10=$A$19:$A$57,P$19:P$57))","v":67},0.71276595744680848]
["WF-4","Forest Integrated Health",null,{"$f":"SUM(IF($A11=$A$19:$A$57,D$19:D$57))","v":58885},{"$f":"SUM(IF($A11=$A$19:$A$57,E$19:E$57))","v":153},{"$f":"SUM(IF($A11=$A$19:$A$57,F$19:F$57))","v":135},0.88235294117647056,{"$f":"SUM(IF($A11=$A$19:$A$57,H$19:H$57))","v":121},0.79084967320261434,{"$f":"SUM(IF($A11=$A$19:$A$57,J$19:J$57))","v":110},0.71895424836601307,null,{"$f":"SUM(IF($A11=$A$19:$A$57,M$19:M$57))","v":98},0.64052287581699341,null,{"$f":"SUM(IF($A11=$A$19:$A$57,P$19:P$57))","v":133},0.86928104575163401]
["WF-5","South Leytonstone",null,{"$f":"SUM(IF($A12=$A$19:$A$57,D$19:D$57))","v":36701},{"$f":"SUM(IF($A12=$A$19:$A$57,E$19:E$57))","v":97},{"$f":"SUM(IF($A12=$A$19:$A$57,F$19:F$57))","v":86},0.88659793814432986,{"$f":"SUM(IF($A12=$A$19:$A$57,H$19:H$57))","v":82},0.84536082474226804,{"$f":"SUM(IF($A12=$A$19:$A$57,J$19:J$57))","v":59},0.60824742268041232,null,{"$f":"SUM(IF($A12=$A$19:$A$57,M$19:M$57))","v":75},0.77319587628865982,null,{"$f":"SUM(IF($A12=$A$19:$A$57,P$19:P$57))","v":81},0.83505154639175261]
["WF-6","Central Walthamstow",null,{"$f":"SUM(IF($A13=$A$19:$A$57,D$19:D$57))","v":41577},{"$f":"SUM(IF($A13=$A$19:$A$57,E$19:E$57))","v":141},{"$f":"SUM(IF($A13=$A$19:$A$57,F$19:F$57))","v":130},0.92198581560283688,{"$f":"SUM(IF($A13=$A$19:$A$57,H$19:H$57))","v":128},0.90780141843971629,{"$f":"SUM(IF($A13=$A$19:$A$57,J$19:J$57))","v":113},0.8014184397163121,null,{"$f":"SUM(IF($A13=$A$19:$A$57,M$19:M$57))","v":119},0.84397163120567376,null,{"$f":"SUM(IF($A13=$A$19:$A$57,P$19:P$57))","v":129},0.91489361702127658]
["WF-7","Walthamstow West",null,{"$f":"SUM(IF($A14=$A$19:$A$57,D$19:D$57))","v":45074},{"$f":"SUM(IF($A14=$A$19:$A$57,E$19:E$57))","v":140},{"$f":"SUM(IF($A14=$A$19:$A$57,F$19:F$57))","v":123},0.87857142857142856,{"$f":"SUM(IF($A14=$A$19:$A$57,H$19:H$57))","v":121},0.86428571428571432,{"$f":"SUM(IF($A14=$A$19:$A$57,J$19:J$57))","v":90},0.6428571428571429,null,{"$f":"SUM(IF($A14=$A$19:$A$57,M$19:M$57))","v":92},0.65714285714285714,null,{"$f":"SUM(IF($A14=$A$19:$A$57,P$19:P$57))","v":117},0.83571428571428574]
["Total",null,null,{"$f":"SUM(D8:D14)","v":323379},{"$f":"SUM(E8:E14)","v":950},{"$f":"SUM(F8:F14)","v":812},0.85473684210526313,{"$f":"SUM(H8:H14)","v":771},0.81157894736842107,{"$f":"SUM(J8:J14)","v":693},0.72947368421052627,null,{"$f":"SUM(M8:M14)","v":605},0.63684210526315788,null,{"$f":"SUM(P8:P14)","v":800},0.84210526315789469]
["Minimum and Maximum %",null,null,null,null,"Min","Max","Min","Max","Min","Max",null,"Min","Max",null,"Min","Max"]
[null,null,null,null,null,{"$f":"SMALL(G19:G51,COUNTIF(G19:G51,0)+1)","v":0.36363636363636365},{"$f":"MAX(G19:G51)","v":1},{"$f":"SMALL(I19:I51,COUNTIF(I19:I51,0)+1)","v":0.1},{"$f":"MAX(I19:I51)","v":1},{"$f":"SMALL(K19:K51,COUNTIF(K19:K51,0)+1)","v":0.38297872340425532},{"$f":"MAX(K19:K51)","v":1},null,{"$f":"SMALL(N19:N51,COUNTIF(N19:N51,0)+1)","v":3.4482758620689655E-2},{"$f":"MAX(N19:N51)","v":1},null,{"$f":"SMALL(Q19:Q51,COUNTIF(Q19:Q51,0)+1)","v":0.45454545454545453},{"$f":"MAX(Q19:Q51)","v":1}]
["Practices","* SystmOne Practices - No Data"]
[{"$f":"VLOOKUP(C19,'Control Panel'!$G$132:$K$171,5,FALSE)","v":"WF-1"},{"$f":"VLOOKUP(C19,'Control Panel'!$A$85:$F$124,2,FALSE)","v":"Kings Head Medical Practice"},"F86700",{"$f":"SUMIFS(OFFSET(REL_D,,MATCH($D$5,IND,0)-1),REL_D,$C$5,OrgID,$C19)","v":3901},{"$f":"SUMIFS(OFFSET(REL_D,,MATCH($E$5,IND,0)-1),REL_D,$C$5,OrgID,$C19)","v":13},{"$f":"SUMIFS(OFFSET(REL_D,,MATCH($F$5,IND,0)-1),REL_D,$C$5,OrgID,$C19)","v":12},{"$f":"IF(OR(ISTEXT($E19),$E19=0),\"N/A\",F19/$E19)","v":0.92307692307692313},{"$f":"SUMIFS(OFFSET(REL_D,,MATCH($H$5,IND,0)-1),REL_D,$C$5,OrgID,$C19)","v":10},{"$f":"IF(OR(ISTEXT($E19),$E19=0),\"N/A\",H19/$E19)","v":0.76923076923076927},{"$f":"SUMIFS(OFFSET(REL_D,,MATCH($J$5,IND,0)-1),REL_D,$C$5,OrgID,$C19)","v":9},{"$f":"IF(OR(ISTEXT($E19),$E19=0),\"N/A\",J19/$E19)","v":0.69230769230769229},{"$f":"IFERROR(ROUNDUP(IF($E19*0.95-J19>=0,$E19*0.95-J19,\"\"),0),\"\")","v":4},{"$f":"SUMIFS(OFFSET(REL_D,,MATCH($M$5,IND,0)-1),REL_D,$C$5,OrgID,$C19)","v":9},{"$f":"IF(OR(ISTEXT($E19),$E19=0),\"N/A\",M19/$E19)","v":0.69230769230769229},{"$f":"IFERROR(ROUNDUP(IF($E19*0.95-M19>=0,$E19*0.95-M19,\"\"),0),\"\")","v":4},{"$f":"SUMIFS(OFFSET(REL_D,,MATCH($P$5,IND,0)-1),REL_D,$C$5,OrgID,$C19)","v":11},{"$f":"IF(OR(ISTEXT($E19),$E19=0),\"N/A\",P19/$E19)","v":0.84615384615384615}]
[{"$f":"VLOOKUP(C20,'Control Panel'!$G$132:$K$171,5,FALSE)","v":"WF-1"},{"$f":"VLOOKUP(C20,'Control Panel'!$A$85:$F$124,2,FALSE)","v":"Larkshall Medical Centre"},"F86664",8471,23,23,{"$f":"IF(OR(ISTEXT($E20),$E20=0),\"N/A\",F20/$E20)","v":1},22,{"$f":"IF(OR(ISTEXT($E20),$E20=0),\"N/A\",H20/$E20)","v":0.95652173913043481},20,{"$f":"IF(OR(ISTEXT($E20),$E20=0),\"N/A\",J20/$E20)","v":0.86956521739130432},{"$f":"IFERROR(ROUNDUP(IF($E20*0.95-J20>=0,$E20*0.95-J20,\"\"),0),\"\")","v":2},{"$f":"SUMIFS(OFFSET(REL_D,,MATCH($M$5,IND,0)-1),REL_D,$C$5,OrgID,$C20)","v":20},{"$f":"IF(OR(ISTEXT($E20),$E20=0),\"N/A\",M20/$E20)","v":0.86956521739130432},{"$f":"IFERROR(ROUNDUP(IF($E20*0.95-M20>=0,$E20*0.95-M20,\"\"),0),\"\")","v":2},22,{"$f":"IF(OR(ISTEXT($E20),$E20=0),\"N/A\",P20/$E20)","v":0.95652173913043481}]
[{"$f":"VLOOKUP(C21,'Control Panel'!$G$132:$K$171,5,FALSE)","v":"WF-1"},{"$f":"VLOOKUP(C21,'Control Panel'!$A$85:$F$124,2,FALSE)","v":"The Microfaculty*"},"F86638",5199,20,14,0.7,2,0.1,9,0.45,10,{"$f":"SUMIFS(OFFSET(REL_D,,MATCH($M$5,IND,0)-1),REL_D,$C$5,OrgID,$C21)","v":1},0.05,18,16,0.8]
[{"$f":"VLOOKUP(C22,'Control Panel'!$G$132:$K$171,5,FALSE)","v":"WF-1"},{"$f":"VLOOKUP(C22,'Control Panel'!$A$85:$F$124,2,FALSE)","v":" The Penryhn Surgery"},"F86005",9510,30,27,0.9,26,0.8666666666666667,22,{"$f":"IF(OR(ISTEXT($E22),$E22=0),\"N/A\",J22/$E22)","v":0.73333333333333328},7,{"$f":"SUMIFS(OFFSET(REL_D,,MATCH($M$5,IND,0)-1),REL_D,$C$5,OrgID,$C22)","v":23},0.76666666666666672,6,27,0.9]
[{"$f":"VLOOKUP(C23,'Control Panel'!$G$132:$K$171,5,FALSE)","v":"WF-1"},{"$f":"VLOOKUP(C23,'Control Panel'!$A$85:$F$124,2,FALSE)","v":"Dr Shantir Practice"},"F86626",7021,13,12,0.92307692307692313,12,0.92307692307692313,12,0.92307692307692313,1,{"$f":"SUMIFS(OFFSET(REL_D,,MATCH($M$5,IND,0)-1),REL_D,$C$5,OrgID,$C23)","v":12},0.92307692307692313,1,12,0.92307692307692313]
[{"$f":"VLOOKUP(C24,'Control Panel'!$G$132:$K$171,5,FALSE)","v":"WF-1"},{"$f":"VLOOKUP(C24,'Control Panel'!$A$85:$F$124,2,FALSE)","v":"Lime Tree & Sinnott Healthcare Ltd"},"Y01839",6236,23,20,0.86956521739130432,19,0.82608695652173914,12,0.52173913043478259,10,{"$f":"SUMIFS(OFFSET(REL_D,,MATCH($M$5,IND,0)-1),REL_D,$C$5,OrgID,$C24)","v":11},0.47826086956521741,11,18,0.78260869565217395]
[{"$f":"VLOOKUP(C25,'Control Panel'!$G$132:$K$171,5,FALSE)","v":"WF-1"},{"$f":"VLOOKUP(C25,'Control Panel'!$A$85:$F$124,2,FALSE)","v":"The Bailey Practice"},"F86689",4395,18,18,1,18,1,18,1,"",{"$f":"SUMIFS(OFFSET(REL_D,,MATCH($M$5,IND,0)-1),REL_D,$C$5,OrgID,$C25)","v":18},1,"",18,1]
[{"$f":"VLOOKUP(C26,'Control Panel'!$G$132:$K$171,5,FALSE)","v":"WF-1"},{"$f":"VLOOKUP(C26,'Control Panel'!$A$85:$F$124,2,FALSE)","v":"Forest Surgery*"},"F86026",7223,22,8,0.36363636363636365,8,0.36363636363636365,14,0.63636363636363635,7,{"$f":"SUMIFS(OFFSET(REL_D,,MATCH($M$5,IND,0)-1),REL_D,$C$5,OrgID,$C26)","v":0},0,21,10,0.45454545454545453]
[{"$f":"VLOOKUP(C27,'Control Panel'!$G$132:$K$171,5,FALSE)","v":"WF-2"},{"$f":"VLOOKUP(C27,'Control Panel'!$A$85:$F$124,2,FALSE)","v":"Handsworth Medical Centre*"},"F86004",15970,58,37,0.63793103448275867,36,0.62068965517241381,47,0.81034482758620685,9,{"$f":"SUMIFS(OFFSET(REL_D,,MATCH($M$5,IND,0)-1),REL_D,$C$5,OrgID,$C27)","v":2},3.4482758620689655E-2,54,41,0.7068965517241379]
[{"$f":"VLOOKUP(C28,'Control Panel'!$G$132:$K$171,5,FALSE)","v":"WF-2"},{"$f":"VLOOKUP(C28,'Control Panel'!$A$85:$F$124,2,FALSE)","v":"Chingford Medical Practice"},"Y01291",9173,35,33,0.94285714285714284,33,0.94285714285714284,33,0.94285714285714284,1,{"$f":"SUMIFS(OFFSET(REL_D,,MATCH($M$5,IND,0)-1),REL_D,$C$5,OrgID,$C28)","v":32},0.91428571428571426,2,34,0.97142857142857142]
[{"$f":"VLOOKUP(C29,'Control Panel'!$G$132:$K$171,5,FALSE)","v":"WF-2"},{"$f":"VLOOKUP(C29,'Control Panel'!$A$85:$F$124,2,FALSE)","v":"Churchill Medical Centre"},"F86627",13283,30,30,1,30,1,27,0.9,2,{"$f":"SUMIFS(OFFSET(REL_D,,MATCH($M$5,IND,0)-1),REL_D,$C$5,OrgID,$C29)","v":27},0.9,2,30,1]
[{"$f":"VLOOKUP(C30,'Control Panel'!$G$132:$K$171,5,FALSE)","v":"WF-2"},{"$f":"VLOOKUP(C30,'Control Panel'!$A$85:$F$124,2,FALSE)","v":"The Ridgeway Surgery"},"F86078",6869,13,13,1,13,1,11,0.84615384615384615,2,{"$f":"SUMIFS(OFFSET(REL_D,,MATCH($M$5,IND,0)-1),REL_D,$C$5,OrgID,$C30)","v":11},0.84615384615384615,2,12,0.92307692307692313]
[{"$f":"VLOOKUP(C31,'Control Panel'!$G$132:$K$171,5,FALSE)","v":"WF-2"},{"$f":"VLOOKUP(C31,'Control Panel'!$A$85:$F$124,2,FALSE)","v":"Old Church Surgery"},"F86616",7996,27,24,0.88888888888888884,23,0.85185185185185186,23,0.85185185185185186,3,{"$f":"SUMIFS(OFFSET(REL_D,,MATCH($M$5,IND,0)-1),REL_D,$C$5,OrgID,$C31)","v":22},0.81481481481481477,4,22,0.81481481481481477]
[{"$f":"VLOOKUP(C32,'Control Panel'!$G$132:$K$171,5,FALSE)","v":"WF-3"},{"$f":"VLOOKUP(C32,'Control Panel'!$A$85:$F$124,2,FALSE)","v":"The Manor Practice"},"F86011",9698,18,16,0.88888888888888884,15,0.83333333333333337,11,0.61111111111111116,7,{"$f":"SUMIFS(OFFSET(REL_D,,MATCH($M$5,IND,0)-1),REL_D,$C$5,OrgID,$C32)","v":12},0.66666666666666663,6,15,0.83333333333333337]
[{"$f":"VLOOKUP(C33,'Control Panel'!$G$132:$K$171,5,FALSE)","v":"WF-3"},{"$f":"VLOOKUP(C33,'Control Panel'!$A$85:$F$124,2,FALSE)","v":"Sma Medical Centre"},"F86038",11105,23,22,0.95652173913043481,22,0.95652173913043481,20,0.86956521739130432,2,{"$f":"SUMIFS(OFFSET(REL_D,,MATCH($M$5,IND,0)-1),REL_D,$C$5,OrgID,$C33)","v":21},0.91304347826086951,1,21,0.91304347826086951]
[{"$f":"VLOOKUP(C34,'Control Panel'!$G$132:$K$171,5,FALSE)","v":"WF-3"},{"$f":"VLOOKUP(C34,'Control Panel'!$A$85:$F$124,2,FALSE)","v":"Leyton Healthcare (Oliver Road)*"},"F86074",15092,53,29,0.54716981132075471,30,0.56603773584905659,33,0.62264150943396224,18,{"$f":"SUMIFS(OFFSET(REL_D,,MATCH($M$5,IND,0)-1),REL_D,$C$5,OrgID,$C34)","v":0},0,51,31,0.58490566037735847]
[{"$f":"VLOOKUP(C35,'Control Panel'!$G$132:$K$171,5,FALSE)","v":"WF-4"},{"$f":"VLOOKUP(C35,'Control Panel'!$A$85:$F$124,2,FALSE)","v":"The Allum Medical Centre"},"F86036",14732,41,41,1,40,0.97560975609756095,37,0.90243902439024393,2,{"$f":"SUMIFS(OFFSET(REL_D,,MATCH($M$5,IND,0)-1),REL_D,$C$5,OrgID,$C35)","v":37},0.90243902439024393,2,39,0.95121951219512191]
[{"$f":"VLOOKUP(C36,'Control Panel'!$G$132:$K$171,5,FALSE)","v":"WF-4"},{"$f":"VLOOKUP(C36,'Control Panel'!$A$85:$F$124,2,FALSE)","v":" Crawley Road Medical Centre"},"F86044",10802,30,24,0.8,22,0.73333333333333328,16,0.53333333333333333,13,{"$f":"SUMIFS(OFFSET(REL_D,,MATCH($M$5,IND,0)-1),REL_D,$C$5,OrgID,$C36)","v":17},0.56666666666666665,12,22,0.73333333333333328]
[{"$f":"VLOOKUP(C37,'Control Panel'!$G$132:$K$171,5,FALSE)","v":"WF-4"},{"$f":"VLOOKUP(C37,'Control Panel'!$A$85:$F$124,2,FALSE)","v":"Francis Road Medical Centre"},"F86696",6883,16,15,0.9375,15,0.9375,11,0.6875,5,{"$f":"SUMIFS(OFFSET(REL_D,,MATCH($M$5,IND,0)-1),REL_D,$C$5,OrgID,$C37)","v":11},0.6875,5,15,0.9375]
[{"$f":"VLOOKUP(C38,'Control Panel'!$G$132:$K$171,5,FALSE)","v":"WF-4"},{"$f":"VLOOKUP(C38,'Control Panel'!$A$85:$F$124,2,FALSE)","v":"Hampton Medical Centre"},"F86712",3395,6,6,1,6,1,6,1,"",{"$f":"SUMIFS(OFFSET(REL_D,,MATCH($M$5,IND,0)-1),REL_D,$C$5,OrgID,$C38)","v":6},1,"",6,1]
[{"$f":"VLOOKUP(C39,'Control Panel'!$G$132:$K$171,5,FALSE)","v":"WF-4"},{"$f":"VLOOKUP(C39,'Control Panel'!$A$85:$F$124,2,FALSE)","v":"Lime Tree Surgery"},"F86650",8080,18,17,0.94444444444444442,16,0.88888888888888884,13,0.72222222222222221,5,{"$f":"SUMIFS(OFFSET(REL_D,,MATCH($M$5,IND,0)-1),REL_D,$C$5,OrgID,$C39)","v":13},0.72222222222222221,5,17,0.94444444444444442]
[{"$f":"VLOOKUP(C40,'Control Panel'!$G$132:$K$171,5,FALSE)","v":"WF-4"},{"$f":"VLOOKUP(C40,'Control Panel'!$A$85:$F$124,2,FALSE)","v":"The Lyndhurst Surgery"},"F86088",5027,14,14,1,14,1,12,0.8571428571428571,2,{"$f":"SUMIFS(OFFSET(REL_D,,MATCH($M$5,IND,0)-1),REL_D,$C$5,OrgID,$C40)","v":12},0.8571428571428571,2,13,0.9285714285714286]
[{"$f":"VLOOKUP(C41,'Control Panel'!$G$132:$K$171,5,FALSE)","v":"WF-4"},{"$f":"VLOOKUP(C41,'Control Panel'!$A$85:$F$124,2,FALSE)","v":"The Ecclesbourne Practice*"},"F86018",9966,28,18,0.6428571428571429,8,0.2857142857142857,15,0.5357142857142857,12,{"$f":"SUMIFS(OFFSET(REL_D,,MATCH($M$5,IND,0)-1),REL_D,$C$5,OrgID,$C41)","v":2},7.1428571428571425E-2,25,21,0.75]
[{"$f":"VLOOKUP(C42,'Control Panel'!$G$132:$K$171,5,FALSE)","v":"WF-5"},{"$f":"VLOOKUP(C42,'Control Panel'!$A$85:$F$124,2,FALSE)","v":"Green Man Medical Centre"},"F86621",6445,14,12,0.8571428571428571,13,0.9285714285714286,12,0.8571428571428571,2,{"$f":"SUMIFS(OFFSET(REL_D,,MATCH($M$5,IND,0)-1),REL_D,$C$5,OrgID,$C42)","v":13},0.9285714285714286,1,13,0.9285714285714286]
[{"$f":"VLOOKUP(C43,'Control Panel'!$G$132:$K$171,5,FALSE)","v":"WF-5"},{"$f":"VLOOKUP(C43,'Control Panel'!$A$85:$F$124,2,FALSE)","v":"High Road Surgery"},"F86045",2026,5,4,0.8,4,0.8,4,0.8,1,{"$f":"SUMIFS(OFFSET(REL_D,,MATCH($M$5,IND,0)-1),REL_D,$C$5,OrgID,$C43)","v":4},0.8,1,4,0.8]
[{"$f":"VLOOKUP(C44,'Control Panel'!$G$132:$K$171,5,FALSE)","v":"WF-5"},{"$f":"VLOOKUP(C44,'Control Panel'!$A$85:$F$124,2,FALSE)","v":"Kiyani Medical Practice"},"F86701",3853,7,6,0.8571428571428571,5,0.7142857142857143,3,0.42857142857142855,4,{"$f":"SUMIFS(OFFSET(REL_D,,MATCH($M$5,IND,0)-1),REL_D,$C$5,OrgID,$C44)","v":2},0.2857142857142857,5,5,0.7142857142857143]
[{"$f":"VLOOKUP(C45,'Control Panel'!$G$132:$K$171,5,FALSE)","v":"WF-5"},{"$f":"VLOOKUP(C45,'Control Panel'!$A$85:$F$124,2,FALSE)","v":"LL Medical Care (Agarwal & Agrwal Practice)"},"F86625",5882,17,16,0.94117647058823528,15,0.88235294117647056,15,0.88235294117647056,2,{"$f":"SUMIFS(OFFSET(REL_D,,MATCH($M$5,IND,0)-1),REL_D,$C$5,OrgID,$C45)","v":14},0.82352941176470584,3,15,0.88235294117647056]
[{"$f":"VLOOKUP(C46,'Control Panel'!$G$132:$K$171,5,FALSE)","v":"WF-5"},{"$f":"VLOOKUP(C46,'Control Panel'!$A$85:$F$124,2,FALSE)","v":"The Harrow Road Surgery"},"F86666",14983,47,41,0.87234042553191493,38,0.80851063829787229,18,0.38297872340425532,27,{"$f":"SUMIFS(OFFSET(REL_D,,MATCH($M$5,IND,0)-1),REL_D,$C$5,OrgID,$C46)","v":35},0.74468085106382975,10,38,0.80851063829787229]
[{"$f":"VLOOKUP(C47,'Control Panel'!$G$132:$K$171,5,FALSE)","v":"WF-5"},{"$f":"VLOOKUP(C47,'Control Panel'!$A$85:$F$124,2,FALSE)","v":"The Langthorne Sharma Family Practice"},"F86705",3512,7,7,1,7,1,7,1,"",{"$f":"SUMIFS(OFFSET(REL_D,,MATCH($M$5,IND,0)-1),REL_D,$C$5,OrgID,$C47)","v":7},1,"",6,0.8571428571428571]
[{"$f":"VLOOKUP(C48,'Control Panel'!$G$132:$K$171,5,FALSE)","v":"WF-6"},{"$f":"VLOOKUP(C48,'Control Panel'!$A$85:$F$124,2,FALSE)","v":"Addison Road Medical Practice"},"F86607",15547,47,42,0.8936170212765957,43,0.91489361702127658,42,0.8936170212765957,3,{"$f":"SUMIFS(OFFSET(REL_D,,MATCH($M$5,IND,0)-1),REL_D,$C$5,OrgID,$C48)","v":42},0.8936170212765957,3,42,0.8936170212765957]
[{"$f":"VLOOKUP(C49,'Control Panel'!$G$132:$K$171,5,FALSE)","v":"WF-6"},{"$f":"VLOOKUP(C49,'Control Panel'!$A$85:$F$124,2,FALSE)","v":"Claremont Medical Centre"},"F86708",2782,9,6,0.66666666666666663,7,0.77777777777777779,5,0.55555555555555558,4,{"$f":"SUMIFS(OFFSET(REL_D,,MATCH($M$5,IND,0)-1),REL_D,$C$5,OrgID,$C49)","v":5},0.55555555555555558,4,7,0.77777777777777779]
[{"$f":"VLOOKUP(C50,'Control Panel'!$G$132:$K$171,5,FALSE)","v":"WF-6"},{"$f":"VLOOKUP(C50,'Control Panel'!$A$85:$F$124,2,FALSE)","v":" The Firs"},"F86001",7729,30,30,1,28,0.93333333333333335,27,0.9,2,{"$f":"SUMIFS(OFFSET(REL_D,,MATCH($M$5,IND,0)-1),REL_D,$C$5,OrgID,$C50)","v":27},0.9,2,29,0.96666666666666667]
[{"$f":"VLOOKUP(C51,'Control Panel'!$G$132:$K$171,5,FALSE)","v":"WF-6"},{"$f":"VLOOKUP(C51,'Control Panel'!$A$85:$F$124,2,FALSE)","v":"Dr Dhital Practice"},"F86086",6265,28,26,0.9285714285714286,25,0.8928571428571429,21,0.75,6,{"$f":"SUMIFS(OFFSET(REL_D,,MATCH($M$5,IND,0)-1),REL_D,$C$5,OrgID,$C51)","v":22},0.7857142857142857,5,26,0.9285714285714286]
[{"$f":"VLOOKUP(C52,'Control Panel'!$G$132:$K$171,5,FALSE)","v":"WF-6"},{"$f":"VLOOKUP(C52,'Control Panel'!$A$85:$F$124,2,FALSE)","v":"Waltham Forest Community & Family Health Services Ltd"},"F86644",9254,27,26,0.96296296296296291,25,0.92592592592592593,18,0.66666666666666663,8,{"$f":"SUMIFS(OFFSET(REL_D,,MATCH($M$5,IND,0)-1),REL_D,$C$5,OrgID,$C52)","v":23},0.85185185185185186,3,25,0.92592592592592593]
[{"$f":"VLOOKUP(C53,'Control Panel'!$G$132:$K$171,5,FALSE)","v":"WF-7"},{"$f":"VLOOKUP(C53,'Control Panel'!$A$85:$F$124,2,FALSE)","v":"Seymour Medical centre "},"F86006",6825,21,16,0.76190476190476186,18,0.8571428571428571,13,0.61904761904761907,7,{"$f":"SUMIFS(OFFSET(REL_D,,MATCH($M$5,IND,0)-1),REL_D,$C$5,OrgID,$C53)","v":14},0.66666666666666663,6,17,0.80952380952380953]
[{"$f":"VLOOKUP(C54,'Control Panel'!$G$132:$K$171,5,FALSE)","v":"WF-7"},{"$f":"VLOOKUP(C54,'Control Panel'!$A$85:$F$124,2,FALSE)","v":" Queens Road Medical Centre"},"F86030",8161,27,24,0.88888888888888884,24,0.88888888888888884,20,0.7407407407407407,6,{"$f":"SUMIFS(OFFSET(REL_D,,MATCH($M$5,IND,0)-1),REL_D,$C$5,OrgID,$C54)","v":20},0.7407407407407407,6,23,0.85185185185185186]
[{"$f":"VLOOKUP(C55,'Control Panel'!$G$132:$K$171,5,FALSE)","v":"WF-7"},{"$f":"VLOOKUP(C55,'Control Panel'!$A$85:$F$124,2,FALSE)","v":"The Grove Road Medical Centre "},"F86062",7155,21,19,0.90476190476190477,17,0.80952380952380953,10,0.47619047619047616,10,{"$f":"SUMIFS(OFFSET(REL_D,,MATCH($M$5,IND,0)-1),REL_D,$C$5,OrgID,$C55)","v":10},0.47619047619047616,10,16,0.76190476190476186]
[{"$f":"VLOOKUP(C56,'Control Panel'!$G$132:$K$171,5,FALSE)","v":"WF-7"},{"$f":"VLOOKUP(C56,'Control Panel'!$A$85:$F$124,2,FALSE)","v":"Higham Hill Medical Centre"},"F86679",6372,28,24,0.8571428571428571,24,0.8571428571428571,16,0.5714285714285714,11,{"$f":"SUMIFS(OFFSET(REL_D,,MATCH($M$5,IND,0)-1),REL_D,$C$5,OrgID,$C56)","v":16},0.5714285714285714,11,23,0.8214285714285714]
[{"$f":"VLOOKUP(C57,'Control Panel'!$G$132:$K$171,5,FALSE)","v":"WF-7"},{"$f":"VLOOKUP(C57,'Control Panel'!$A$85:$F$124,2,FALSE)","v":"St James Medical Practice Ltd"},"F86058",16561,43,40,0.93023255813953487,38,0.88372093023255816,31,0.72093023255813948,10,{"$f":"SUMIFS(OFFSET(REL_D,,MATCH($M$5,IND,0)-1),REL_D,$C$5,OrgID,$C57)","v":32},0.7441860465116279,9,38,0.88372093023255816]

{"sheet":"Trending","index":5,"n_rows":80,"n_cols":13,"rows_kept":80,"cut":false,"hidden":false,"merged":[[1,3,1,4]]}
[null,null,null,"Waltham Forest - Childhood Immunisations",null,null,null,null,null,null,null,null,{"$f":"\"'\"&K3&\"'!$C$9:$AT$71\"","v":"'1st April 2016'!$C$9:$AT$71"}]
[null,null,null,null,null,null,"Waltham Forest"]
[null,"2015/16 Q1",null,{"$f":"VLOOKUP(G2,'Control Panel'!I77:J119,2,FALSE)","v":"Total"},{"$f":"IF(D3=\"Total\",TRUE,IF(LEFT($D$3,1)=\"P\",TRUE,FALSE))","v":true},{"$f":"IF(D3=\"Total\",\"WF\",D3)","v":"WF"},"FHV",null,null,null,"1st April 2016"]
[null,null,null,null,null,null,"Patient becoming 12m","Control Panel'!J34:J36"]
[]
[null,{"$f":"INDEX(INDIRECT(VLOOKUP($G$4,'Control Panel'!$J$41:$K$43,2,FALSE)),COLUMN(Rows!A1))","v":"(01) 12 MONTH COHORT"},{"$f":"INDEX(INDIRECT(VLOOKUP($G$4,'Control Panel'!$J$41:$K$43,2,FALSE)),COLUMN(Rows!B1))","v":"(01.01) DTaP/IPV/Hib 6in1"},{"$f":"INDEX(INDIRECT(VLOOKUP($G$4,'Control Panel'!$J$41:$K$43,2,FALSE)),COLUMN(Rows!C1))","v":"(01.02) Men B (1st and 2nd)"},{"$f":"INDEX(INDIRECT(VLOOKUP($G$4,'Control Panel'!$J$41:$K$43,2,FALSE)),COLUMN(Rows!D1))","v":"(01.03) PCV"}]
["Time Stamp",{"$f":"IFERROR(INDEX(INDIRECT(VLOOKUP($G$4,'Control Panel'!$J$36:$L$38,3,FALSE)),COLUMN(Rows!B17)),\"\")","v":"DTaP/IPV/Hib %"},{"$f":"IFERROR(INDEX(INDIRECT(VLOOKUP($G$4,'Control Panel'!$J$36:$L$38,3,FALSE)),COLUMN(Rows!C17)),\"\")","v":"Men C / Men B %"},{"$f":"IFERROR(INDEX(INDIRECT(VLOOKUP($G$4,'Control Panel'!$J$36:$L$38,3,FALSE)),COLUMN(Rows!D17)),\"\")","v":"PCV %"}]
["March 2019 (Baseline)",{"$f":"IFERROR(C42/B42,\"\")","v":0.97767332549941255},{"$f":"IFERROR(D42/B42,\"\")","v":1.0011750881316099},{"$f":"IFERROR(E42/B42,NA())","v":815.91069330199764}]
["April 2019",{"$f":"IFERROR(C45/B45,\"\")","v":0.84968017057569301},{"$f":"IFERROR(D45/B45,\"\")","v":0.84221748400852881},{"$f":"IFERROR(E45/B45,NA())","v":0.85927505330490406}]
["May 2019",0.85378868729989332,0.84738527214514403,0.86552828175026686]
["June 2019",0.85820895522388063,0.8571428571428571,0.87420042643923246]
["July 2019",0.87943262411347523,0.87436676798378921,0.88753799392097266]
["August 2019",0.88121827411167508,0.87106598984771577,0.8873096446700508]
["September 2019",0.88126919140225179,0.87001023541453426,0.88638689866939613]
["October 2019",0.89233954451345754,0.8954451345755694,0.90372670807453415]
["November 2019",0.8909657320872274,0.89511941848390442,0.90446521287642778]
["December 2019",0.8851774530271399,0.89039665970772441,0.89979123173277664]
["January 2020",0.8896551724137931,0.88275862068965516,0.89540229885057476]
["February 2020",0.8946135831381733,0.88758782201405151,0.89929742388758782]
["March 2020",0.8951048951048951,0.88694638694638694,0.89976689976689972]
["April 2020",{"$f":"IFERROR(C57/B57,\"\")","v":0.90010626992561105},{"$f":"IFERROR(D57/B57,\"\")","v":0.89266737513283745},{"$f":"IFERROR(E57/B57,NA())","v":0.90754516471838464}]
["May 2020",0.90106382978723409,0.8936170212765957,0.91063829787234041]
["June 2020",{"$f":"IFERROR(C59/B59,\"\")","v":0.89819724284199365},{"$f":"IFERROR(D59/B59,\"\")","v":0.89077412513255572},{"$f":"IFERROR(E59/B59,NA())","v":0.90986214209968186}]
["July 2020",{"$f":"IFERROR(C60/B60,\"\")","v":0.87472527472527473},{"$f":"IFERROR(D60/B60,\"\")","v":0.87692307692307692},{"$f":"IFERROR(E60/B60,NA())","v":0.89010989010989006}]
["August 2020",0.87334801762114533,0.87665198237885467,0.88986784140969166]
["September 2020",{"$f":"IFERROR(C62/B62,\"\")","v":0.87804878048780488},{"$f":"IFERROR(D62/B62,\"\")","v":0.88137472283813745},{"$f":"IFERROR(E62/B62,NA())","v":0.89246119733924612}]
["October 2020",{"$f":"IFERROR(C63/B63,\"\")","v":0.86006458557588805},{"$f":"IFERROR(D63/B63,\"\")","v":0.86544671689989239},{"$f":"IFERROR(E63/B63,NA())","v":0.84391819160387516}]
["November 2020",{"$f":"IFERROR(C64/B64,\"\")","v":0.86225596529284165},{"$f":"IFERROR(D64/B64,\"\")","v":0.86550976138828628},{"$f":"IFERROR(E64/B64,NA())","v":0.8438177874186551}]
["December 2020",{"$f":"IFERROR(C65/B65,\"\")","v":0.86486486486486491},{"$f":"IFERROR(D65/B65,\"\")","v":0.86486486486486491},{"$f":"IFERROR(E65/B65,NA())","v":0.84324324324324329}]
["January 2021",{"$f":"IFERROR(C66/B66,\"\")","v":0.86295005807200931},{"$f":"IFERROR(D66/B66,\"\")","v":0.86178861788617889},{"$f":"IFERROR(E66/B66,NA())","v":0.90127758420441351}]
["February 2021",{"$f":"IFERROR(C67/B67,\"\")","v":0.86596736596736601},{"$f":"IFERROR(D67/B67,\"\")","v":0.86480186480186483},{"$f":"IFERROR(E67/B67,NA())","v":0.90675990675990681}]
["March 2021",0.86910377358490565,0.86910377358490565,0.91155660377358494]
["April 2021",{"$f":"IFERROR(C69/B69,\"\")","v":0.83825265643447466},{"$f":"IFERROR(D69/B69,\"\")","v":0.83707201889020066},{"$f":"IFERROR(E69/B69,NA())","v":0.87485242030696575}]
["May 2021",{"$f":"IFERROR(C70/B70,\"\")","v":0.83924349881796689},{"$f":"IFERROR(D70/B70,\"\")","v":0.83924349881796689},{"$f":"IFERROR(E70/B70,NA())","v":0.87588652482269502}]
["June 2021",0.84892787524366475,0.84795321637426901,0.87231968810916183]
["July 2021",{"$f":"IFERROR(C72/B72,\"\")","v":0.86973180076628354},{"$f":"IFERROR(D72/B72,\"\")","v":0.85632183908045978},{"$f":"IFERROR(E72/B72,NA())","v":0.88314176245210729}]
["August 2021",{"$f":"IFERROR(C73/B73,\"\")","v":0.88079470198675491},{"$f":"IFERROR(D73/B73,\"\")","v":0.86660359508041629},{"$f":"IFERROR(E73/B73,NA())","v":0.88363292336802268}]
["September 2021",0.8827977315689981,0.86672967863894135,0.88468809073724008]
["October 2021",{"$f":"IFERROR(C75/B75,\"\")","v":0.90486039296794207},{"$f":"IFERROR(D75/B75,\"\")","v":0.88831437435367111},{"$f":"IFERROR(E75/B75,NA())","v":0.91416752843846949}]
["November 2021",{"$f":"IFERROR(C76/B76,\"\")","v":0.90595611285266453},{"$f":"IFERROR(D76/B76,\"\")","v":0.88819226750261238},{"$f":"IFERROR(E76/B76,NA())","v":0.9132706374085684}]
["December 2021",0.91060291060291065,0.89085239085239087,0.91164241164241167]
["January 2022",0.91309012875536477,0.89270386266094426,0.91416309012875541,{"$f":"IFERROR(SUMIFS(OFFSET(REL_D,,MATCH($E$6,IND,0)-1),REL_D,$A42,IF(LEFT($D$3,1)=\"W\",NwID,OrgID),$D$3),\"\")","v":745}]
["February 2022",{"$f":"IFERROR(C79/B79,\"\")","v":0.88947368421052631},{"$f":"IFERROR(D79/B79,\"\")","v":0.87473684210526315},{"$f":"IFERROR(E79/B79,NA())","v":0.91052631578947374}]
["March 2022",{"$f":"IFERROR(C80/B80,\"\")","v":0.89406779661016944},{"$f":"IFERROR(D80/B80,\"\")","v":0.88241525423728817},{"$f":"IFERROR(E80/B80,NA())","v":0.91631355932203384}]
["2019-04-01",{"$f":"SUMIFS(OFFSET(REL_D,,MATCH($B$6,IND,0)-1),REL_D,$A45,IF($E$3,NwID,OrgID),$F$3)","v":938},{"$f":"SUMIFS(OFFSET(REL_D,,MATCH($C$6,IND,0)-1),REL_D,$A45,IF($E$3,NwID,OrgID),$F$3)","v":797},{"$f":"SUMIFS(OFFSET(REL_D,,MATCH($D$6,IND,0)-1),REL_D,$A45,IF($E$3,NwID,OrgID),$F$3)","v":790},{"$f":"SUMIFS(OFFSET(REL_D,,MATCH($E$6,IND,0)-1),REL_D,$A45,IF($E$3,NwID,OrgID),$F$3)","v":806}]
["2019-05-01",{"$f":"SUMIFS(OFFSET(REL_D,,MATCH($B$6,IND,0)-1),REL_D,$A46,IF($E$3,NwID,OrgID),$F$3)","v":937},{"$f":"SUMIFS(OFFSET(REL_D,,MATCH($C$6,IND,0)-1),REL_D,$A46,IF($E$3,NwID,OrgID),$F$3)","v":800},{"$f":"SUMIFS(OFFSET(REL_D,,MATCH($D$6,IND,0)-1),REL_D,$A46,IF($E$3,NwID,OrgID),$F$3)","v":794},{"$f":"SUMIFS(OFFSET(REL_D,,MATCH($E$6,IND,0)-1),REL_D,$A46,IF($E$3,NwID,OrgID),$F$3)","v":811}]
["2019-06-01",{"$f":"SUMIFS(OFFSET(REL_D,,MATCH($B$6,IND,0)-1),REL_D,$A47,IF($E$3,NwID,OrgID),$F$3)","v":938},{"$f":"SUMIFS(OFFSET(REL_D,,MATCH($C$6,IND,0)-1),REL_D,$A47,IF($E$3,NwID,OrgID),$F$3)","v":805},{"$f":"SUMIFS(OFFSET(REL_D,,MATCH($D$6,IND,0)-1),REL_D,$A47,IF($E$3,NwID,OrgID),$F$3)","v":804},{"$f":"SUMIFS(OFFSET(REL_D,,MATCH($E$6,IND,0)-1),REL_D,$A47,IF($E$3,NwID,OrgID),$F$3)","v":820}]
["2019-07-01",{"$f":"SUMIFS(OFFSET(REL_D,,MATCH($B$6,IND,0)-1),REL_D,$A48,IF($E$3,NwID,OrgID),$F$3)","v":987},{"$f":"SUMIFS(OFFSET(REL_D,,MATCH($C$6,IND,0)-1),REL_D,$A48,IF($E$3,NwID,OrgID),$F$3)","v":868},{"$f":"SUMIFS(OFFSET(REL_D,,MATCH($D$6,IND,0)-1),REL_D,$A48,IF($E$3,NwID,OrgID),$F$3)","v":863},{"$f":"SUMIFS(OFFSET(REL_D,,MATCH($E$6,IND,0)-1),REL_D,$A48,IF($E$3,NwID,OrgID),$F$3)","v":876}]
["2019-08-01",{"$f":"SUMIFS(OFFSET(REL_D,,MATCH($B$6,IND,0)-1),REL_D,$A49,IF($E$3,NwID,OrgID),$F$3)","v":985},{"$f":"SUMIFS(OFFSET(REL_D,,MATCH($C$6,IND,0)-1),REL_D,$A49,IF($E$3,NwID,OrgID),$F$3)","v":868},{"$f":"SUMIFS(OFFSET(REL_D,,MATCH($D$6,IND,0)-1),REL_D,$A49,IF($E$3,NwID,OrgID),$F$3)","v":858},{"$f":"SUMIFS(OFFSET(REL_D,,MATCH($E$6,IND,0)-1),REL_D,$A49,IF($E$3,NwID,OrgID),$F$3)","v":874}]
["2019-09-01",{"$f":"SUMIFS(OFFSET(REL_D,,MATCH($B$6,IND,0)-1),REL_D,$A50,IF($E$3,NwID,OrgID),$F$3)","v":977},{"$f":"SUMIFS(OFFSET(REL_D,,MATCH($C$6,IND,0)-1),REL_D,$A50,IF($E$3,NwID,OrgID),$F$3)","v":861},{"$f":"SUMIFS(OFFSET(REL_D,,MATCH($D$6,IND,0)-1),REL_D,$A50,IF($E$3,NwID,OrgID),$F$3)","v":850},{"$f":"SUMIFS(OFFSET(REL_D,,MATCH($E$6,IND,0)-1),REL_D,$A50,IF($E$3,NwID,OrgID),$F$3)","v":866}]
["2019-10-01",{"$f":"SUMIFS(OFFSET(REL_D,,MATCH($B$6,IND,0)-1),REL_D,$A51,IF($E$3,NwID,OrgID),$F$3)","v":966},{"$f":"SUMIFS(OFFSET(REL_D,,MATCH($C$6,IND,0)-1),REL_D,$A51,IF($E$3,NwID,OrgID),$F$3)","v":862},{"$f":"SUMIFS(OFFSET(REL_D,,MATCH($D$6,IND,0)-1),REL_D,$A51,IF($E$3,NwID,OrgID),$F$3)","v":865},{"$f":"SUMIFS(OFFSET(REL_D,,MATCH($E$6,IND,0)-1),REL_D,$A51,IF($E$3,NwID,OrgID),$F$3)","v":873}]
["2019-11-01",{"$f":"SUMIFS(OFFSET(REL_D,,MATCH($B$6,IND,0)-1),REL_D,$A52,IF($E$3,NwID,OrgID),$F$3)","v":963},{"$f":"SUMIFS(OFFSET(REL_D,,MATCH($C$6,IND,0)-1),REL_D,$A52,IF($E$3,NwID,OrgID),$F$3)","v":858},{"$f":"SUMIFS(OFFSET(REL_D,,MATCH($D$6,IND,0)-1),REL_D,$A52,IF($E$3,NwID,OrgID),$F$3)","v":862},{"$f":"SUMIFS(OFFSET(REL_D,,MATCH($E$6,IND,0)-1),REL_D,$A52,IF($E$3,NwID,OrgID),$F$3)","v":871}]
["2019-12-01",{"$f":"SUMIFS(OFFSET(REL_D,,MATCH($B$6,IND,0)-1),REL_D,$A53,IF($E$3,NwID,OrgID),$F$3)","v":958},{"$f":"SUMIFS(OFFSET(REL_D,,MATCH($C$6,IND,0)-1),REL_D,$A53,IF($E$3,NwID,OrgID),$F$3)","v":848},{"$f":"SUMIFS(OFFSET(REL_D,,MATCH($D$6,IND,0)-1),REL_D,$A53,IF($E$3,NwID,OrgID),$F$3)","v":853},{"$f":"SUMIFS(OFFSET(REL_D,,MATCH($E$6,IND,0)-1),REL_D,$A53,IF($E$3,NwID,OrgID),$F$3)","v":862}]
["2020-01-01",{"$f":"SUMIFS(OFFSET(REL_D,,MATCH($B$6,IND,0)-1),REL_D,$A54,IF($E$3,NwID,OrgID),$F$3)","v":870},{"$f":"SUMIFS(OFFSET(REL_D,,MATCH($C$6,IND,0)-1),REL_D,$A54,IF($E$3,NwID,OrgID),$F$3)","v":774},{"$f":"SUMIFS(OFFSET(REL_D,,MATCH($D$6,IND,0)-1),REL_D,$A54,IF($E$3,NwID,OrgID),$F$3)","v":768},{"$f":"SUMIFS(OFFSET(REL_D,,MATCH($E$6,IND,0)-1),REL_D,$A54,IF($E$3,NwID,OrgID),$F$3)","v":779}]
["2020-02-01",{"$f":"SUMIFS(OFFSET(REL_D,,MATCH($B$6,IND,0)-1),REL_D,$A55,IF($E$3,NwID,OrgID),$F$3)","v":854},{"$f":"SUMIFS(OFFSET(REL_D,,MATCH($C$6,IND,0)-1),REL_D,$A55,IF($E$3,NwID,OrgID),$F$3)","v":764},{"$f":"SUMIFS(OFFSET(REL_D,,MATCH($D$6,IND,0)-1),REL_D,$A55,IF($E$3,NwID,OrgID),$F$3)","v":758},{"$f":"SUMIFS(OFFSET(REL_D,,MATCH($E$6,IND,0)-1),REL_D,$A55,IF($E$3,NwID,OrgID),$F$3)","v":768}]
["2020-03-01",{"$f":"SUMIFS(OFFSET(REL_D,,MATCH($B$6,IND,0)-1),REL_D,$A56,IF($E$3,NwID,OrgID),$F$3)","v":858},{"$f":"SUMIFS(OFFSET(REL_D,,MATCH($C$6,IND,0)-1),REL_D,$A56,IF($E$3,NwID,OrgID),$F$3)","v":768},{"$f":"SUMIFS(OFFSET(REL_D,,MATCH($D$6,IND,0)-1),REL_D,$A56,IF($E$3,NwID,OrgID),$F$3)","v":761},{"$f":"SUMIFS(OFFSET(REL_D,,MATCH($E$6,IND,0)-1),REL_D,$A56,IF($E$3,NwID,OrgID),$F$3)","v":772}]
["2020-04-01",{"$f":"SUMIFS(OFFSET(REL_D,,MATCH($B$6,IND,0)-1),REL_D,$A57,IF($E$3,NwID,OrgID),$F$3)","v":941},{"$f":"SUMIFS(OFFSET(REL_D,,MATCH($C$6,IND,0)-1),REL_D,$A57,IF($E$3,NwID,OrgID),$F$3)","v":847},{"$f":"SUMIFS(OFFSET(REL_D,,MATCH($D$6,IND,0)-1),REL_D,$A57,IF($E$3,NwID,OrgID),$F$3)","v":840},{"$f":"SUMIFS(OFFSET(REL_D,,MATCH($E$6,IND,0)-1),REL_D,$A57,IF($E$3,NwID,OrgID),$F$3)","v":854}]
["2020-05-01",{"$f":"SUMIFS(OFFSET(REL_D,,MATCH($B$6,IND,0)-1),REL_D,$A58,IF($E$3,NwID,OrgID),$F$3)","v":940},{"$f":"SUMIFS(OFFSET(REL_D,,MATCH($C$6,IND,0)-1),REL_D,$A58,IF($E$3,NwID,OrgID),$F$3)","v":847},{"$f":"SUMIFS(OFFSET(REL_D,,MATCH($D$6,IND,0)-1),REL_D,$A58,IF($E$3,NwID,OrgID),$F$3)","v":840},{"$f":"SUMIFS(OFFSET(REL_D,,MATCH($E$6,IND,0)-1),REL_D,$A58,IF($E$3,NwID,OrgID),$F$3)","v":856}]
["2020-06-01",{"$f":"SUMIFS(OFFSET(REL_D,,MATCH($B$6,IND,0)-1),REL_D,$A59,IF($E$3,NwID,OrgID),$F$3)","v":943},{"$f":"SUMIFS(OFFSET(REL_D,,MATCH($C$6,IND,0)-1),REL_D,$A59,IF($E$3,NwID,OrgID),$F$3)","v":847},{"$f":"SUMIFS(OFFSET(REL_D,,MATCH($D$6,IND,0)-1),REL_D,$A59,IF($E$3,NwID,OrgID),$F$3)","v":840},{"$f":"SUMIFS(OFFSET(REL_D,,MATCH($E$6,IND,0)-1),REL_D,$A59,IF($E$3,NwID,OrgID),$F$3)","v":858}]
["2020-07-01",{"$f":"SUMIFS(OFFSET(REL_D,,MATCH($B$6,IND,0)-1),REL_D,$A60,IF($E$3,NwID,OrgID),$F$3)","v":910},{"$f":"SUMIFS(OFFSET(REL_D,,MATCH($C$6,IND,0)-1),REL_D,$A60,IF($E$3,NwID,OrgID),$F$3)","v":796},{"$f":"SUMIFS(OFFSET(REL_D,,MATCH($D$6,IND,0)-1),REL_D,$A60,IF($E$3,NwID,OrgID),$F$3)","v":798},{"$f":"SUMIFS(OFFSET(REL_D,,MATCH($E$6,IND,0)-1),REL_D,$A60,IF($E$3,NwID,OrgID),$F$3)","v":810}]
["2020-08-01",{"$f":"SUMIFS(OFFSET(REL_D,,MATCH($B$6,IND,0)-1),REL_D,$A61,IF($E$3,NwID,OrgID),$F$3)","v":908},{"$f":"SUMIFS(OFFSET(REL_D,,MATCH($C$6,IND,0)-1),REL_D,$A61,IF($E$3,NwID,OrgID),$F$3)","v":793},{"$f":"SUMIFS(OFFSET(REL_D,,MATCH($D$6,IND,0)-1),REL_D,$A61,IF($E$3,NwID,OrgID),$F$3)","v":796},{"$f":"SUMIFS(OFFSET(REL_D,,MATCH($E$6,IND,0)-1),REL_D,$A61,IF($E$3,NwID,OrgID),$F$3)","v":808}]
["2020-09-01",{"$f":"SUMIFS(OFFSET(REL_D,,MATCH($B$6,IND,0)-1),REL_D,$A62,IF($E$3,NwID,OrgID),$F$3)","v":902},{"$f":"SUMIFS(OFFSET(REL_D,,MATCH($C$6,IND,0)-1),REL_D,$A62,IF($E$3,NwID,OrgID),$F$3)","v":792},{"$f":"SUMIFS(OFFSET(REL_D,,MATCH($D$6,IND,0)-1),REL_D,$A62,IF($E$3,NwID,OrgID),$F$3)","v":795},{"$f":"SUMIFS(OFFSET(REL_D,,MATCH($E$6,IND,0)-1),REL_D,$A62,IF($E$3,NwID,OrgID),$F$3)","v":805}]
["2020-10-01",{"$f":"SUMIFS(OFFSET(REL_D,,MATCH($B$6,IND,0)-1),REL_D,$A63,IF($E$3,NwID,OrgID),$F$3)","v":929},{"$f":"SUMIFS(OFFSET(REL_D,,MATCH($C$6,IND,0)-1),REL_D,$A63,IF($E$3,NwID,OrgID),$F$3)","v":799},{"$f":"SUMIFS(OFFSET(REL_D,,MATCH($D$6,IND,0)-1),REL_D,$A63,IF($E$3,NwID,OrgID),$F$3)","v":804},{"$f":"SUMIFS(OFFSET(REL_D,,MATCH($E$6,IND,0)-1),REL_D,$A63,IF($E$3,NwID,OrgID),$F$3)","v":784}]
["2020-11-01",{"$f":"SUMIFS(OFFSET(REL_D,,MATCH($B$6,IND,0)-1),REL_D,$A64,IF($E$3,NwID,OrgID),$F$3)","v":922},{"$f":"SUMIFS(OFFSET(REL_D,,MATCH($C$6,IND,0)-1),REL_D,$A64,IF($E$3,NwID,OrgID),$F$3)","v":795},{"$f":"SUMIFS(OFFSET(REL_D,,MATCH($D$6,IND,0)-1),REL_D,$A64,IF($E$3,NwID,OrgID),$F$3)","v":798},{"$f":"SUMIFS(OFFSET(REL_D,,MATCH($E$6,IND,0)-1),REL_D,$A64,IF($E$3,NwID,OrgID),$F$3)","v":778}]
["2020-12-01",{"$f":"SUMIFS(OFFSET(REL_D,,MATCH($B$6,IND,0)-1),REL_D,$A65,IF($E$3,NwID,OrgID),$F$3)","v":925},{"$f":"SUMIFS(OFFSET(REL_D,,MATCH($C$6,IND,0)-1),REL_D,$A65,IF($E$3,NwID,OrgID),$F$3)","v":800},{"$f":"SUMIFS(OFFSET(REL_D,,MATCH($D$6,IND,0)-1),REL_D,$A65,IF($E$3,NwID,OrgID),$F$3)","v":800},{"$f":"SUMIFS(OFFSET(REL_D,,MATCH($E$6,IND,0)-1),REL_D,$A65,IF($E$3,NwID,OrgID),$F$3)","v":780}]
["2021-01-01",{"$f":"SUMIFS(OFFSET(REL_D,,MATCH($B$6,IND,0)-1),REL_D,$A66,IF($E$3,NwID,OrgID),$F$3)","v":861},{"$f":"SUMIFS(OFFSET(REL_D,,MATCH($C$6,IND,0)-1),REL_D,$A66,IF($E$3,NwID,OrgID),$F$3)","v":743},{"$f":"SUMIFS(OFFSET(REL_D,,MATCH($D$6,IND,0)-1),REL_D,$A66,IF($E$3,NwID,OrgID),$F$3)","v":742},{"$f":"SUMIFS(OFFSET(REL_D,,MATCH($E$6,IND,0)-1),REL_D,$A66,IF($E$3,NwID,OrgID),$F$3)","v":776}]
["2021-02-01",{"$f":"SUMIFS(OFFSET(REL_D,,MATCH($B$6,IND,0)-1),REL_D,$A67,IF($E$3,NwID,OrgID),$F$3)","v":858},{"$f":"SUMIFS(OFFSET(REL_D,,MATCH($C$6,IND,0)-1),REL_D,$A67,IF($E$3,NwID,OrgID),$F$3)","v":743},{"$f":"SUMIFS(OFFSET(REL_D,,MATCH($D$6,IND,0)-1),REL_D,$A67,IF($E$3,NwID,OrgID),$F$3)","v":742},{"$f":"SUMIFS(OFFSET(REL_D,,MATCH($E$6,IND,0)-1),REL_D,$A67,IF($E$3,NwID,OrgID),$F$3)","v":778}]
["2021-03-01",{"$f":"SUMIFS(OFFSET(REL_D,,MATCH($B$6,IND,0)-1),REL_D,$A68,IF($E$3,NwID,OrgID),$F$3)","v":848},{"$f":"SUMIFS(OFFSET(REL_D,,MATCH($C$6,IND,0)-1),REL_D,$A68,IF($E$3,NwID,OrgID),$F$3)","v":737},{"$f":"SUMIFS(OFFSET(REL_D,,MATCH($D$6,IND,0)-1),REL_D,$A68,IF($E$3,NwID,OrgID),$F$3)","v":737},{"$f":"SUMIFS(OFFSET(REL_D,,MATCH($E$6,IND,0)-1),REL_D,$A68,IF($E$3,NwID,OrgID),$F$3)","v":773}]
["2021-04-01",{"$f":"SUMIFS(OFFSET(REL_D,,MATCH($B$6,IND,0)-1),REL_D,$A69,IF($E$3,NwID,OrgID),$F$3)","v":847},{"$f":"SUMIFS(OFFSET(REL_D,,MATCH($C$6,IND,0)-1),REL_D,$A69,IF($E$3,NwID,OrgID),$F$3)","v":710},{"$f":"SUMIFS(OFFSET(REL_D,,MATCH($D$6,IND,0)-1),REL_D,$A69,IF($E$3,NwID,OrgID),$F$3)","v":709},{"$f":"SUMIFS(OFFSET(REL_D,,MATCH($E$6,IND,0)-1),REL_D,$A69,IF($E$3,NwID,OrgID),$F$3)","v":741}]
["2021-05-01",{"$f":"SUMIFS(OFFSET(REL_D,,MATCH($B$6,IND,0)-1),REL_D,$A70,IF($E$3,NwID,OrgID),$F$3)","v":846},{"$f":"SUMIFS(OFFSET(REL_D,,MATCH($C$6,IND,0)-1),REL_D,$A70,IF($E$3,NwID,OrgID),$F$3)","v":710},{"$f":"SUMIFS(OFFSET(REL_D,,MATCH($D$6,IND,0)-1),REL_D,$A70,IF($E$3,NwID,OrgID),$F$3)","v":710},{"$f":"SUMIFS(OFFSET(REL_D,,MATCH($E$6,IND,0)-1),REL_D,$A70,IF($E$3,NwID,OrgID),$F$3)","v":741}]
["2021-06-01",{"$f":"SUMIFS(OFFSET(REL_D,,MATCH($B$6,IND,0)-1),REL_D,$A71,IF($E$3,NwID,OrgID),$F$3)","v":1026},{"$f":"SUMIFS(OFFSET(REL_D,,MATCH($C$6,IND,0)-1),REL_D,$A71,IF($E$3,NwID,OrgID),$F$3)","v":871},{"$f":"SUMIFS(OFFSET(REL_D,,MATCH($D$6,IND,0)-1),REL_D,$A71,IF($E$3,NwID,OrgID),$F$3)","v":870},{"$f":"SUMIFS(OFFSET(REL_D,,MATCH($E$6,IND,0)-1),REL_D,$A71,IF($E$3,NwID,OrgID),$F$3)","v":895}]
["2021-07-01",{"$f":"SUMIFS(OFFSET(REL_D,,MATCH($B$6,IND,0)-1),REL_D,$A72,IF($E$3,NwID,OrgID),$F$3)","v":1044},{"$f":"SUMIFS(OFFSET(REL_D,,MATCH($C$6,IND,0)-1),REL_D,$A72,IF($E$3,NwID,OrgID),$F$3)","v":908},{"$f":"SUMIFS(OFFSET(REL_D,,MATCH($D$6,IND,0)-1),REL_D,$A72,IF($E$3,NwID,OrgID),$F$3)","v":894},{"$f":"SUMIFS(OFFSET(REL_D,,MATCH($E$6,IND,0)-1),REL_D,$A72,IF($E$3,NwID,OrgID),$F$3)","v":922}]
["2021-08-01",{"$f":"SUMIFS(OFFSET(REL_D,,MATCH($B$6,IND,0)-1),REL_D,$A73,IF($E$3,NwID,OrgID),$F$3)","v":1057},{"$f":"SUMIFS(OFFSET(REL_D,,MATCH($C$6,IND,0)-1),REL_D,$A73,IF($E$3,NwID,OrgID),$F$3)","v":931},{"$f":"SUMIFS(OFFSET(REL_D,,MATCH($D$6,IND,0)-1),REL_D,$A73,IF($E$3,NwID,OrgID),$F$3)","v":916},{"$f":"SUMIFS(OFFSET(REL_D,,MATCH($E$6,IND,0)-1),REL_D,$A73,IF($E$3,NwID,OrgID),$F$3)","v":934}]
["2021-09-01",{"$f":"SUMIFS(OFFSET(REL_D,,MATCH($B$6,IND,0)-1),REL_D,$A74,IF($E$3,NwID,OrgID),$F$3)","v":1058},{"$f":"SUMIFS(OFFSET(REL_D,,MATCH($C$6,IND,0)-1),REL_D,$A74,IF($E$3,NwID,OrgID),$F$3)","v":934},{"$f":"SUMIFS(OFFSET(REL_D,,MATCH($D$6,IND,0)-1),REL_D,$A74,IF($E$3,NwID,OrgID),$F$3)","v":917},{"$f":"SUMIFS(OFFSET(REL_D,,MATCH($E$6,IND,0)-1),REL_D,$A74,IF($E$3,NwID,OrgID),$F$3)","v":936}]
["2021-10-01",{"$f":"SUMIFS(OFFSET(REL_D,,MATCH($B$6,IND,0)-1),REL_D,$A75,IF($E$3,NwID,OrgID),$F$3)","v":967},{"$f":"SUMIFS(OFFSET(REL_D,,MATCH($C$6,IND,0)-1),REL_D,$A75,IF($E$3,NwID,OrgID),$F$3)","v":875},{"$f":"SUMIFS(OFFSET(REL_D,,MATCH($D$6,IND,0)-1),REL_D,$A75,IF($E$3,NwID,OrgID),$F$3)","v":859},{"$f":"SUMIFS(OFFSET(REL_D,,MATCH($E$6,IND,0)-1),REL_D,$A75,IF($E$3,NwID,OrgID),$F$3)","v":884}]
["2021-11-01",{"$f":"SUMIFS(OFFSET(REL_D,,MATCH($B$6,IND,0)-1),REL_D,$A76,IF($E$3,NwID,OrgID),$F$3)","v":957},{"$f":"SUMIFS(OFFSET(REL_D,,MATCH($C$6,IND,0)-1),REL_D,$A76,IF($E$3,NwID,OrgID),$F$3)","v":867},{"$f":"SUMIFS(OFFSET(REL_D,,MATCH($D$6,IND,0)-1),REL_D,$A76,IF($E$3,NwID,OrgID),$F$3)","v":850},{"$f":"SUMIFS(OFFSET(REL_D,,MATCH($E$6,IND,0)-1),REL_D,$A76,IF($E$3,NwID,OrgID),$F$3)","v":874}]
["2021-12-01",{"$f":"SUMIFS(OFFSET(REL_D,,MATCH($B$6,IND,0)-1),REL_D,$A77,IF($E$3,NwID,OrgID),$F$3)","v":962},{"$f":"SUMIFS(OFFSET(REL_D,,MATCH($C$6,IND,0)-1),REL_D,$A77,IF($E$3,NwID,OrgID),$F$3)","v":876},{"$f":"SUMIFS(OFFSET(REL_D,,MATCH($D$6,IND,0)-1),REL_D,$A77,IF($E$3,NwID,OrgID),$F$3)","v":857},{"$f":"SUMIFS(OFFSET(REL_D,,MATCH($E$6,IND,0)-1),REL_D,$A77,IF($E$3,NwID,OrgID),$F$3)","v":877}]
["2022-01-01",{"$f":"SUMIFS(OFFSET(REL_D,,MATCH($B$6,IND,0)-1),REL_D,$A78,IF($E$3,NwID,OrgID),$F$3)","v":932},{"$f":"SUMIFS(OFFSET(REL_D,,MATCH($C$6,IND,0)-1),REL_D,$A78,IF($E$3,NwID,OrgID),$F$3)","v":851},{"$f":"SUMIFS(OFFSET(REL_D,,MATCH($D$6,IND,0)-1),REL_D,$A78,IF($E$3,NwID,OrgID),$F$3)","v":832},{"$f":"SUMIFS(OFFSET(REL_D,,MATCH($E$6,IND,0)-1),REL_D,$A78,IF($E$3,NwID,OrgID),$F$3)","v":852}]
["2022-02-01",{"$f":"SUMIFS(OFFSET(REL_D,,MATCH($B$6,IND,0)-1),REL_D,$A79,IF($E$3,NwID,OrgID),$F$3)","v":950},{"$f":"SUMIFS(OFFSET(REL_D,,MATCH($C$6,IND,0)-1),REL_D,$A79,IF($E$3,NwID,OrgID),$F$3)","v":845},{"$f":"SUMIFS(OFFSET(REL_D,,MATCH($D$6,IND,0)-1),REL_D,$A79,IF($E$3,NwID,OrgID),$F$3)","v":831},{"$f":"SUMIFS(OFFSET(REL_D,,MATCH($E$6,IND,0)-1),REL_D,$A79,IF($E$3,NwID,OrgID),$F$3)","v":865}]
["2022-03-01",{"$f":"SUMIFS(OFFSET(REL_D,,MATCH($B$6,IND,0)-1),REL_D,$A80,IF($E$3,NwID,OrgID),$F$3)","v":944},{"$f":"SUMIFS(OFFSET(REL_D,,MATCH($C$6,IND,0)-1),REL_D,$A80,IF($E$3,NwID,OrgID),$F$3)","v":844},{"$f":"SUMIFS(OFFSET(REL_D,,MATCH($D$6,IND,0)-1),REL_D,$A80,IF($E$3,NwID,OrgID),$F$3)","v":833},{"$f":"SUMIFS(OFFSET(REL_D,,MATCH($E$6,IND,0)-1),REL_D,$A80,IF($E$3,NwID,OrgID),$F$3)","v":865}]

{"sheet":"Rows","index":6,"n_rows":0,"n_cols":0,"rows_kept":0,"cut":false,"hidden":true,"merged":[]}

{"sheet":"Lookup","index":7,"n_rows":40,"n_cols":24,"rows_kept":40,"cut":false,"hidden":true,"merged":[]}
["listsize.csv","All Patients"]
["(01)_12_MONTH_COHORT.csv","(01) 12 MONTH COHORT"]
["(01.01)_DTaP_IPV_Hib_HepB.csv","(01.01) DTaP/IPV/Hib 6in1"]
["(01.02)_Men_B_(1st_and_2nd).csv","(01.02) Men B (1st and 2nd)"]
["(01.03)_PCV.csv","(01.03) PCV"]
["(01.04)_Rotavirus.csv","(01.04) Rotavirus"]
["(01.05)_BCG.csv","(01.05) BCG"]
["(02)_24_MONTH_COHORT.csv","(02) 24 MONTH COHORT"]
["(02.01)_DTaP_IPV_Hib_or_DTaP_IPV_Hib_HepB.csv","(02.01) DTaP/IPV/Hib Combined"]
["(02.02)_MMR.csv","(02.02) MMR"]
["(02.03)_HiB_Men_C.csv","(02.03) HiB/Men C"]
["(02.04)_PCV_(Booster).csv","(02.04) PCV (Booster)"]
["(03)_5_YEAR_COHORT.csv","(03) 5 YEAR COHORT"]
["(03.01)_DTaP_IPV_Hib_or_DTaP_IPV_Hib_HepB.csv","(03.01) DTaP/IPV/Hib Combined"]
["(03.02)_MMR_(Primary).csv","(03.02) MMR (Primary)"]
[null,"(03.03) DTaP/IPV (Booster)"]
["(03.04)_HiB_Men_C.csv","(03.04) HiB/Men C"]
[null,"(03.05) MMR (Booster)"]
["(02.05)_Men_B_(Booster).csv","(02.05) Men B (Booster)"]
[]
[]
["listsize_(WF_Dashboards_CEG___COVER_Audit_Child_Imms).csv","All Patients",null,null,null,"listsize_(WF_Dashboards_CEG___COVER_Audit_Child_Imms).csv","(01)_12_MONTH_COHORT_(WF_Dashboards_CEG___COVER_Audit_Child_Imms).csv","(01.01)_DTaP_IPV_Hib_HepB_(WF_Dashboards_CEG___COVER_Audit_Child_Imms).csv","(01.02)_Men_B_(1st_and_2nd)_(WF_Dashboards_CEG___COVER_Audit_Child_Imms).csv","(01.03)_PCV_(WF_Dashboards_CEG___COVER_Audit_Child_Imms).csv","(01.04)_Rotavirus_(WF_Dashboards_CEG___COVER_Audit_Child_Imms).csv","(01.05)_BCG_(WF_Dashboards_CEG___COVER_Audit_Child_Imms).csv","(02)_24_MONTH_COHORT_(WF_Dashboards_CEG___COVER_Audit_Child_Imms).csv","(02.01)_DTaP_IPV_Hib_or_DTaP_IPV_Hib_HepB_(WF_Dashboards_CEG___COVER_Audit_Child_Imms).csv","(02.02)_MMR_(WF_Dashboards_CEG___COVER_Audit_Child_Imms).csv","(02.03)_HiB_Men_C_(WF_Dashboards_CEG___COVER_Audit_Child_Imms).csv","(02.04)_PCV_(Booster)_(WF_Dashboards_CEG___COVER_Audit_Child_Imms).csv","(02.05)_Men_B_(Booster)_(WF_Dashboards_CEG___COVER_Audit_Child_Imms).csv","(03)_5_YEAR_COHORT_(WF_Dashboards_CEG___COVER_Audit_Child_Imms).csv","(03.01)_DTaP_IPV_Hib_or_DTaP_IPV_Hib_HepB_(WF_Dashboards_CEG___COVER_Audit_Child_Imms).csv","(03.02)_MMR_(Primary)_(WF_Dashboards_CEG___COVER_Audit_Child_Imms).csv","(03.03)_DTaP_IPV_(Booster)_(WF_Dashboards_CEG___COVER_Audit_Child_Imms).csv","(03.04)_HiB_Men_C_(WF_Dashboards_CEG___COVER_Audit_Child_Imms).csv","(03.05)_MMR_(Booster)_(WF_Dashboards_CEG___COVER_Audit_Child_Imms).csv"]
["(01)_12_MONTH_COHORT_(WF_Dashboards_CEG___COVER_Audit_Child_Imms).csv","(01) 12 MONTH COHORT",null,null,"F86004",{"$f":"VLOOKUP($E23,_S1[#All],MATCH(Lookup!F$22,_S1[#Headers],0),FALSE)","v":15970},{"$f":"VLOOKUP($E23,_S1[#All],MATCH(Lookup!G$22,_S1[#Headers],0),FALSE)","v":51},{"$f":"VLOOKUP($E23,_S1[#All],MATCH(Lookup!H$22,_S1[#Headers],0),FALSE)","v":47},{"$f":"VLOOKUP($E23,_S1[#All],MATCH(Lookup!I$22,_S1[#Headers],0),FALSE)","v":46},{"$f":"VLOOKUP($E23,_S1[#All],MATCH(Lookup!J$22,_S1[#Headers],0),FALSE)","v":46},{"$f":"VLOOKUP($E23,_S1[#All],MATCH(Lookup!K$22,_S1[#Headers],0),FALSE)","v":46},{"$f":"VLOOKUP($E23,_S1[#All],MATCH(Lookup!L$22,_S1[#Headers],0),FALSE)","v":9},{"$f":"VLOOKUP($E23,_S1[#All],MATCH(Lookup!M$22,_S1[#Headers],0),FALSE)","v":53},{"$f":"VLOOKUP($E23,_S1[#All],MATCH(Lookup!N$22,_S1[#Headers],0),FALSE)","v":50},{"$f":"VLOOKUP($E23,_S1[#All],MATCH(Lookup!O$22,_S1[#Headers],0),FALSE)","v":27},{"$f":"VLOOKUP($E23,_S1[#All],MATCH(Lookup!P$22,_S1[#Headers],0),FALSE)","v":53},{"$f":"VLOOKUP($E23,_S1[#All],MATCH(Lookup!Q$22,_S1[#Headers],0),FALSE)","v":53},{"$f":"VLOOKUP($E23,_S1[#All],MATCH(Lookup!R$22,_S1[#Headers],0),FALSE)","v":52},{"$f":"VLOOKUP($E23,_S1[#All],MATCH(Lookup!S$22,_S1[#Headers],0),FALSE)","v":58},{"$f":"VLOOKUP($E23,_S1[#All],MATCH(Lookup!T$22,_S1[#Headers],0),FALSE)","v":37},{"$f":"VLOOKUP($E23,_S1[#All],MATCH(Lookup!U$22,_S1[#Headers],0),FALSE)","v":36},{"$f":"VLOOKUP($E23,_S1[#All],MATCH(Lookup!V$22,_S1[#Headers],0),FALSE)","v":47},{"$f":"VLOOKUP($E23,_S1[#All],MATCH(Lookup!W$22,_S1[#Headers],0),FALSE)","v":41},{"$f":"VLOOKUP($E23,_S1[#All],MATCH(Lookup!X$22,_S1[#Headers],0),FALSE)","v":2}]
["(01.01)_DTaP_IPV_Hib_HepB_(WF_Dashboards_CEG___COVER_Audit_Child_Imms).csv","(01.01) DTaP/IPV/Hib 6in1",null,null,"F86018",{"$f":"VLOOKUP($E24,_S1[#All],MATCH(Lookup!F$22,_S1[#Headers],0),FALSE)","v":9966},{"$f":"VLOOKUP($E24,_S1[#All],MATCH(Lookup!G$22,_S1[#Headers],0),FALSE)","v":17},{"$f":"VLOOKUP($E24,_S1[#All],MATCH(Lookup!H$22,_S1[#Headers],0),FALSE)","v":17},{"$f":"VLOOKUP($E24,_S1[#All],MATCH(Lookup!I$22,_S1[#Headers],0),FALSE)","v":16},{"$f":"VLOOKUP($E24,_S1[#All],MATCH(Lookup!J$22,_S1[#Headers],0),FALSE)","v":16},{"$f":"VLOOKUP($E24,_S1[#All],MATCH(Lookup!K$22,_S1[#Headers],0),FALSE)","v":0},{"$f":"VLOOKUP($E24,_S1[#All],MATCH(Lookup!L$22,_S1[#Headers],0),FALSE)","v":3},{"$f":"VLOOKUP($E24,_S1[#All],MATCH(Lookup!M$22,_S1[#Headers],0),FALSE)","v":30},{"$f":"VLOOKUP($E24,_S1[#All],MATCH(Lookup!N$22,_S1[#Headers],0),FALSE)","v":27},{"$f":"VLOOKUP($E24,_S1[#All],MATCH(Lookup!O$22,_S1[#Headers],0),FALSE)","v":2},{"$f":"VLOOKUP($E24,_S1[#All],MATCH(Lookup!P$22,_S1[#Headers],0),FALSE)","v":25},{"$f":"VLOOKUP($E24,_S1[#All],MATCH(Lookup!Q$22,_S1[#Headers],0),FALSE)","v":26},{"$f":"VLOOKUP($E24,_S1[#All],MATCH(Lookup!R$22,_S1[#Headers],0),FALSE)","v":26},{"$f":"VLOOKUP($E24,_S1[#All],MATCH(Lookup!S$22,_S1[#Headers],0),FALSE)","v":28},{"$f":"VLOOKUP($E24,_S1[#All],MATCH(Lookup!T$22,_S1[#Headers],0),FALSE)","v":18},{"$f":"VLOOKUP($E24,_S1[#All],MATCH(Lookup!U$22,_S1[#Headers],0),FALSE)","v":8},{"$f":"VLOOKUP($E24,_S1[#All],MATCH(Lookup!V$22,_S1[#Headers],0),FALSE)","v":15},{"$f":"VLOOKUP($E24,_S1[#All],MATCH(Lookup!W$22,_S1[#Headers],0),FALSE)","v":21},{"$f":"VLOOKUP($E24,_S1[#All],MATCH(Lookup!X$22,_S1[#Headers],0),FALSE)","v":2}]
["(01.02)_Men_B_(1st_and_2nd)_(WF_Dashboards_CEG___COVER_Audit_Child_Imms).csv","(01.02) Men B (1st and 2nd)",null,null,"F86026",{"$f":"VLOOKUP($E25,_S1[#All],MATCH(Lookup!F$22,_S1[#Headers],0),FALSE)","v":7223},{"$f":"VLOOKUP($E25,_S1[#All],MATCH(Lookup!G$22,_S1[#Headers],0),FALSE)","v":11},{"$f":"VLOOKUP($E25,_S1[#All],MATCH(Lookup!H$22,_S1[#Headers],0),FALSE)","v":9},{"$f":"VLOOKUP($E25,_S1[#All],MATCH(Lookup!I$22,_S1[#Headers],0),FALSE)","v":9},{"$f":"VLOOKUP($E25,_S1[#All],MATCH(Lookup!J$22,_S1[#Headers],0),FALSE)","v":9},{"$f":"VLOOKUP($E25,_S1[#All],MATCH(Lookup!K$22,_S1[#Headers],0),FALSE)","v":8},{"$f":"VLOOKUP($E25,_S1[#All],MATCH(Lookup!L$22,_S1[#Headers],0),FALSE)","v":0},{"$f":"VLOOKUP($E25,_S1[#All],MATCH(Lookup!M$22,_S1[#Headers],0),FALSE)","v":21},{"$f":"VLOOKUP($E25,_S1[#All],MATCH(Lookup!N$22,_S1[#Headers],0),FALSE)","v":17},{"$f":"VLOOKUP($E25,_S1[#All],MATCH(Lookup!O$22,_S1[#Headers],0),FALSE)","v":1},{"$f":"VLOOKUP($E25,_S1[#All],MATCH(Lookup!P$22,_S1[#Headers],0),FALSE)","v":17},{"$f":"VLOOKUP($E25,_S1[#All],MATCH(Lookup!Q$22,_S1[#Headers],0),FALSE)","v":18},{"$f":"VLOOKUP($E25,_S1[#All],MATCH(Lookup!R$22,_S1[#Headers],0),FALSE)","v":17},{"$f":"VLOOKUP($E25,_S1[#All],MATCH(Lookup!S$22,_S1[#Headers],0),FALSE)","v":22},{"$f":"VLOOKUP($E25,_S1[#All],MATCH(Lookup!T$22,_S1[#Headers],0),FALSE)","v":8},{"$f":"VLOOKUP($E25,_S1[#All],MATCH(Lookup!U$22,_S1[#Headers],0),FALSE)","v":8},{"$f":"VLOOKUP($E25,_S1[#All],MATCH(Lookup!V$22,_S1[#Headers],0),FALSE)","v":14},{"$f":"VLOOKUP($E25,_S1[#All],MATCH(Lookup!W$22,_S1[#Headers],0),FALSE)","v":10},{"$f":"VLOOKUP($E25,_S1[#All],MATCH(Lookup!X$22,_S1[#Headers],0),FALSE)","v":0}]
["(01.03)_PCV_(WF_Dashboards_CEG___COVER_Audit_Child_Imms).csv","(01.03) PCV",null,null,"F86074",{"$f":"VLOOKUP($E26,_S1[#All],MATCH(Lookup!F$22,_S1[#Headers],0),FALSE)","v":15092},{"$f":"VLOOKUP($E26,_S1[#All],MATCH(Lookup!G$22,_S1[#Headers],0),FALSE)","v":39},{"$f":"VLOOKUP($E26,_S1[#All],MATCH(Lookup!H$22,_S1[#Headers],0),FALSE)","v":37},{"$f":"VLOOKUP($E26,_S1[#All],MATCH(Lookup!I$22,_S1[#Headers],0),FALSE)","v":34},{"$f":"VLOOKUP($E26,_S1[#All],MATCH(Lookup!J$22,_S1[#Headers],0),FALSE)","v":34},{"$f":"VLOOKUP($E26,_S1[#All],MATCH(Lookup!K$22,_S1[#Headers],0),FALSE)","v":25},{"$f":"VLOOKUP($E26,_S1[#All],MATCH(Lookup!L$22,_S1[#Headers],0),FALSE)","v":7},{"$f":"VLOOKUP($E26,_S1[#All],MATCH(Lookup!M$22,_S1[#Headers],0),FALSE)","v":52},{"$f":"VLOOKUP($E26,_S1[#All],MATCH(Lookup!N$22,_S1[#Headers],0),FALSE)","v":42},{"$f":"VLOOKUP($E26,_S1[#All],MATCH(Lookup!O$22,_S1[#Headers],0),FALSE)","v":17},{"$f":"VLOOKUP($E26,_S1[#All],MATCH(Lookup!P$22,_S1[#Headers],0),FALSE)","v":32},{"$f":"VLOOKUP($E26,_S1[#All],MATCH(Lookup!Q$22,_S1[#Headers],0),FALSE)","v":43},{"$f":"VLOOKUP($E26,_S1[#All],MATCH(Lookup!R$22,_S1[#Headers],0),FALSE)","v":43},{"$f":"VLOOKUP($E26,_S1[#All],MATCH(Lookup!S$22,_S1[#Headers],0),FALSE)","v":53},{"$f":"VLOOKUP($E26,_S1[#All],MATCH(Lookup!T$22,_S1[#Headers],0),FALSE)","v":29},{"$f":"VLOOKUP($E26,_S1[#All],MATCH(Lookup!U$22,_S1[#Headers],0),FALSE)","v":30},{"$f":"VLOOKUP($E26,_S1[#All],MATCH(Lookup!V$22,_S1[#Headers],0),FALSE)","v":33},{"$f":"VLOOKUP($E26,_S1[#All],MATCH(Lookup!W$22,_S1[#Headers],0),FALSE)","v":31},{"$f":"VLOOKUP($E26,_S1[#All],MATCH(Lookup!X$22,_S1[#Headers],0),FALSE)","v":0}]
["(01.04)_Rotavirus_(WF_Dashboards_CEG___COVER_Audit_Child_Imms).csv","(01.04) Rotavirus",null,null,"F86638",{"$f":"VLOOKUP($E27,_S1[#All],MATCH(Lookup!F$22,_S1[#Headers],0),FALSE)","v":5199},{"$f":"VLOOKUP($E27,_S1[#All],MATCH(Lookup!G$22,_S1[#Headers],0),FALSE)","v":17},{"$f":"VLOOKUP($E27,_S1[#All],MATCH(Lookup!H$22,_S1[#Headers],0),FALSE)","v":12},{"$f":"VLOOKUP($E27,_S1[#All],MATCH(Lookup!I$22,_S1[#Headers],0),FALSE)","v":12},{"$f":"VLOOKUP($E27,_S1[#All],MATCH(Lookup!J$22,_S1[#Headers],0),FALSE)","v":12},{"$f":"VLOOKUP($E27,_S1[#All],MATCH(Lookup!K$22,_S1[#Headers],0),FALSE)","v":1},{"$f":"VLOOKUP($E27,_S1[#All],MATCH(Lookup!L$22,_S1[#Headers],0),FALSE)","v":2},{"$f":"VLOOKUP($E27,_S1[#All],MATCH(Lookup!M$22,_S1[#Headers],0),FALSE)","v":18},{"$f":"VLOOKUP($E27,_S1[#All],MATCH(Lookup!N$22,_S1[#Headers],0),FALSE)","v":13},{"$f":"VLOOKUP($E27,_S1[#All],MATCH(Lookup!O$22,_S1[#Headers],0),FALSE)","v":1},{"$f":"VLOOKUP($E27,_S1[#All],MATCH(Lookup!P$22,_S1[#Headers],0),FALSE)","v":12},{"$f":"VLOOKUP($E27,_S1[#All],MATCH(Lookup!Q$22,_S1[#Headers],0),FALSE)","v":13},{"$f":"VLOOKUP($E27,_S1[#All],MATCH(Lookup!R$22,_S1[#Headers],0),FALSE)","v":14},{"$f":"VLOOKUP($E27,_S1[#All],MATCH(Lookup!S$22,_S1[#Headers],0),FALSE)","v":20},{"$f":"VLOOKUP($E27,_S1[#All],MATCH(Lookup!T$22,_S1[#Headers],0),FALSE)","v":14},{"$f":"VLOOKUP($E27,_S1[#All],MATCH(Lookup!U$22,_S1[#Headers],0),FALSE)","v":2},{"$f":"VLOOKUP($E27,_S1[#All],MATCH(Lookup!V$22,_S1[#Headers],0),FALSE)","v":9},{"$f":"VLOOKUP($E27,_S1[#All],MATCH(Lookup!W$22,_S1[#Headers],0),FALSE)","v":16},{"$f":"VLOOKUP($E27,_S1[#All],MATCH(Lookup!X$22,_S1[#Headers],0),FALSE)","v":1}]
["(01.05)_BCG_(WF_Dashboards_CEG___COVER_Audit_Child_Imms).csv","(01.05) BCG"]
["(02)_24_MONTH_COHORT_(WF_Dashboards_CEG___COVER_Audit_Child_Imms).csv","(02) 24 MONTH COHORT",null,null,null,"All Patients","(01) 12 MONTH COHORT","(01.01) DTaP/IPV/Hib 6in1","(01.02) Men B (1st and 2nd)","(01.03) PCV","(01.04) Rotavirus","(01.05) BCG","(02) 24 MONTH COHORT","(02.01) DTaP/IPV/Hib Combined","(02.02) MMR","(02.03) HiB/Men C","(02.04) PCV (Booster)","(02.05) Men B (Booster)","(03) 5 YEAR COHORT","(03.01) DTaP/IPV/Hib Combined","(03.02) MMR (Primary)","(03.03) DTaP/IPV (Booster)","(03.04) HiB/Men C","(03.05) MMR (Booster)"]
["(02.01)_DTaP_IPV_Hib_or_DTaP_IPV_Hib_HepB_(WF_Dashboards_CEG___COVER_Audit_Child_Imms).csv","(02.01) DTaP/IPV/Hib Combined"]
["(02.02)_MMR_(WF_Dashboards_CEG___COVER_Audit_Child_Imms).csv","(02.02) MMR"]
["(02.03)_HiB_Men_C_(WF_Dashboards_CEG___COVER_Audit_Child_Imms).csv","(02.03) HiB/Men C",null,null,null,null,null,"_(WF_Dashboards_CEG___COVER_Audit_Child_Imms).csv"]
["(02.04)_PCV_(Booster)_(WF_Dashboards_CEG___COVER_Audit_Child_Imms).csv","(02.04) PCV (Booster)"]
["(03)_5_YEAR_COHORT_(WF_Dashboards_CEG___COVER_Audit_Child_Imms).csv","(03) 5 YEAR COHORT"]
["(03.01)_DTaP_IPV_Hib_or_DTaP_IPV_Hib_HepB_(WF_Dashboards_CEG___COVER_Audit_Child_Imms).csv","(03.01) DTaP/IPV/Hib Combined"]
["(03.02)_MMR_(Primary)_(WF_Dashboards_CEG___COVER_Audit_Child_Imms).csv","(03.02) MMR (Primary)",null,null,null,null,"_(WF_Dashboards_CEG___COVER_Audit_Child_Imms).csv"]
["(03.03)_DTaP_IPV_(Booster)_(WF_Dashboards_CEG___COVER_Audit_Child_Imms).csv","(03.03) DTaP/IPV (Booster)"]
["(03.04)_HiB_Men_C_(WF_Dashboards_CEG___COVER_Audit_Child_Imms).csv","(03.04) HiB/Men C"]
["(03.05)_MMR_(Booster)_(WF_Dashboards_CEG___COVER_Audit_Child_Imms).csv","(03.05) MMR (Booster)"]
["(02.05)_Men_B_(Booster)_(WF_Dashboards_CEG___COVER_Audit_Child_Imms).csv","(02.05) Men B (Booster)"]

{"sheet":"Data","index":8,"n_rows":1435,"n_cols":30,"rows_kept":1435,"cut":false,"hidden":true,"merged":[]}
["2019-04-01",{"$f":"VLOOKUP(J1,'Control Panel'!$G$132:$K$171,5,FALSE)","v":{"$error":"#N/A"}},"Childhood Immunisations Q1",null,"Last Run:",null,"Population Count",283256,null,null,"Search","All Patients","(01) 12 MONTH COHORT","(01.01) DTaP/IPV/Hib 6in1","(01.02) Men B (1st and 2nd)","(01.03) PCV","(01.04) Rotavirus","(01.05) BCG","(02) 24 MONTH COHORT","(02.01) DTaP/IPV/Hib or DTaP/IPV/Hib/HepB","(02.02) MMR","(02.03) HiB/Men C","(02.04) PCV (Booster)","(02.05) Men B (Booster)","(03) 5 YEAR COHORT","(03.01) DTaP/IPV/Hib or DTaP/IPV/Hib/HepB","(03.02) MMR (Primary)","(03.03) DTaP/IPV (Booster)","(03.04) HiB/Men C","(03.05) MMR (Booster)"]
["2019-04-01",{"$f":"VLOOKUP(J2,'Control Panel'!$G$132:$K$171,5,FALSE)","v":{"$error":"#N/A"}},null,null,"2019-05-14T11:19:00",null,"Males",144492,null,"Organisation Code"]
["2019-04-01",{"$f":"VLOOKUP(J3,'Control Panel'!$G$132:$K$171,5,FALSE)","v":"WF-6"},"WF",null,"Relative Date:",null,"Females",138764,null,"F86001",null,7940,21,21,21,21,19,3,30,25,20,20,20,20,22,17,15,10,16,12]
["2019-04-01",{"$f":"VLOOKUP(J4,'Control Panel'!$G$132:$K$171,5,FALSE)","v":"WF-1"},"WF",null,"2019-05-01",null,null,null,null,"F86005",null,8200,54,45,45,46,47,3,31,31,30,29,29,30,28,27,26,19,26,20]
["2019-04-01",{"$f":"VLOOKUP(J5,'Control Panel'!$G$132:$K$171,5,FALSE)","v":"WF-7"},"WF",null,null,null,null,null,null,"F86006",null,6199,23,17,17,17,18,3,26,24,22,22,23,22,19,17,16,11,15,11]
["2019-04-01",{"$f":"VLOOKUP(J6,'Control Panel'!$G$132:$K$171,5,FALSE)","v":"WF-3"},"WF",null,null,null,null,null,null,"F86011",null,9264,29,22,23,23,20,2,28,23,21,20,21,20,17,14,15,14,14,14]
["2019-04-01",{"$f":"VLOOKUP(J7,'Control Panel'!$G$132:$K$171,5,FALSE)","v":"WF-7"},"WF",null,null,null,null,null,null,"F86030",null,8091,39,34,34,35,33,13,41,40,40,40,40,40,22,20,21,18,21,20]
["2019-04-01",{"$f":"VLOOKUP(J8,'Control Panel'!$G$132:$K$171,5,FALSE)","v":"WF-4"},"WF",null,null,null,null,null,null,"F86036",null,15793,44,41,41,41,40,20,50,48,45,45,45,45,43,39,40,38,39,37]
["2019-04-01",{"$f":"VLOOKUP(J9,'Control Panel'!$G$132:$K$171,5,FALSE)","v":"WF-3"},"WF",null,null,null,null,null,null,"F86038",null,10989,47,37,37,38,37,3,43,38,34,35,35,34,38,32,32,24,30,25]
["2019-04-01",{"$f":"VLOOKUP(J10,'Control Panel'!$G$132:$K$171,5,FALSE)","v":"WF-4"},"WF",null,null,null,null,null,null,"F86044",null,8955,35,27,27,27,26,7,35,27,25,26,26,25,22,16,17,13,16,14]
["2019-04-01",{"$f":"VLOOKUP(J11,'Control Panel'!$G$132:$K$171,5,FALSE)","v":"WF-5"},"WF",null,null,null,null,null,null,"F86045",null,1912,4,4,3,4,4,2,0,0,0,0,0,0,4,4,4,4,3,4]
["2019-04-01",{"$f":"VLOOKUP(J12,'Control Panel'!$G$132:$K$171,5,FALSE)","v":"WF-7"},"WF",null,null,null,null,null,null,"F86058",null,15128,65,51,51,51,53,12,68,55,51,51,52,52,62,55,52,42,53,44]
["2019-04-01",{"$f":"VLOOKUP(J13,'Control Panel'!$G$132:$K$171,5,FALSE)","v":"WF-7"},"WF",null,null,null,null,null,null,"F86062",null,7084,28,24,24,25,25,9,21,19,16,16,16,16,22,20,20,14,19,15]
["2019-04-01",{"$f":"VLOOKUP(J14,'Control Panel'!$G$132:$K$171,5,FALSE)","v":"WF-2"},"WF",null,null,null,null,null,null,"F86078",null,7360,14,13,13,13,10,6,13,13,12,12,12,12,18,18,17,11,17,14]
["2019-04-01",{"$f":"VLOOKUP(J15,'Control Panel'!$G$132:$K$171,5,FALSE)","v":"WF-6"},"WF",null,null,null,null,null,null,"F86086",null,5885,22,20,20,20,19,7,30,26,22,22,22,22,21,6,18,12,17,14]
["2019-04-01",{"$f":"VLOOKUP(J16,'Control Panel'!$G$132:$K$171,5,FALSE)","v":"WF-4"},"WF",null,null,null,null,null,null,"F86088",null,4746,11,9,9,9,9,1,7,6,3,3,4,3,5,3,4,3,5,3]
["2019-04-01",{"$f":"VLOOKUP(J17,'Control Panel'!$G$132:$K$171,5,FALSE)","v":"WF-6"},"WF",null,null,null,null,null,null,"F86607",null,14154,55,48,48,49,48,22,48,45,42,44,42,43,48,46,43,38,42,45]
["2019-04-01",{"$f":"VLOOKUP(J18,'Control Panel'!$G$132:$K$171,5,FALSE)","v":"WF-2"},"WF",null,null,null,null,null,null,"F86616",null,6670,18,13,13,15,15,1,45,39,36,37,37,35,15,13,12,11,11,10]
["2019-04-01",{"$f":"VLOOKUP(J19,'Control Panel'!$G$132:$K$171,5,FALSE)","v":"WF-5"},"WF",null,null,null,null,null,null,"F86621",null,5674,19,17,18,18,19,7,22,21,20,20,20,19,12,2,2,8,2,9]
["2019-04-01",{"$f":"VLOOKUP(J20,'Control Panel'!$G$132:$K$171,5,FALSE)","v":"WF-5"},"WF",null,null,null,null,null,null,"F86625",null,6111,15,12,12,12,12,4,19,17,17,17,17,17,18,17,15,13,4,14]
["2019-04-01",{"$f":"VLOOKUP(J21,'Control Panel'!$G$132:$K$171,5,FALSE)","v":"WF-1"},"WF",null,null,null,null,null,null,"F86626",null,5297,14,11,11,11,13,4,13,13,10,10,11,11,22,22,18,15,13,15]
["2019-04-01",{"$f":"VLOOKUP(J22,'Control Panel'!$G$132:$K$171,5,FALSE)","v":"WF-2"},"WF",null,null,null,null,null,null,"F86627",null,13888,35,31,29,31,27,11,33,33,28,29,29,29,42,36,36,35,35,35]
["2019-04-01",{"$f":"VLOOKUP(J23,'Control Panel'!$G$132:$K$171,5,FALSE)","v":"WF-6"},"WF",null,null,null,null,null,null,"F86644",null,10867,34,25,25,26,24,6,39,36,28,28,30,30,37,32,34,18,30,27]
["2019-04-01",{"$f":"VLOOKUP(J24,'Control Panel'!$G$132:$K$171,5,FALSE)","v":"WF-4"},"WF",null,null,null,null,null,null,"F86650",null,8202,32,24,24,24,23,3,29,26,24,24,24,23,24,20,19,11,20,11]
["2019-04-01",{"$f":"VLOOKUP(J25,'Control Panel'!$G$132:$K$171,5,FALSE)","v":"WF-1"},"WF",null,null,null,null,null,null,"F86664",null,8332,25,22,21,22,23,2,27,25,23,23,24,23,32,30,27,28,28,28]
["2019-04-01",{"$f":"VLOOKUP(J26,'Control Panel'!$G$132:$K$171,5,FALSE)","v":"WF-5"},"WF",null,null,null,null,null,null,"F86666",null,14133,43,39,38,38,38,14,44,41,38,39,39,39,52,43,44,41,43,43]
["2019-04-01",{"$f":"VLOOKUP(J27,'Control Panel'!$G$132:$K$171,5,FALSE)","v":"WF-7"},"WF",null,null,null,null,null,null,"F86679",null,5757,30,27,25,26,27,9,21,18,19,19,20,19,18,6,7,11,8,13]
["2019-04-01",{"$f":"VLOOKUP(J28,'Control Panel'!$G$132:$K$171,5,FALSE)","v":"WF-1"},"WF",null,null,null,null,null,null,"F86689",null,4059,36,36,35,36,36,9,30,25,24,25,25,25,13,7,11,8,11,8]
["2019-04-01",{"$f":"VLOOKUP(J29,'Control Panel'!$G$132:$K$171,5,FALSE)","v":"WF-4"},"WF",null,null,null,null,null,null,"F86696",null,5139,11,10,10,11,10,0,18,13,13,14,13,12,18,16,16,12,16,14]
["2019-04-01",{"$f":"VLOOKUP(J30,'Control Panel'!$G$132:$K$171,5,FALSE)","v":"WF-1"},"WF",null,null,null,null,null,null,"F86700",null,3772,13,12,12,12,12,3,11,11,10,10,10,9,15,15,15,14,15,15]
["2019-04-01",{"$f":"VLOOKUP(J31,'Control Panel'!$G$132:$K$171,5,FALSE)","v":"WF-5"},"WF",null,null,null,null,null,null,"F86701",null,3282,9,9,9,9,9,1,9,9,9,9,9,9,11,6,6,8,5,9]
["2019-04-01",{"$f":"VLOOKUP(J32,'Control Panel'!$G$132:$K$171,5,FALSE)","v":"WF-5"},"WF",null,null,null,null,null,null,"F86705",null,3029,14,13,13,13,13,10,10,10,8,6,6,7,10,10,10,9,9,9]
["2019-04-01",{"$f":"VLOOKUP(J33,'Control Panel'!$G$132:$K$171,5,FALSE)","v":"WF-6"},"WF",null,null,null,null,null,null,"F86708",null,2776,9,9,9,9,8,6,9,8,7,7,7,7,4,4,3,2,3,2]
["2019-04-01",{"$f":"VLOOKUP(J34,'Control Panel'!$G$132:$K$171,5,FALSE)","v":"WF-4"},"WF",null,null,null,null,null,null,"F86712",null,3085,4,3,3,3,3,1,7,6,6,6,6,6,8,2,6,5,6,6]
["2019-04-01",{"$f":"VLOOKUP(J35,'Control Panel'!$G$132:$K$171,5,FALSE)","v":"WF-2"},"WF",null,null,null,null,null,null,"Y01291",null,8792,24,23,23,23,19,4,32,30,29,29,29,29,33,33,32,30,31,30]
["2019-04-01",{"$f":"VLOOKUP(J36,'Control Panel'!$G$132:$K$171,5,FALSE)","v":"WF-1"},"WF",null,null,null,null,null,null,"Y01839",null,6549,32,27,27,27,27,8,23,22,20,21,21,21,30,28,28,24,28,24]
["2019-04-01",{"$f":"VLOOKUP(J37,'Control Panel'!$G$132:$K$171,5,FALSE)","v":"WF-3"},"WF",null,null,null,null,null,null,"Y02585",null,8112,30,21,20,21,20,13,36,30,23,23,25,26,31,30,28,24,29,25]
["2019-04-01",{"$f":"VLOOKUP(J38,'Control Panel'!$G$132:$K$171,5,FALSE)","v":{"$error":"#N/A"}},null,null,null,null,null,null,null,"Total",null,269627,950,809,801,818,798,236,960,864,785,791,799,790,848,716,719,607,690,648]
["2019-03-01",{"$f":"VLOOKUP(J39,'Control Panel'!$G$132:$K$171,5,FALSE)","v":{"$error":"#N/A"}},"Childhood Immunisations Q4",null,"Last Run:",null,"Population Count",281164,null,null,"Search","All Patients","(01) 12 MONTH COHORT","(01.01) DTaP/IPV/Hib 6in1","(01.02) Men B (1st and 2nd)","(01.03) PCV","(01.04) Rotavirus","(01.05) BCG","(02) 24 MONTH COHORT","(02.01) DTaP/IPV/Hib Combined","(02.02) MMR","(02.03) HiB/Men C","(02.04) PCV (Booster)","(02.05) Men B (Booster)","(03) 5 YEAR COHORT","(03.01) DTaP/IPV/Hib Combined","(03.02) MMR (Primary)","(03.03) DTaP/IPV (Booster)","(03.04) HiB/Men C","(03.05) MMR (Booster)"]
["2019-03-01",{"$f":"VLOOKUP(J40,'Control Panel'!$G$132:$K$171,5,FALSE)","v":{"$error":"#N/A"}},null,null,"2019-05-14T13:20:00",null,"Males",143400,null,"Organisation Code"]
["2019-03-01",{"$f":"VLOOKUP(J41,'Control Panel'!$G$132:$K$171,5,FALSE)","v":{"$error":"#N/A"}},null,null,"Relative Date:",null,"Females",137764,null,"F84676",null,4393,10,10,10,10,10,1,16,14,14,14,14,14,19,18,18,19,18,18]
["2019-03-01",{"$f":"VLOOKUP(J42,'Control Panel'!$G$132:$K$171,5,FALSE)","v":"WF-6"},"WF",null,"2019-04-01",null,null,null,null,"F86001",null,7948,18,17,17,17,16,7,33,32,27,27,29,29,18,18,12,15,18,17]
["2019-03-01",{"$f":"VLOOKUP(J43,'Control Panel'!$G$132:$K$171,5,FALSE)","v":"WF-1"},"WF",null,null,null,null,null,null,"F86005",null,8169,43,39,38,41,39,4,36,34,32,31,31,30,29,10,27,22,24,25]
["2019-03-01",{"$f":"VLOOKUP(J44,'Control Panel'!$G$132:$K$171,5,FALSE)","v":"WF-7"},"WF",null,null,null,null,null,null,"F86006",null,6181,21,18,17,18,17,2,20,16,17,16,16,16,15,15,15,9,15,13]
["2019-03-01",{"$f":"VLOOKUP(J45,'Control Panel'!$G$132:$K$171,5,FALSE)","v":"WF-3"},"WF",null,null,null,null,null,null,"F86011",null,9257,23,19,19,19,21,3,19,15,12,13,13,13,28,24,23,21,24,19]
["2019-03-01",{"$f":"VLOOKUP(J46,'Control Panel'!$G$132:$K$171,5,FALSE)","v":"WF-7"},"WF",null,null,null,null,null,null,"F86030",null,8111,17,14,16,16,14,3,29,29,27,27,27,26,27,26,26,26,25,27]
["2019-03-01",{"$f":"VLOOKUP(J47,'Control Panel'!$G$132:$K$171,5,FALSE)","v":"WF-4"},"WF",null,null,null,null,null,null,"F86036",null,15689,48,45,44,45,43,27,51,51,48,48,49,49,44,42,41,36,40,36]
["2019-03-01",{"$f":"VLOOKUP(J48,'Control Panel'!$G$132:$K$171,5,FALSE)","v":"WF-3"},"WF",null,null,null,null,null,null,"F86038",null,10936,46,44,44,44,41,1,29,27,26,26,25,27,32,29,30,24,30,24]
["2019-03-01",{"$f":"VLOOKUP(J49,'Control Panel'!$G$132:$K$171,5,FALSE)","v":"WF-4"},"WF",null,null,null,null,null,null,"F86044",null,8829,44,35,35,36,30,11,33,30,24,24,24,23,15,13,11,9,11,8]
["2019-03-01",{"$f":"VLOOKUP(J50,'Control Panel'!$G$132:$K$171,5,FALSE)","v":"WF-5"},"WF",null,null,null,null,null,null,"F86045",null,1901,4,4,4,4,4,2,7,6,3,3,3,3,3,3,2,2,2,2]
["2019-03-01",{"$f":"VLOOKUP(J51,'Control Panel'!$G$132:$K$171,5,FALSE)","v":"WF-7"},"WF",null,null,null,null,null,null,"F86058",null,15046,56,46,47,47,45,6,50,48,43,43,43,42,51,41,44,32,43,33]
["2019-03-01",{"$f":"VLOOKUP(J52,'Control Panel'!$G$132:$K$171,5,FALSE)","v":"WF-7"},"WF",null,null,null,null,null,null,"F86062",null,7020,12,12,12,12,12,3,25,22,21,21,21,21,26,23,21,14,20,16]
["2019-03-01",{"$f":"VLOOKUP(J53,'Control Panel'!$G$132:$K$171,5,FALSE)","v":"WF-2"},"WF",null,null,null,null,null,null,"F86078",null,7367,18,18,18,18,18,3,15,11,12,12,12,12,21,18,16,15,17,14]
["2019-03-01",{"$f":"VLOOKUP(J54,'Control Panel'!$G$132:$K$171,5,FALSE)","v":"WF-6"},"WF",null,null,null,null,null,null,"F86086",null,5823,30,27,27,27,27,6,31,27,22,22,23,24,26,11,24,13,24,15]
["2019-03-01",{"$f":"VLOOKUP(J55,'Control Panel'!$G$132:$K$171,5,FALSE)","v":"WF-4"},"WF",null,null,null,null,null,null,"F86088",null,4712,8,6,5,6,6,3,13,12,7,8,8,8,5,0,3,3,3,3]
["2019-03-01",{"$f":"VLOOKUP(J56,'Control Panel'!$G$132:$K$171,5,FALSE)","v":"WF-6"},"WF",null,null,null,null,null,null,"F86607",null,14184,67,59,58,59,55,19,53,48,44,44,43,44,46,43,43,37,43,37]
["2019-03-01",{"$f":"VLOOKUP(J57,'Control Panel'!$G$132:$K$171,5,FALSE)","v":"WF-2"},"WF",null,null,null,null,null,null,"F86616",null,6599,36,33,34,34,33,2,22,20,18,18,19,17,28,23,24,20,24,20]
["2019-03-01",{"$f":"VLOOKUP(J58,'Control Panel'!$G$132:$K$171,5,FALSE)","v":"WF-5"},"WF",null,null,null,null,null,null,"F86621",null,5650,19,17,17,17,17,11,14,13,13,13,13,13,13,2,5,10,4,10]
["2019-03-01",{"$f":"VLOOKUP(J59,'Control Panel'!$G$132:$K$171,5,FALSE)","v":"WF-5"},"WF",null,null,null,null,null,null,"F86625",null,6116,16,16,16,16,16,3,17,16,11,11,11,11,19,18,16,7,2,8]
["2019-03-01",{"$f":"VLOOKUP(J60,'Control Panel'!$G$132:$K$171,5,FALSE)","v":"WF-1"},"WF",null,null,null,null,null,null,"F86626",null,5280,16,15,14,15,13,2,20,19,18,19,19,17,8,8,8,7,2,7]
["2019-03-01",{"$f":"VLOOKUP(J61,'Control Panel'!$G$132:$K$171,5,FALSE)","v":"WF-2"},"WF",null,null,null,null,null,null,"F86627",null,13926,32,29,27,29,27,5,36,35,32,32,30,31,29,26,26,22,26,24]
["2019-03-01",{"$f":"VLOOKUP(J62,'Control Panel'!$G$132:$K$171,5,FALSE)","v":"WF-6"},"WF",null,null,null,null,null,null,"F86644",null,10812,28,24,25,25,24,0,32,29,28,28,27,28,41,40,37,17,37,32]
["2019-03-01",{"$f":"VLOOKUP(J63,'Control Panel'!$G$132:$K$171,5,FALSE)","v":"WF-4"},"WF",null,null,null,null,null,null,"F86650",null,8170,21,16,15,17,17,8,20,14,13,12,12,12,24,21,21,14,21,14]
["2019-03-01",{"$f":"VLOOKUP(J64,'Control Panel'!$G$132:$K$171,5,FALSE)","v":"WF-1"},"WF",null,null,null,null,null,null,"F86664",null,8254,15,14,14,14,14,3,24,22,22,21,22,21,19,18,18,16,18,16]
["2019-03-01",{"$f":"VLOOKUP(J65,'Control Panel'!$G$132:$K$171,5,FALSE)","v":"WF-5"},"WF",null,null,null,null,null,null,"F86666",null,14094,35,28,24,28,26,13,45,39,36,36,36,37,37,35,33,27,31,28]
["2019-03-01",{"$f":"VLOOKUP(J66,'Control Panel'!$G$132:$K$171,5,FALSE)","v":"WF-7"},"WF",null,null,null,null,null,null,"F86679",null,5734,19,18,18,18,17,3,27,24,23,23,23,23,18,12,11,13,10,13]
["2019-03-01",{"$f":"VLOOKUP(J67,'Control Panel'!$G$132:$K$171,5,FALSE)","v":"WF-1"},"WF",null,null,null,null,null,null,"F86689",null,4008,15,12,12,12,11,4,17,17,13,13,13,13,17,9,11,11,11,13]
["2019-03-01",{"$f":"VLOOKUP(J68,'Control Panel'!$G$132:$K$171,5,FALSE)","v":"WF-4"},"WF",null,null,null,null,null,null,"F86696",null,5091,19,15,16,15,15,0,18,17,17,17,17,16,13,12,12,10,11,10]
["2019-03-01",{"$f":"VLOOKUP(J69,'Control Panel'!$G$132:$K$171,5,FALSE)","v":"WF-1"},"WF",null,null,null,null,null,null,"F86700",null,3756,7,7,7,7,6,2,13,13,11,12,12,12,7,7,7,6,7,6]
["2019-03-01",{"$f":"VLOOKUP(J70,'Control Panel'!$G$132:$K$171,5,FALSE)","v":"WF-5"},"WF",null,null,null,null,null,null,"F86701",null,3264,6,5,4,5,4,3,8,6,5,5,6,6,10,1,4,9,4,9]
["2019-03-01",{"$f":"VLOOKUP(J71,'Control Panel'!$G$132:$K$171,5,FALSE)","v":"WF-5"},"WF",null,null,null,null,null,null,"F86705",null,2995,9,7,7,7,7,3,9,8,8,8,8,8,8,8,8,7,8,7]
["2019-03-01",{"$f":"VLOOKUP(J72,'Control Panel'!$G$132:$K$171,5,FALSE)","v":"WF-6"},"WF",null,null,null,null,null,null,"F86708",null,2775,7,6,6,6,5,5,9,7,6,6,6,6,13,11,11,9,11,9]
["2019-03-01",{"$f":"VLOOKUP(J73,'Control Panel'!$G$132:$K$171,5,FALSE)","v":"WF-4"},"WF",null,null,null,null,null,null,"F86712",null,3055,11,10,10,10,9,0,8,8,8,8,8,8,4,2,2,3,2,3]
["2019-03-01",{"$f":"VLOOKUP(J74,'Control Panel'!$G$132:$K$171,5,FALSE)","v":"WF-2"},"WF",null,null,null,null,null,null,"Y01291",null,8779,28,24,24,24,23,17,26,26,26,26,25,26,30,30,28,26,28,26]
["2019-03-01",{"$f":"VLOOKUP(J75,'Control Panel'!$G$132:$K$171,5,FALSE)","v":"WF-1"},"WF",null,null,null,null,null,null,"Y01839",null,6534,30,27,27,28,25,6,24,22,20,20,21,21,21,21,19,16,19,16]
["2019-03-01",{"$f":"VLOOKUP(J76,'Control Panel'!$G$132:$K$171,5,FALSE)","v":"WF-3"},"WF",null,null,null,null,null,null,"Y02585",null,8112,24,22,22,22,23,11,32,29,22,21,22,21,26,18,18,14,18,14]
["2019-03-01",{"$f":"VLOOKUP(J77,'Control Panel'!$G$132:$K$171,5,FALSE)","v":{"$error":"#N/A"}},null,null,null,null,null,null,null,"Total",null,268570,858,758,750,768,730,202,881,806,729,728,731,728,790,656,675,561,651,592]
["2019-05-01",{"$f":"VLOOKUP(J78,'Control Panel'!$G$132:$K$171,5,FALSE)","v":{"$error":"#N/A"}},"Childhood Immunisations Q1",null,"Last Run:",null,"Population Count",283847,null,null,"Search","All Patients","(01) 12 MONTH COHORT","(01.01) DTaP/IPV/Hib 6in1","(01.02) Men B (1st and 2nd)","(01.03) PCV","(01.04) Rotavirus","(01.05) BCG","(02) 24 MONTH COHORT","(02.01) DTaP/IPV/Hib or DTaP/IPV/Hib/HepB","(02.02) MMR","(02.03) HiB/Men C","(02.04) PCV (Booster)","(02.05) Men B (Booster)","(03) 5 YEAR COHORT","(03.01) DTaP/IPV/Hib or DTaP/IPV/Hib/HepB","(03.02) MMR (Primary)","(03.03) DTaP/IPV (Booster)","(03.04) HiB/Men C","(03.05) MMR (Booster)"]
["2019-05-01",{"$f":"VLOOKUP(J79,'Control Panel'!$G$132:$K$171,5,FALSE)","v":{"$error":"#N/A"}},null,null,"2019-06-03T13:16:00",null,"Males",144788,null,"Organisation Code"]
["2019-05-01",{"$f":"VLOOKUP(J80,'Control Panel'!$G$132:$K$171,5,FALSE)","v":{"$error":"#N/A"}},null,null,"Relative Date:",null,"Females",139059,null,"F84676",null,4396,12,12,11,12,12,7,12,11,10,10,10,10,12,10,10,9,10,9]
["2019-05-01",{"$f":"VLOOKUP(J81,'Control Panel'!$G$132:$K$171,5,FALSE)","v":"WF-6"},"WF",null,"2019-06-01",null,null,null,null,"F86001",null,7931,20,20,20,20,19,3,30,25,20,20,20,20,22,17,15,10,16,12]
["2019-05-01",{"$f":"VLOOKUP(J82,'Control Panel'!$G$132:$K$171,5,FALSE)","v":"WF-1"},"WF",null,null,null,null,null,null,"F86005",null,8218,54,45,45,46,47,3,31,31,30,29,29,30,26,25,25,18,25,19]
["2019-05-01",{"$f":"VLOOKUP(J83,'Control Panel'!$G$132:$K$171,5,FALSE)","v":"WF-7"},"WF",null,null,null,null,null,null,"F86006",null,6212,24,17,17,18,19,3,24,22,20,21,21,21,19,17,16,11,15,11]
["2019-05-01",{"$f":"VLOOKUP(J84,'Control Panel'!$G$132:$K$171,5,FALSE)","v":"WF-3"},"WF",null,null,null,null,null,null,"F86011",null,9226,29,23,24,24,20,2,27,23,21,20,21,20,17,14,15,14,14,14]
["2019-05-01",{"$f":"VLOOKUP(J85,'Control Panel'!$G$132:$K$171,5,FALSE)","v":"WF-7"},"WF",null,null,null,null,null,null,"F86030",null,8103,39,34,34,35,33,13,41,40,40,40,40,40,21,19,20,17,20,19]
["2019-05-01",{"$f":"VLOOKUP(J86,'Control Panel'!$G$132:$K$171,5,FALSE)","v":"WF-4"},"WF",null,null,null,null,null,null,"F86036",null,15884,45,43,43,43,42,23,51,49,45,45,45,45,45,39,40,39,39,38]
["2019-05-01",{"$f":"VLOOKUP(J87,'Control Panel'!$G$132:$K$171,5,FALSE)","v":"WF-3"},"WF",null,null,null,null,null,null,"F86038",null,11020,47,37,37,38,37,3,44,39,35,36,36,35,38,32,32,27,30,28]
["2019-05-01",{"$f":"VLOOKUP(J88,'Control Panel'!$G$132:$K$171,5,FALSE)","v":"WF-4"},"WF",null,null,null,null,null,null,"F86044",null,8989,33,26,26,26,24,7,33,25,23,24,24,23,22,16,17,13,16,14]
["2019-05-01",{"$f":"VLOOKUP(J89,'Control Panel'!$G$132:$K$171,5,FALSE)","v":"WF-5"},"WF",null,null,null,null,null,null,"F86045",null,1921,4,4,3,4,4,2,0,0,0,0,0,0,4,4,4,4,3,4]
["2019-05-01",{"$f":"VLOOKUP(J90,'Control Panel'!$G$132:$K$171,5,FALSE)","v":"WF-7"},"WF",null,null,null,null,null,null,"F86058",null,15141,66,51,51,51,53,13,67,53,49,49,50,50,58,52,49,41,50,42]
["2019-05-01",{"$f":"VLOOKUP(J91,'Control Panel'!$G$132:$K$171,5,FALSE)","v":"WF-7"},"WF",null,null,null,null,null,null,"F86062",null,7086,28,24,24,25,25,9,21,19,17,17,17,17,23,20,20,14,19,15]
["2019-05-01",{"$f":"VLOOKUP(J92,'Control Panel'!$G$132:$K$171,5,FALSE)","v":"WF-2"},"WF",null,null,null,null,null,null,"F86078",null,7358,14,13,13,13,10,6,13,13,12,12,12,12,18,18,17,11,17,14]
["2019-05-01",{"$f":"VLOOKUP(J93,'Control Panel'!$G$132:$K$171,5,FALSE)","v":"WF-6"},"WF",null,null,null,null,null,null,"F86086",null,5939,24,21,21,21,20,7,30,26,22,22,22,22,22,7,19,13,18,15]
["2019-05-01",{"$f":"VLOOKUP(J94,'Control Panel'!$G$132:$K$171,5,FALSE)","v":"WF-4"},"WF",null,null,null,null,null,null,"F86088",null,4791,11,9,9,9,9,1,7,6,3,3,4,3,5,3,4,3,5,3]
["2019-05-01",{"$f":"VLOOKUP(J95,'Control Panel'!$G$132:$K$171,5,FALSE)","v":"WF-6"},"WF",null,null,null,null,null,null,"F86607",null,14162,55,48,48,49,48,23,48,45,42,44,42,43,48,46,43,38,42,45]
["2019-05-01",{"$f":"VLOOKUP(J96,'Control Panel'!$G$132:$K$171,5,FALSE)","v":"WF-2"},"WF",null,null,null,null,null,null,"F86616",null,6736,18,14,13,15,15,1,44,39,37,38,38,35,15,13,12,12,11,11]
["2019-05-01",{"$f":"VLOOKUP(J97,'Control Panel'!$G$132:$K$171,5,FALSE)","v":"WF-5"},"WF",null,null,null,null,null,null,"F86621",null,5695,19,17,18,18,19,7,22,21,20,20,20,19,12,2,2,8,2,9]
["2019-05-01",{"$f":"VLOOKUP(J98,'Control Panel'!$G$132:$K$171,5,FALSE)","v":"WF-5"},"WF",null,null,null,null,null,null,"F86625",null,6101,14,12,12,12,12,3,19,17,17,17,17,17,18,17,15,13,4,14]
["2019-05-01",{"$f":"VLOOKUP(J99,'Control Panel'!$G$132:$K$171,5,FALSE)","v":"WF-1"},"WF",null,null,null,null,null,null,"F86626",null,5320,13,13,13,13,13,5,14,13,11,11,12,12,20,20,17,14,13,14]
["2019-05-01",{"$f":"VLOOKUP(J100,'Control Panel'!$G$132:$K$171,5,FALSE)","v":"WF-2"},"WF",null,null,null,null,null,null,"F86627",null,13877,36,31,30,32,27,11,33,33,28,29,29,29,42,36,36,35,35,35]
["2019-05-01",{"$f":"VLOOKUP(J101,'Control Panel'!$G$132:$K$171,5,FALSE)","v":"WF-6"},"WF",null,null,null,null,null,null,"F86644",null,10912,33,25,24,25,23,6,38,35,27,27,29,29,37,32,34,18,30,27]
["2019-05-01",{"$f":"VLOOKUP(J102,'Control Panel'!$G$132:$K$171,5,FALSE)","v":"WF-4"},"WF",null,null,null,null,null,null,"F86650",null,8208,32,24,24,24,23,3,29,26,24,24,24,23,24,20,19,12,20,12]
["2019-05-01",{"$f":"VLOOKUP(J103,'Control Panel'!$G$132:$K$171,5,FALSE)","v":"WF-1"},"WF",null,null,null,null,null,null,"F86664",null,8337,25,22,21,22,23,2,27,25,24,24,25,24,32,30,28,28,29,29]
["2019-05-01",{"$f":"VLOOKUP(J104,'Control Panel'!$G$132:$K$171,5,FALSE)","v":"WF-5"},"WF",null,null,null,null,null,null,"F86666",null,14214,43,38,38,38,38,14,45,42,39,40,40,40,52,43,44,41,43,43]
["2019-05-01",{"$f":"VLOOKUP(J105,'Control Panel'!$G$132:$K$171,5,FALSE)","v":"WF-7"},"WF",null,null,null,null,null,null,"F86679",null,5788,29,27,25,25,26,8,22,19,20,20,21,20,18,6,7,12,8,14]
["2019-05-01",{"$f":"VLOOKUP(J106,'Control Panel'!$G$132:$K$171,5,FALSE)","v":"WF-1"},"WF",null,null,null,null,null,null,"F86689",null,4092,37,36,36,37,37,9,30,25,24,25,25,25,13,7,11,9,11,9]
["2019-05-01",{"$f":"VLOOKUP(J107,'Control Panel'!$G$132:$K$171,5,FALSE)","v":"WF-4"},"WF",null,null,null,null,null,null,"F86696",null,5140,11,10,10,11,10,0,17,12,12,13,12,11,17,16,16,12,16,14]
["2019-05-01",{"$f":"VLOOKUP(J108,'Control Panel'!$G$132:$K$171,5,FALSE)","v":"WF-1"},"WF",null,null,null,null,null,null,"F86700",null,3810,13,12,12,12,12,3,11,11,10,10,10,9,15,15,15,14,15,15]
["2019-05-01",{"$f":"VLOOKUP(J109,'Control Panel'!$G$132:$K$171,5,FALSE)","v":"WF-5"},"WF",null,null,null,null,null,null,"F86701",null,3308,9,9,9,9,9,1,9,9,9,9,9,9,11,6,6,8,5,9]
["2019-05-01",{"$f":"VLOOKUP(J110,'Control Panel'!$G$132:$K$171,5,FALSE)","v":"WF-5"},"WF",null,null,null,null,null,null,"F86705",null,3024,14,13,13,13,13,10,9,9,7,5,5,6,10,10,10,9,9,9]
["2019-05-01",{"$f":"VLOOKUP(J111,'Control Panel'!$G$132:$K$171,5,FALSE)","v":"WF-6"},"WF",null,null,null,null,null,null,"F86708",null,2786,9,9,9,9,8,6,9,8,7,7,7,7,4,4,3,2,3,2]
["2019-05-01",{"$f":"VLOOKUP(J112,'Control Panel'!$G$132:$K$171,5,FALSE)","v":"WF-4"},"WF",null,null,null,null,null,null,"F86712",null,3101,4,3,3,3,3,1,7,6,6,6,6,6,8,2,6,5,6,6]
["2019-05-01",{"$f":"VLOOKUP(J113,'Control Panel'!$G$132:$K$171,5,FALSE)","v":"WF-2"},"WF",null,null,null,null,null,null,"Y01291",null,8804,24,23,23,24,19,5,32,30,29,29,29,29,33,33,32,30,31,30]
["2019-05-01",{"$f":"VLOOKUP(J114,'Control Panel'!$G$132:$K$171,5,FALSE)","v":"WF-1"},"WF",null,null,null,null,null,null,"Y01839",null,6550,32,27,27,27,27,9,23,22,20,21,21,21,30,28,28,24,28,24]
["2019-05-01",{"$f":"VLOOKUP(J115,'Control Panel'!$G$132:$K$171,5,FALSE)","v":"WF-3"},"WF",null,null,null,null,null,null,"Y02585",null,8051,29,20,19,20,19,12,36,30,24,24,25,26,30,29,27,24,28,25]
["2019-05-01",{"$f":"VLOOKUP(J116,'Control Panel'!$G$132:$K$171,5,FALSE)","v":{"$error":"#N/A"}},null,null,null,null,null,null,null,"Total",null,270231,949,812,805,823,798,241,955,859,784,791,797,788,841,708,714,612,686,653]
["2019-06-01",{"$f":"VLOOKUP(J117,'Control Panel'!$G$132:$K$171,5,FALSE)","v":{"$error":"#N/A"}},"Childhood Immunisations Q1",null,"Last Run:",null,"Population Count",284503,null,null,"Search","All Patients","(01) 12 MONTH COHORT","(01.01) DTaP/IPV/Hib 6in1","(01.02) Men B (1st and 2nd)","(01.03) PCV","(01.04) Rotavirus","(01.05) BCG","(02) 24 MONTH COHORT","(02.01) DTaP/IPV/Hib or DTaP/IPV/Hib/HepB","(02.02) MMR","(02.03) HiB/Men C","(02.04) PCV (Booster)","(02.05) Men B (Booster)","(03) 5 YEAR COHORT","(03.01) DTaP/IPV/Hib or DTaP/IPV/Hib/HepB","(03.02) MMR (Primary)","(03.03) DTaP/IPV (Booster)","(03.04) HiB/Men C","(03.05) MMR (Booster)"]
["2019-06-01",{"$f":"VLOOKUP(J118,'Control Panel'!$G$132:$K$171,5,FALSE)","v":{"$error":"#N/A"}},null,null,"2019-07-02T09:45:00",null,"Males",145114,null,"Organisation Code"]
["2019-06-01",{"$f":"VLOOKUP(J119,'Control Panel'!$G$132:$K$171,5,FALSE)","v":{"$error":"#N/A"}},null,null,"Relative Date:",null,"Females",139389,null,"F84676",null,4383,12,12,11,12,12,9,12,11,10,10,10,10,12,10,10,9,10,9]
["2019-06-01",{"$f":"VLOOKUP(J120,'Control Panel'!$G$132:$K$171,5,FALSE)","v":"WF-6"},"WF",null,"2019-07-01",null,null,null,null,"F86001",null,7931,21,21,21,21,20,3,30,25,20,20,20,20,21,17,15,10,16,12]
["2019-06-01",{"$f":"VLOOKUP(J121,'Control Panel'!$G$132:$K$171,5,FALSE)","v":"WF-1"},"WF",null,null,null,null,null,null,"F86005",null,8304,56,47,47,48,50,3,31,31,30,29,29,30,26,25,25,18,25,19]
["2019-06-01",{"$f":"VLOOKUP(J122,'Control Panel'!$G$132:$K$171,5,FALSE)","v":"WF-7"},"WF",null,null,null,null,null,null,"F86006",null,6248,25,19,20,20,20,3,24,22,20,21,21,21,18,16,15,10,14,10]
["2019-06-01",{"$f":"VLOOKUP(J123,'Control Panel'!$G$132:$K$171,5,FALSE)","v":"WF-3"},"WF",null,null,null,null,null,null,"F86011",null,9216,30,24,25,25,21,2,27,23,21,20,21,20,18,15,16,15,15,15]
["2019-06-01",{"$f":"VLOOKUP(J124,'Control Panel'!$G$132:$K$171,5,FALSE)","v":"WF-7"},"WF",null,null,null,null,null,null,"F86030",null,8163,39,34,34,35,33,13,42,41,41,41,41,41,22,19,20,17,20,19]
["2019-06-01",{"$f":"VLOOKUP(J125,'Control Panel'!$G$132:$K$171,5,FALSE)","v":"WF-4"},"WF",null,null,null,null,null,null,"F86036",null,15971,44,43,43,43,41,23,50,48,45,45,45,45,45,39,40,39,39,38]
["2019-06-01",{"$f":"VLOOKUP(J126,'Control Panel'!$G$132:$K$171,5,FALSE)","v":"WF-3"},"WF",null,null,null,null,null,null,"F86038",null,11048,45,36,36,37,36,3,45,39,35,36,36,35,38,32,32,27,30,28]
["2019-06-01",{"$f":"VLOOKUP(J127,'Control Panel'!$G$132:$K$171,5,FALSE)","v":"WF-4"},"WF",null,null,null,null,null,null,"F86044",null,8948,33,25,25,25,23,7,33,26,24,25,25,24,22,16,17,13,16,14]
["2019-06-01",{"$f":"VLOOKUP(J128,'Control Panel'!$G$132:$K$171,5,FALSE)","v":"WF-5"},"WF",null,null,null,null,null,null,"F86045",null,1940,4,4,3,4,4,2,0,0,0,0,0,0,4,4,4,4,3,4]
["2019-06-01",{"$f":"VLOOKUP(J129,'Control Panel'!$G$132:$K$171,5,FALSE)","v":"WF-7"},"WF",null,null,null,null,null,null,"F86058",null,15254,66,52,53,53,53,13,67,53,49,49,50,50,58,52,49,41,50,42]
["2019-06-01",{"$f":"VLOOKUP(J130,'Control Panel'!$G$132:$K$171,5,FALSE)","v":"WF-7"},"WF",null,null,null,null,null,null,"F86062",null,7121,27,23,23,24,24,9,21,19,17,17,17,17,23,20,20,14,19,15]
["2019-06-01",{"$f":"VLOOKUP(J131,'Control Panel'!$G$132:$K$171,5,FALSE)","v":"WF-2"},"WF",null,null,null,null,null,null,"F86078",null,7347,15,14,14,14,11,6,13,13,12,12,12,12,18,18,17,11,17,14]
["2019-06-01",{"$f":"VLOOKUP(J132,'Control Panel'!$G$132:$K$171,5,FALSE)","v":"WF-6"},"WF",null,null,null,null,null,null,"F86086",null,5932,23,22,22,22,21,7,29,25,22,22,22,22,21,6,18,12,17,14]
["2019-06-01",{"$f":"VLOOKUP(J133,'Control Panel'!$G$132:$K$171,5,FALSE)","v":"WF-4"},"WF",null,null,null,null,null,null,"F86088",null,4774,11,9,9,9,9,1,7,6,3,3,4,3,5,3,4,3,5,3]
["2019-06-01",{"$f":"VLOOKUP(J134,'Control Panel'!$G$132:$K$171,5,FALSE)","v":"WF-6"},"WF",null,null,null,null,null,null,"F86607",null,14131,54,47,47,48,48,23,48,45,42,44,42,43,47,45,43,37,42,44]
["2019-06-01",{"$f":"VLOOKUP(J135,'Control Panel'!$G$132:$K$171,5,FALSE)","v":"WF-2"},"WF",null,null,null,null,null,null,"F86616",null,6809,18,14,13,15,15,1,44,39,37,38,38,35,15,13,12,12,11,11]
["2019-06-01",{"$f":"VLOOKUP(J136,'Control Panel'!$G$132:$K$171,5,FALSE)","v":"WF-5"},"WF",null,null,null,null,null,null,"F86621",null,5691,20,18,19,19,20,7,22,21,20,20,20,19,11,2,2,8,2,9]
["2019-06-01",{"$f":"VLOOKUP(J137,'Control Panel'!$G$132:$K$171,5,FALSE)","v":"WF-5"},"WF",null,null,null,null,null,null,"F86625",null,6121,14,12,12,12,12,3,19,17,17,17,17,17,17,16,15,13,4,14]
["2019-06-01",{"$f":"VLOOKUP(J138,'Control Panel'!$G$132:$K$171,5,FALSE)","v":"WF-1"},"WF",null,null,null,null,null,null,"F86626",null,5342,13,13,13,13,13,5,14,13,12,12,13,13,19,19,17,14,13,14]
["2019-06-01",{"$f":"VLOOKUP(J139,'Control Panel'!$G$132:$K$171,5,FALSE)","v":"WF-2"},"WF",null,null,null,null,null,null,"F86627",null,13882,36,32,31,33,28,12,33,33,28,29,29,29,42,36,36,35,35,35]
["2019-06-01",{"$f":"VLOOKUP(J140,'Control Panel'!$G$132:$K$171,5,FALSE)","v":"WF-6"},"WF",null,null,null,null,null,null,"F86644",null,10849,34,25,25,26,24,7,37,34,26,26,28,28,37,33,34,18,30,27]
["2019-06-01",{"$f":"VLOOKUP(J141,'Control Panel'!$G$132:$K$171,5,FALSE)","v":"WF-4"},"WF",null,null,null,null,null,null,"F86650",null,8292,33,25,25,25,24,4,29,27,24,24,24,24,24,20,19,12,20,12]
["2019-06-01",{"$f":"VLOOKUP(J142,'Control Panel'!$G$132:$K$171,5,FALSE)","v":"WF-1"},"WF",null,null,null,null,null,null,"F86664",null,8373,25,22,21,22,23,2,27,25,24,24,25,24,33,30,28,28,29,29]
["2019-06-01",{"$f":"VLOOKUP(J143,'Control Panel'!$G$132:$K$171,5,FALSE)","v":"WF-5"},"WF",null,null,null,null,null,null,"F86666",null,14259,44,38,38,39,38,15,45,42,39,40,40,40,52,43,44,41,43,43]
["2019-06-01",{"$f":"VLOOKUP(J144,'Control Panel'!$G$132:$K$171,5,FALSE)","v":"WF-7"},"WF",null,null,null,null,null,null,"F86679",null,5849,28,26,25,25,25,8,23,20,19,19,20,19,18,6,7,12,8,14]
["2019-06-01",{"$f":"VLOOKUP(J145,'Control Panel'!$G$132:$K$171,5,FALSE)","v":"WF-1"},"WF",null,null,null,null,null,null,"F86689",null,4112,37,36,37,37,37,9,30,25,24,25,25,25,13,7,11,9,11,9]
["2019-06-01",{"$f":"VLOOKUP(J146,'Control Panel'!$G$132:$K$171,5,FALSE)","v":"WF-4"},"WF",null,null,null,null,null,null,"F86696",null,5156,11,10,10,11,10,0,16,11,11,12,11,11,17,16,16,12,16,14]
["2019-06-01",{"$f":"VLOOKUP(J147,'Control Panel'!$G$132:$K$171,5,FALSE)","v":"WF-1"},"WF",null,null,null,null,null,null,"F86700",null,3834,12,11,11,11,11,2,11,11,10,10,10,9,16,15,16,15,16,16]
["2019-06-01",{"$f":"VLOOKUP(J148,'Control Panel'!$G$132:$K$171,5,FALSE)","v":"WF-5"},"WF",null,null,null,null,null,null,"F86701",null,3312,9,9,9,9,9,1,9,9,9,9,9,9,11,6,6,8,5,9]
["2019-06-01",{"$f":"VLOOKUP(J149,'Control Panel'!$G$132:$K$171,5,FALSE)","v":"WF-5"},"WF",null,null,null,null,null,null,"F86705",null,3038,14,13,13,13,13,10,9,9,7,5,5,6,10,10,10,9,9,9]
["2019-06-01",{"$f":"VLOOKUP(J150,'Control Panel'!$G$132:$K$171,5,FALSE)","v":"WF-6"},"WF",null,null,null,null,null,null,"F86708",null,2786,9,9,9,9,8,6,9,8,7,7,7,7,4,4,3,2,3,2]
["2019-06-01",{"$f":"VLOOKUP(J151,'Control Panel'!$G$132:$K$171,5,FALSE)","v":"WF-4"},"WF",null,null,null,null,null,null,"F86712",null,3111,4,3,3,3,3,1,7,6,6,6,6,6,8,2,6,5,6,6]
["2019-06-01",{"$f":"VLOOKUP(J152,'Control Panel'!$G$132:$K$171,5,FALSE)","v":"WF-2"},"WF",null,null,null,null,null,null,"Y01291",null,8805,24,23,23,24,19,9,32,30,29,29,29,29,33,33,32,30,31,30]
["2019-06-01",{"$f":"VLOOKUP(J153,'Control Panel'!$G$132:$K$171,5,FALSE)","v":"WF-1"},"WF",null,null,null,null,null,null,"Y01839",null,6535,31,26,26,26,26,9,25,24,22,23,23,21,30,28,28,25,28,25]
["2019-06-01",{"$f":"VLOOKUP(J154,'Control Panel'!$G$132:$K$171,5,FALSE)","v":"WF-3"},"WF",null,null,null,null,null,null,"Y02585",null,7977,29,20,19,20,19,13,35,29,24,24,25,26,30,29,27,24,28,25]
["2019-06-01",{"$f":"VLOOKUP(J155,'Control Panel'!$G$132:$K$171,5,FALSE)","v":{"$error":"#N/A"}},null,null,null,null,null,null,null,"Total",null,270844,950,817,815,832,803,251,955,860,786,793,799,790,838,705,714,612,686,653]
["2019-07-01",{"$f":"VLOOKUP(J156,'Control Panel'!$G$132:$K$171,5,FALSE)","v":{"$error":"#N/A"}},"Childhood Immunisations Q2",null,"Last Run:",null,"Population Count",281296,null,null,"Search","All Patients","(01) 12 MONTH COHORT","(01.01) DTaP/IPV/Hib 6in1","(01.02) Men B (1st and 2nd)","(01.03) PCV","(01.04) Rotavirus","(01.05) BCG","(02) 24 MONTH COHORT","(02.01) DTaP/IPV/Hib Combined","(02.02) MMR","(02.03) HiB/Men C","(02.04) PCV (Booster)","(02.05) Men B (Booster)","(03) 5 YEAR COHORT","(03.01) DTaP/IPV/Hib Combined","(03.02) MMR (Primary)","(03.03) DTaP/IPV (Booster)","(03.04) HiB/Men C","(03.05) MMR (Booster)"]
["2019-07-01",{"$f":"VLOOKUP(J157,'Control Panel'!$G$132:$K$171,5,FALSE)","v":{"$error":"#N/A"}},null,null,"2019-08-02T09:07:00",null,"Males",143494,null,"Organisation Code"]
["2019-07-01",{"$f":"VLOOKUP(J158,'Control Panel'!$G$132:$K$171,5,FALSE)","v":"WF-6"},"WF",null,"Relative Date:",null,"Females",137802,null,"F86001",null,7927,28,26,26,26,25,5,28,25,22,23,23,24,30,24,24,17,24,19]
["2019-07-01",{"$f":"VLOOKUP(J159,'Control Panel'!$G$132:$K$171,5,FALSE)","v":"WF-1"},"WF",null,"2019-08-01",null,null,null,null,"F86005",null,8370,39,31,29,31,30,3,49,47,43,43,44,42,32,29,29,18,28,21]
["2019-07-01",{"$f":"VLOOKUP(J160,'Control Panel'!$G$132:$K$171,5,FALSE)","v":"WF-7"},"WF",null,null,null,null,null,null,"F86006",null,6278,13,11,11,11,11,1,14,14,11,13,13,11,21,21,20,14,17,16]
["2019-07-01",{"$f":"VLOOKUP(J161,'Control Panel'!$G$132:$K$171,5,FALSE)","v":"WF-3"},"WF",null,null,null,null,null,null,"F86011",null,9200,16,12,13,13,13,0,27,23,22,23,23,23,27,24,20,20,21,19]
["2019-07-01",{"$f":"VLOOKUP(J162,'Control Panel'!$G$132:$K$171,5,FALSE)","v":"WF-7"},"WF",null,null,null,null,null,null,"F86030",null,8162,24,21,21,21,21,7,33,32,31,31,31,31,30,25,24,24,25,24]
["2019-07-01",{"$f":"VLOOKUP(J163,'Control Panel'!$G$132:$K$171,5,FALSE)","v":"WF-4"},"WF",null,null,null,null,null,null,"F86036",null,16031,70,63,63,63,59,34,71,69,64,63,65,64,57,56,54,49,52,49]
["2019-07-01",{"$f":"VLOOKUP(J164,'Control Panel'!$G$132:$K$171,5,FALSE)","v":"WF-3"},"WF",null,null,null,null,null,null,"F86038",null,11108,52,48,47,48,49,5,41,41,33,32,33,33,56,48,48,37,50,39]
["2019-07-01",{"$f":"VLOOKUP(J165,'Control Panel'!$G$132:$K$171,5,FALSE)","v":"WF-4"},"WF",null,null,null,null,null,null,"F86044",null,8911,49,41,40,41,41,4,40,27,26,26,26,26,30,22,19,17,19,17]
["2019-07-01",{"$f":"VLOOKUP(J166,'Control Panel'!$G$132:$K$171,5,FALSE)","v":"WF-5"},"WF",null,null,null,null,null,null,"F86045",null,1955,4,3,3,3,3,1,3,3,2,2,2,2,4,3,4,3,4,4]
["2019-07-01",{"$f":"VLOOKUP(J167,'Control Panel'!$G$132:$K$171,5,FALSE)","v":"WF-7"},"WF",null,null,null,null,null,null,"F86058",null,15424,64,53,51,51,49,15,63,62,52,51,53,52,56,52,52,42,51,44]
["2019-07-01",{"$f":"VLOOKUP(J168,'Control Panel'!$G$132:$K$171,5,FALSE)","v":"WF-7"},"WF",null,null,null,null,null,null,"F86062",null,7132,25,22,22,22,19,4,25,23,19,18,19,19,15,14,15,12,14,11]
["2019-07-01",{"$f":"VLOOKUP(J169,'Control Panel'!$G$132:$K$171,5,FALSE)","v":"WF-2"},"WF",null,null,null,null,null,null,"F86078",null,7338,22,19,19,20,17,5,13,13,10,10,10,9,14,14,12,9,12,9]
["2019-07-01",{"$f":"VLOOKUP(J170,'Control Panel'!$G$132:$K$171,5,FALSE)","v":"WF-6"},"WF",null,null,null,null,null,null,"F86086",null,5943,19,15,15,15,15,3,19,17,14,13,13,13,25,9,23,11,23,19]
["2019-07-01",{"$f":"VLOOKUP(J171,'Control Panel'!$G$132:$K$171,5,FALSE)","v":"WF-4"},"WF",null,null,null,null,null,null,"F86088",null,4784,18,16,15,16,15,3,10,8,6,5,6,6,13,11,13,9,13,11]
["2019-07-01",{"$f":"VLOOKUP(J172,'Control Panel'!$G$132:$K$171,5,FALSE)","v":"WF-6"},"WF",null,null,null,null,null,null,"F86607",null,14073,56,46,52,52,50,21,49,44,43,43,44,43,65,61,60,56,59,60]
["2019-07-01",{"$f":"VLOOKUP(J173,'Control Panel'!$G$132:$K$171,5,FALSE)","v":"WF-2"},"WF",null,null,null,null,null,null,"F86616",null,6875,25,24,24,24,23,2,37,34,34,34,33,34,20,17,16,11,17,12]
["2019-07-01",{"$f":"VLOOKUP(J174,'Control Panel'!$G$132:$K$171,5,FALSE)","v":"WF-5"},"WF",null,null,null,null,null,null,"F86621",null,5697,21,19,18,19,18,10,10,10,10,10,10,10,15,6,14,11,14,11]
["2019-07-01",{"$f":"VLOOKUP(J175,'Control Panel'!$G$132:$K$171,5,FALSE)","v":"WF-5"},"WF",null,null,null,null,null,null,"F86625",null,6148,14,9,9,9,8,2,11,9,8,8,8,8,20,19,18,13,7,15]
["2019-07-01",{"$f":"VLOOKUP(J176,'Control Panel'!$G$132:$K$171,5,FALSE)","v":"WF-1"},"WF",null,null,null,null,null,null,"F86626",null,5404,18,17,17,17,17,4,17,16,11,12,12,12,22,22,20,19,21,18]
["2019-07-01",{"$f":"VLOOKUP(J177,'Control Panel'!$G$132:$K$171,5,FALSE)","v":"WF-2"},"WF",null,null,null,null,null,null,"F86627",null,13894,38,35,35,35,28,8,43,37,36,36,35,32,46,45,44,33,43,36]
["2019-07-01",{"$f":"VLOOKUP(J178,'Control Panel'!$G$132:$K$171,5,FALSE)","v":"WF-6"},"WF",null,null,null,null,null,null,"F86644",null,10928,27,25,25,26,23,2,43,38,36,37,37,37,35,34,34,13,34,27]
["2019-07-01",{"$f":"VLOOKUP(J179,'Control Panel'!$G$132:$K$171,5,FALSE)","v":"WF-4"},"WF",null,null,null,null,null,null,"F86650",null,8276,33,30,30,30,29,8,35,31,28,28,28,28,41,34,32,25,35,24]
["2019-07-01",{"$f":"VLOOKUP(J180,'Control Panel'!$G$132:$K$171,5,FALSE)","v":"WF-1"},"WF",null,null,null,null,null,null,"F86664",null,8403,35,32,32,32,33,1,30,30,25,25,25,25,25,23,22,19,22,19]
["2019-07-01",{"$f":"VLOOKUP(J181,'Control Panel'!$G$132:$K$171,5,FALSE)","v":"WF-5"},"WF",null,null,null,null,null,null,"F86666",null,14288,43,38,33,37,31,16,51,47,43,45,43,43,52,49,47,39,42,41]
["2019-07-01",{"$f":"VLOOKUP(J182,'Control Panel'!$G$132:$K$171,5,FALSE)","v":"WF-7"},"WF",null,null,null,null,null,null,"F86679",null,5856,33,29,29,30,29,6,30,29,25,25,26,26,16,12,15,13,14,13]
["2019-07-01",{"$f":"VLOOKUP(J183,'Control Panel'!$G$132:$K$171,5,FALSE)","v":"WF-1"},"WF",null,null,null,null,null,null,"F86689",null,4149,35,34,34,34,31,7,17,17,17,17,17,17,18,10,14,11,14,13]
["2019-07-01",{"$f":"VLOOKUP(J184,'Control Panel'!$G$132:$K$171,5,FALSE)","v":"WF-4"},"WF",null,null,null,null,null,null,"F86696",null,5164,16,16,16,16,16,3,8,7,7,7,7,7,10,10,10,7,10,7]
["2019-07-01",{"$f":"VLOOKUP(J185,'Control Panel'!$G$132:$K$171,5,FALSE)","v":"WF-1"},"WF",null,null,null,null,null,null,"F86700",null,3834,13,10,10,10,10,4,9,9,8,8,8,7,8,7,7,7,7,7]
["2019-07-01",{"$f":"VLOOKUP(J186,'Control Panel'!$G$132:$K$171,5,FALSE)","v":"WF-5"},"WF",null,null,null,null,null,null,"F86701",null,3320,12,10,10,11,11,2,14,12,13,11,12,12,12,4,9,9,9,8]
["2019-07-01",{"$f":"VLOOKUP(J187,'Control Panel'!$G$132:$K$171,5,FALSE)","v":"WF-5"},"WF",null,null,null,null,null,null,"F86705",null,3037,9,9,9,9,9,6,4,4,4,3,3,3,5,5,5,4,4,4]
["2019-07-01",{"$f":"VLOOKUP(J188,'Control Panel'!$G$132:$K$171,5,FALSE)","v":"WF-6"},"WF",null,null,null,null,null,null,"F86708",null,2796,6,4,4,4,3,3,7,7,7,7,7,6,10,10,10,7,10,7]
["2019-07-01",{"$f":"VLOOKUP(J189,'Control Panel'!$G$132:$K$171,5,FALSE)","v":"WF-4"},"WF",null,null,null,null,null,null,"F86712",null,3115,16,13,14,13,14,1,5,5,4,4,4,4,7,3,7,4,7,5]
["2019-07-01",{"$f":"VLOOKUP(J190,'Control Panel'!$G$132:$K$171,5,FALSE)","v":"WF-2"},"WF",null,null,null,null,null,null,"Y01291",null,8772,34,31,31,31,30,9,28,27,24,24,25,25,34,32,33,30,32,30]
["2019-07-01",{"$f":"VLOOKUP(J191,'Control Panel'!$G$132:$K$171,5,FALSE)","v":"WF-1"},"WF",null,null,null,null,null,null,"Y01839",null,6505,28,27,27,27,26,10,27,26,25,25,25,25,22,18,19,17,17,16]
["2019-07-01",{"$f":"VLOOKUP(J192,'Control Panel'!$G$132:$K$171,5,FALSE)","v":"WF-3"},"WF",null,null,null,null,null,null,"Y02585",null,7917,32,29,29,29,30,18,31,30,29,28,28,28,21,18,19,13,18,13]
["2019-07-01",{"$f":"VLOOKUP(J193,'Control Panel'!$G$132:$K$171,5,FALSE)","v":{"$error":"#N/A"}},null,null,null,null,null,null,null,"Total",null,267014,987,868,863,876,836,233,942,873,792,790,798,787,914,791,812,643,789,688]
["2019-08-01",{"$f":"VLOOKUP(J194,'Control Panel'!$G$132:$K$171,5,FALSE)","v":{"$error":"#N/A"}},"Childhood Immunisations Q2",null,"Last Run:",null,"Population Count",281420,null,null,"Search","All Patients","(01) 12 MONTH COHORT","(01.01) DTaP/IPV/Hib 6in1","(01.02) Men B (1st and 2nd)","(01.03) PCV","(01.04) Rotavirus","(01.05) BCG","(02) 24 MONTH COHORT","(02.01) DTaP/IPV/Hib Combined","(02.02) MMR","(02.03) HiB/Men C","(02.04) PCV (Booster)","(02.05) Men B (Booster)","(03) 5 YEAR COHORT","(03.01) DTaP/IPV/Hib Combined","(03.02) MMR (Primary)","(03.03) DTaP/IPV (Booster)","(03.04) HiB/Men C","(03.05) MMR (Booster)"]
["2019-08-01",{"$f":"VLOOKUP(J195,'Control Panel'!$G$132:$K$171,5,FALSE)","v":{"$error":"#N/A"}},null,null,"2019-09-02T09:31:00",null,"Males",143521,null,"Organisation Code"]
["2019-08-01",{"$f":"VLOOKUP(J196,'Control Panel'!$G$132:$K$171,5,FALSE)","v":"WF-6"},"WF",null,"Relative Date:",null,"Females",137899,null,"F86001",null,7917,28,26,26,26,25,5,28,25,22,23,23,24,30,24,24,17,24,19]
["2019-08-01",{"$f":"VLOOKUP(J197,'Control Panel'!$G$132:$K$171,5,FALSE)","v":"WF-1"},"WF",null,"2019-09-01",null,null,null,null,"F86005",null,8427,41,33,30,33,30,3,46,44,40,40,41,39,32,29,29,18,28,21]
["2019-08-01",{"$f":"VLOOKUP(J198,'Control Panel'!$G$132:$K$171,5,FALSE)","v":"WF-7"},"WF",null,null,null,null,null,null,"F86006",null,6288,13,11,11,11,11,1,14,14,11,13,13,11,21,21,20,14,17,16]
["2019-08-01",{"$f":"VLOOKUP(J199,'Control Panel'!$G$132:$K$171,5,FALSE)","v":"WF-3"},"WF",null,null,null,null,null,null,"F86011",null,9227,16,13,13,13,13,0,26,22,21,22,22,22,27,24,20,20,21,19]
["2019-08-01",{"$f":"VLOOKUP(J200,'Control Panel'!$G$132:$K$171,5,FALSE)","v":"WF-7"},"WF",null,null,null,null,null,null,"F86030",null,8158,24,21,21,21,21,7,32,31,30,30,30,30,30,25,24,24,25,24]
["2019-08-01",{"$f":"VLOOKUP(J201,'Control Panel'!$G$132:$K$171,5,FALSE)","v":"WF-4"},"WF",null,null,null,null,null,null,"F86036",null,15893,70,62,62,62,58,35,68,66,62,61,63,62,58,56,54,50,52,50]
["2019-08-01",{"$f":"VLOOKUP(J202,'Control Panel'!$G$132:$K$171,5,FALSE)","v":"WF-3"},"WF",null,null,null,null,null,null,"F86038",null,11164,52,48,47,48,48,5,42,42,34,33,34,34,56,48,47,37,49,39]
["2019-08-01",{"$f":"VLOOKUP(J203,'Control Panel'!$G$132:$K$171,5,FALSE)","v":"WF-4"},"WF",null,null,null,null,null,null,"F86044",null,9044,49,41,40,41,41,4,41,28,27,27,27,27,30,22,19,17,19,17]
["2019-08-01",{"$f":"VLOOKUP(J204,'Control Panel'!$G$132:$K$171,5,FALSE)","v":"WF-5"},"WF",null,null,null,null,null,null,"F86045",null,1948,4,3,3,3,3,1,3,3,3,3,3,2,4,4,4,3,4,4]
["2019-08-01",{"$f":"VLOOKUP(J205,'Control Panel'!$G$132:$K$171,5,FALSE)","v":"WF-7"},"WF",null,null,null,null,null,null,"F86058",null,15633,64,53,51,51,49,15,63,62,52,51,53,52,56,52,52,42,51,44]
["2019-08-01",{"$f":"VLOOKUP(J206,'Control Panel'!$G$132:$K$171,5,FALSE)","v":"WF-7"},"WF",null,null,null,null,null,null,"F86062",null,7109,25,22,22,22,19,4,25,23,19,19,20,20,15,14,15,12,14,11]
["2019-08-01",{"$f":"VLOOKUP(J207,'Control Panel'!$G$132:$K$171,5,FALSE)","v":"WF-2"},"WF",null,null,null,null,null,null,"F86078",null,7332,22,20,19,20,17,5,13,13,10,10,10,9,14,14,12,9,12,9]
["2019-08-01",{"$f":"VLOOKUP(J208,'Control Panel'!$G$132:$K$171,5,FALSE)","v":"WF-6"},"WF",null,null,null,null,null,null,"F86086",null,6011,21,17,17,17,17,4,20,17,14,13,13,13,25,9,23,11,23,19]
["2019-08-01",{"$f":"VLOOKUP(J209,'Control Panel'!$G$132:$K$171,5,FALSE)","v":"WF-4"},"WF",null,null,null,null,null,null,"F86088",null,4785,18,16,15,16,15,3,10,8,6,5,6,6,13,11,13,9,13,11]
["2019-08-01",{"$f":"VLOOKUP(J210,'Control Panel'!$G$132:$K$171,5,FALSE)","v":"WF-6"},"WF",null,null,null,null,null,null,"F86607",null,14078,55,45,51,51,49,20,50,45,44,44,45,44,64,60,59,55,58,59]
["2019-08-01",{"$f":"VLOOKUP(J211,'Control Panel'!$G$132:$K$171,5,FALSE)","v":"WF-2"},"WF",null,null,null,null,null,null,"F86616",null,6939,25,24,24,24,23,2,38,35,35,35,34,35,21,18,17,12,18,13]
["2019-08-01",{"$f":"VLOOKUP(J212,'Control Panel'!$G$132:$K$171,5,FALSE)","v":"WF-5"},"WF",null,null,null,null,null,null,"F86621",null,5735,20,18,17,18,17,9,10,10,10,10,10,10,15,6,14,11,14,11]
["2019-08-01",{"$f":"VLOOKUP(J213,'Control Panel'!$G$132:$K$171,5,FALSE)","v":"WF-5"},"WF",null,null,null,null,null,null,"F86625",null,6174,14,9,9,9,8,2,11,9,8,8,8,8,20,19,18,13,7,15]
["2019-08-01",{"$f":"VLOOKUP(J214,'Control Panel'!$G$132:$K$171,5,FALSE)","v":"WF-1"},"WF",null,null,null,null,null,null,"F86626",null,5461,18,17,17,17,17,4,16,15,10,11,11,11,22,22,20,19,21,18]
["2019-08-01",{"$f":"VLOOKUP(J215,'Control Panel'!$G$132:$K$171,5,FALSE)","v":"WF-2"},"WF",null,null,null,null,null,null,"F86627",null,13833,38,35,35,35,28,8,43,37,36,36,35,32,47,46,45,34,44,37]
["2019-08-01",{"$f":"VLOOKUP(J216,'Control Panel'!$G$132:$K$171,5,FALSE)","v":"WF-6"},"WF",null,null,null,null,null,null,"F86644",null,10775,27,25,25,26,22,2,43,38,36,37,37,37,33,32,32,12,33,25]
["2019-08-01",{"$f":"VLOOKUP(J217,'Control Panel'!$G$132:$K$171,5,FALSE)","v":"WF-4"},"WF",null,null,null,null,null,null,"F86650",null,8341,33,30,30,30,29,8,35,31,28,28,28,28,41,34,32,25,35,24]
["2019-08-01",{"$f":"VLOOKUP(J218,'Control Panel'!$G$132:$K$171,5,FALSE)","v":"WF-1"},"WF",null,null,null,null,null,null,"F86664",null,8385,35,32,32,32,33,1,28,28,23,23,23,23,25,23,22,19,22,19]
["2019-08-01",{"$f":"VLOOKUP(J219,'Control Panel'!$G$132:$K$171,5,FALSE)","v":"WF-5"},"WF",null,null,null,null,null,null,"F86666",null,14317,42,37,32,36,30,16,51,47,43,45,43,43,52,49,47,39,42,41]
["2019-08-01",{"$f":"VLOOKUP(J220,'Control Panel'!$G$132:$K$171,5,FALSE)","v":"WF-7"},"WF",null,null,null,null,null,null,"F86679",null,5868,33,30,30,31,29,7,30,29,25,25,26,26,16,12,15,13,14,13]
["2019-08-01",{"$f":"VLOOKUP(J221,'Control Panel'!$G$132:$K$171,5,FALSE)","v":"WF-1"},"WF",null,null,null,null,null,null,"F86689",null,4146,35,34,34,34,31,7,17,17,17,17,17,17,19,11,15,12,15,14]
["2019-08-01",{"$f":"VLOOKUP(J222,'Control Panel'!$G$132:$K$171,5,FALSE)","v":"WF-4"},"WF",null,null,null,null,null,null,"F86696",null,5216,15,15,15,15,15,2,9,7,8,8,8,8,10,10,10,7,10,7]
["2019-08-01",{"$f":"VLOOKUP(J223,'Control Panel'!$G$132:$K$171,5,FALSE)","v":"WF-1"},"WF",null,null,null,null,null,null,"F86700",null,3856,14,10,10,10,10,4,9,9,8,8,8,7,8,7,7,7,7,7]
["2019-08-01",{"$f":"VLOOKUP(J224,'Control Panel'!$G$132:$K$171,5,FALSE)","v":"WF-5"},"WF",null,null,null,null,null,null,"F86701",null,3322,12,10,10,11,11,2,14,12,13,11,12,12,12,4,9,9,9,8]
["2019-08-01",{"$f":"VLOOKUP(J225,'Control Panel'!$G$132:$K$171,5,FALSE)","v":"WF-5"},"WF",null,null,null,null,null,null,"F86705",null,3063,10,10,9,10,10,6,4,4,4,3,3,3,5,5,5,4,4,4]
["2019-08-01",{"$f":"VLOOKUP(J226,'Control Panel'!$G$132:$K$171,5,FALSE)","v":"WF-6"},"WF",null,null,null,null,null,null,"F86708",null,2796,6,4,4,4,3,3,7,7,7,7,7,6,10,10,10,7,10,7]
["2019-08-01",{"$f":"VLOOKUP(J227,'Control Panel'!$G$132:$K$171,5,FALSE)","v":"WF-4"},"WF",null,null,null,null,null,null,"F86712",null,3131,16,13,14,13,14,1,5,5,4,4,4,4,7,3,7,4,7,5]
["2019-08-01",{"$f":"VLOOKUP(J228,'Control Panel'!$G$132:$K$171,5,FALSE)","v":"WF-2"},"WF",null,null,null,null,null,null,"Y01291",null,8748,33,31,30,31,30,12,28,27,24,24,25,25,32,30,31,28,30,28]
["2019-08-01",{"$f":"VLOOKUP(J229,'Control Panel'!$G$132:$K$171,5,FALSE)","v":"WF-1"},"WF",null,null,null,null,null,null,"Y01839",null,6467,27,26,26,26,25,9,27,26,26,25,25,25,22,18,19,17,17,16]
["2019-08-01",{"$f":"VLOOKUP(J230,'Control Panel'!$G$132:$K$171,5,FALSE)","v":"WF-3"},"WF",null,null,null,null,null,null,"Y02585",null,7632,30,27,27,27,28,18,27,26,25,24,24,24,19,16,17,12,16,12]
["2019-08-01",{"$f":"VLOOKUP(J231,'Control Panel'!$G$132:$K$171,5,FALSE)","v":{"$error":"#N/A"}},null,null,null,null,null,null,null,"Total",null,267219,985,868,858,874,829,235,933,862,785,783,791,779,911,788,807,642,785,686]
["2019-09-01",{"$f":"VLOOKUP(J232,'Control Panel'!$G$132:$K$171,5,FALSE)","v":{"$error":"#N/A"}},"Childhood Immunisations Q2",null,"Last Run:",null,"Population Count",281963,null,null,"Search","All Patients","(01) 12 MONTH COHORT","(01.01) DTaP/IPV/Hib 6in1","(01.02) Men B (1st and 2nd)","(01.03) PCV","(01.04) Rotavirus","(01.05) BCG","(02) 24 MONTH COHORT","(02.01) DTaP/IPV/Hib Combined","(02.02) MMR","(02.03) HiB/Men C","(02.04) PCV (Booster)","(02.05) Men B (Booster)","(03) 5 YEAR COHORT","(03.01) DTaP/IPV/Hib Combined","(03.02) MMR (Primary)","(03.03) DTaP/IPV (Booster)","(03.04) HiB/Men C","(03.05) MMR (Booster)"]
["2019-09-01",{"$f":"VLOOKUP(J233,'Control Panel'!$G$132:$K$171,5,FALSE)","v":{"$error":"#N/A"}},null,null,"2019-10-02T09:52:00",null,"Males",143916,null,"Organisation Code"]
["2019-09-01",{"$f":"VLOOKUP(J234,'Control Panel'!$G$132:$K$171,5,FALSE)","v":"WF-6"},"WF",null,"Relative Date:",null,"Females",138047,null,"F86001",null,7911,28,26,26,26,25,5,28,25,22,23,23,24,30,24,24,17,24,19]
["2019-09-01",{"$f":"VLOOKUP(J235,'Control Panel'!$G$132:$K$171,5,FALSE)","v":"WF-1"},"WF",null,"2019-10-01",null,null,null,null,"F86005",null,8429,43,34,31,34,31,4,46,44,40,40,41,39,32,29,29,18,28,21]
["2019-09-01",{"$f":"VLOOKUP(J236,'Control Panel'!$G$132:$K$171,5,FALSE)","v":"WF-7"},"WF",null,null,null,null,null,null,"F86006",null,6294,13,11,11,11,11,1,14,14,11,13,13,11,21,21,20,14,17,16]
["2019-09-01",{"$f":"VLOOKUP(J237,'Control Panel'!$G$132:$K$171,5,FALSE)","v":"WF-3"},"WF",null,null,null,null,null,null,"F86011",null,9259,15,14,14,14,13,0,27,22,21,22,22,23,29,25,21,21,22,20]
["2019-09-01",{"$f":"VLOOKUP(J238,'Control Panel'!$G$132:$K$171,5,FALSE)","v":"WF-7"},"WF",null,null,null,null,null,null,"F86030",null,8197,24,21,21,21,21,8,33,31,30,30,30,30,31,25,24,24,25,24]
["2019-09-01",{"$f":"VLOOKUP(J239,'Control Panel'!$G$132:$K$171,5,FALSE)","v":"WF-4"},"WF",null,null,null,null,null,null,"F86036",null,15894,70,63,63,63,59,38,68,66,62,61,63,62,60,56,55,52,52,52]
["2019-09-01",{"$f":"VLOOKUP(J240,'Control Panel'!$G$132:$K$171,5,FALSE)","v":"WF-3"},"WF",null,null,null,null,null,null,"F86038",null,11126,51,47,46,47,48,6,40,40,34,33,34,34,55,47,46,37,48,39]
["2019-09-01",{"$f":"VLOOKUP(J241,'Control Panel'!$G$132:$K$171,5,FALSE)","v":"WF-4"},"WF",null,null,null,null,null,null,"F86044",null,9129,49,40,39,40,40,4,38,26,25,25,25,25,31,23,20,18,20,18]
["2019-09-01",{"$f":"VLOOKUP(J242,'Control Panel'!$G$132:$K$171,5,FALSE)","v":"WF-5"},"WF",null,null,null,null,null,null,"F86045",null,1967,4,3,3,3,3,1,3,3,3,3,3,2,4,4,4,3,4,4]
["2019-09-01",{"$f":"VLOOKUP(J243,'Control Panel'!$G$132:$K$171,5,FALSE)","v":"WF-7"},"WF",null,null,null,null,null,null,"F86058",null,15841,64,53,51,51,49,15,66,63,55,52,56,53,56,52,52,42,51,44]
["2019-09-01",{"$f":"VLOOKUP(J244,'Control Panel'!$G$132:$K$171,5,FALSE)","v":"WF-7"},"WF",null,null,null,null,null,null,"F86062",null,7317,25,22,22,22,19,4,25,23,19,19,20,20,15,15,15,12,14,11]
["2019-09-01",{"$f":"VLOOKUP(J245,'Control Panel'!$G$132:$K$171,5,FALSE)","v":"WF-2"},"WF",null,null,null,null,null,null,"F86078",null,7273,22,20,19,20,17,5,13,13,10,10,10,9,14,14,12,9,12,9]
["2019-09-01",{"$f":"VLOOKUP(J246,'Control Panel'!$G$132:$K$171,5,FALSE)","v":"WF-6"},"WF",null,null,null,null,null,null,"F86086",null,6061,21,17,17,17,17,4,22,18,15,14,14,14,25,9,23,11,23,19]
["2019-09-01",{"$f":"VLOOKUP(J247,'Control Panel'!$G$132:$K$171,5,FALSE)","v":"WF-4"},"WF",null,null,null,null,null,null,"F86088",null,4904,18,16,15,16,15,4,11,9,7,6,7,7,13,11,13,9,13,11]
["2019-09-01",{"$f":"VLOOKUP(J248,'Control Panel'!$G$132:$K$171,5,FALSE)","v":"WF-6"},"WF",null,null,null,null,null,null,"F86607",null,14046,55,46,51,51,49,20,50,45,44,44,45,44,63,59,58,54,57,58]
["2019-09-01",{"$f":"VLOOKUP(J249,'Control Panel'!$G$132:$K$171,5,FALSE)","v":"WF-2"},"WF",null,null,null,null,null,null,"F86616",null,6975,25,23,24,24,23,2,40,37,36,35,35,36,22,19,18,12,19,13]
["2019-09-01",{"$f":"VLOOKUP(J250,'Control Panel'!$G$132:$K$171,5,FALSE)","v":"WF-5"},"WF",null,null,null,null,null,null,"F86621",null,5736,19,17,16,17,16,8,9,9,9,9,9,9,15,6,14,11,14,11]
["2019-09-01",{"$f":"VLOOKUP(J251,'Control Panel'!$G$132:$K$171,5,FALSE)","v":"WF-5"},"WF",null,null,null,null,null,null,"F86625",null,6156,14,9,9,9,8,2,11,9,8,8,8,8,20,19,18,13,7,15]
["2019-09-01",{"$f":"VLOOKUP(J252,'Control Panel'!$G$132:$K$171,5,FALSE)","v":"WF-1"},"WF",null,null,null,null,null,null,"F86626",null,5543,18,17,17,17,17,5,16,15,10,11,11,11,23,23,21,20,22,19]
["2019-09-01",{"$f":"VLOOKUP(J253,'Control Panel'!$G$132:$K$171,5,FALSE)","v":"WF-2"},"WF",null,null,null,null,null,null,"F86627",null,13802,37,34,34,34,28,8,43,37,36,36,35,32,47,46,45,33,44,36]
["2019-09-01",{"$f":"VLOOKUP(J254,'Control Panel'!$G$132:$K$171,5,FALSE)","v":"WF-6"},"WF",null,null,null,null,null,null,"F86644",null,10808,27,25,25,26,22,2,43,38,36,37,37,37,33,32,32,12,33,25]
["2019-09-01",{"$f":"VLOOKUP(J255,'Control Panel'!$G$132:$K$171,5,FALSE)","v":"WF-4"},"WF",null,null,null,null,null,null,"F86650",null,8314,34,31,30,30,30,9,35,31,28,29,29,28,41,34,32,25,35,24]
["2019-09-01",{"$f":"VLOOKUP(J256,'Control Panel'!$G$132:$K$171,5,FALSE)","v":"WF-1"},"WF",null,null,null,null,null,null,"F86664",null,8426,35,31,31,31,32,1,28,28,23,23,23,23,25,23,22,19,22,19]
["2019-09-01",{"$f":"VLOOKUP(J257,'Control Panel'!$G$132:$K$171,5,FALSE)","v":"WF-5"},"WF",null,null,null,null,null,null,"F86666",null,14355,43,38,33,37,31,16,51,47,43,45,43,42,52,49,47,39,42,41]
["2019-09-01",{"$f":"VLOOKUP(J258,'Control Panel'!$G$132:$K$171,5,FALSE)","v":"WF-7"},"WF",null,null,null,null,null,null,"F86679",null,5929,33,30,30,31,29,6,30,29,25,25,26,26,16,12,16,13,15,14]
["2019-09-01",{"$f":"VLOOKUP(J259,'Control Panel'!$G$132:$K$171,5,FALSE)","v":"WF-1"},"WF",null,null,null,null,null,null,"F86689",null,4177,34,33,33,33,30,6,16,16,16,16,16,16,18,10,14,11,14,13]
["2019-09-01",{"$f":"VLOOKUP(J260,'Control Panel'!$G$132:$K$171,5,FALSE)","v":"WF-4"},"WF",null,null,null,null,null,null,"F86696",null,5303,14,14,14,14,14,2,11,9,10,10,10,10,10,10,10,7,10,7]
["2019-09-01",{"$f":"VLOOKUP(J261,'Control Panel'!$G$132:$K$171,5,FALSE)","v":"WF-1"},"WF",null,null,null,null,null,null,"F86700",null,3857,14,10,10,10,10,4,9,9,8,8,8,7,9,8,8,8,8,8]
["2019-09-01",{"$f":"VLOOKUP(J262,'Control Panel'!$G$132:$K$171,5,FALSE)","v":"WF-5"},"WF",null,null,null,null,null,null,"F86701",null,3352,12,10,10,11,11,2,14,12,13,11,12,12,12,4,9,9,9,8]
["2019-09-01",{"$f":"VLOOKUP(J263,'Control Panel'!$G$132:$K$171,5,FALSE)","v":"WF-5"},"WF",null,null,null,null,null,null,"F86705",null,3085,9,9,8,9,9,6,4,4,4,3,3,3,5,5,5,4,4,4]
["2019-09-01",{"$f":"VLOOKUP(J264,'Control Panel'!$G$132:$K$171,5,FALSE)","v":"WF-6"},"WF",null,null,null,null,null,null,"F86708",null,2810,6,4,4,4,3,3,7,7,7,7,7,6,10,10,10,7,10,7]
["2019-09-01",{"$f":"VLOOKUP(J265,'Control Panel'!$G$132:$K$171,5,FALSE)","v":"WF-4"},"WF",null,null,null,null,null,null,"F86712",null,3121,17,14,15,14,15,2,5,5,4,4,4,4,7,3,7,4,7,5]
["2019-09-01",{"$f":"VLOOKUP(J266,'Control Panel'!$G$132:$K$171,5,FALSE)","v":"WF-2"},"WF",null,null,null,null,null,null,"Y01291",null,8762,32,30,29,30,29,11,28,27,24,24,25,25,32,30,31,29,30,29]
["2019-09-01",{"$f":"VLOOKUP(J267,'Control Panel'!$G$132:$K$171,5,FALSE)","v":"WF-1"},"WF",null,null,null,null,null,null,"Y01839",null,6459,26,25,25,25,24,9,26,25,25,24,24,24,21,17,18,16,16,15]
["2019-09-01",{"$f":"VLOOKUP(J268,'Control Panel'!$G$132:$K$171,5,FALSE)","v":"WF-3"},"WF",null,null,null,null,null,null,"Y02585",null,7164,26,24,24,24,24,16,25,24,23,22,22,22,18,15,16,11,15,11]
["2019-09-01",{"$f":"VLOOKUP(J269,'Control Panel'!$G$132:$K$171,5,FALSE)","v":{"$error":"#N/A"}},null,null,null,null,null,null,null,"Total",null,267782,977,861,850,866,822,239,935,860,786,782,793,778,915,789,809,644,786,689]
["2019-10-01",{"$f":"VLOOKUP(J270,'Control Panel'!$G$132:$K$171,5,FALSE)","v":{"$error":"#N/A"}},"Childhood Immunisations Q3",null,"Last Run:",null,"Population Count",282199,null,null,"Search","All Patients","(01) 12 MONTH COHORT","(01.01) DTaP/IPV/Hib 6in1","(01.02) Men B (1st and 2nd)","(01.03) PCV","(01.04) Rotavirus","(01.05) BCG","(02) 24 MONTH COHORT","(02.01) DTaP/IPV/Hib Combined","(02.02) MMR","(02.03) HiB/Men C","(02.04) PCV (Booster)","(02.05) Men B (Booster)","(03) 5 YEAR COHORT","(03.01) DTaP/IPV/Hib Combined","(03.02) MMR (Primary)","(03.03) DTaP/IPV (Booster)","(03.04) HiB/Men C","(03.05) MMR (Booster)"]
["2019-10-01",{"$f":"VLOOKUP(J271,'Control Panel'!$G$132:$K$171,5,FALSE)","v":{"$error":"#N/A"}},null,null,"2019-11-04T10:10:00",null,"Males",143909,null,"Organisation Code"]
["2019-10-01",{"$f":"VLOOKUP(J272,'Control Panel'!$G$132:$K$171,5,FALSE)","v":"WF-6"},"WF",null,"Relative Date:",null,"Females",138290,null,"F86001",null,7907,24,23,23,23,22,2,22,19,15,15,16,15,23,21,20,20,19,20]
["2019-10-01",{"$f":"VLOOKUP(J273,'Control Panel'!$G$132:$K$171,5,FALSE)","v":"WF-1"},"WF",null,"2019-11-01",null,null,null,null,"F86005",null,8542,56,54,53,54,54,5,43,40,38,38,37,37,42,37,36,33,34,32]
["2019-10-01",{"$f":"VLOOKUP(J274,'Control Panel'!$G$132:$K$171,5,FALSE)","v":"WF-7"},"WF",null,null,null,null,null,null,"F86006",null,6317,13,11,11,11,11,2,16,16,14,16,16,16,16,15,15,10,15,10]
["2019-10-01",{"$f":"VLOOKUP(J275,'Control Panel'!$G$132:$K$171,5,FALSE)","v":"WF-3"},"WF",null,null,null,null,null,null,"F86011",null,9370,20,17,17,17,18,6,29,25,17,18,18,18,29,23,23,22,24,22]
["2019-10-01",{"$f":"VLOOKUP(J276,'Control Panel'!$G$132:$K$171,5,FALSE)","v":"WF-7"},"WF",null,null,null,null,null,null,"F86030",null,8170,33,31,31,31,31,14,29,27,26,26,26,26,29,27,27,23,26,27]
["2019-10-01",{"$f":"VLOOKUP(J277,'Control Panel'!$G$132:$K$171,5,FALSE)","v":"WF-4"},"WF",null,null,null,null,null,null,"F86036",null,15929,66,58,58,58,58,36,63,59,56,56,57,57,59,56,54,52,56,53]
["2019-10-01",{"$f":"VLOOKUP(J278,'Control Panel'!$G$132:$K$171,5,FALSE)","v":"WF-3"},"WF",null,null,null,null,null,null,"F86038",null,11354,31,28,28,28,29,4,43,40,38,37,37,37,46,42,39,36,39,38]
["2019-10-01",{"$f":"VLOOKUP(J279,'Control Panel'!$G$132:$K$171,5,FALSE)","v":"WF-4"},"WF",null,null,null,null,null,null,"F86044",null,9370,52,47,46,48,46,4,43,35,34,35,34,34,22,21,16,12,19,12]
["2019-10-01",{"$f":"VLOOKUP(J280,'Control Panel'!$G$132:$K$171,5,FALSE)","v":"WF-5"},"WF",null,null,null,null,null,null,"F86045",null,1966,5,5,5,5,5,3,2,2,2,1,1,0,4,4,4,2,3,3]
["2019-10-01",{"$f":"VLOOKUP(J281,'Control Panel'!$G$132:$K$171,5,FALSE)","v":"WF-7"},"WF",null,null,null,null,null,null,"F86058",null,15417,57,52,52,52,47,5,58,53,47,47,47,48,53,43,43,28,41,27]
["2019-10-01",{"$f":"VLOOKUP(J282,'Control Panel'!$G$132:$K$171,5,FALSE)","v":"WF-7"},"WF",null,null,null,null,null,null,"F86062",null,7347,19,16,17,17,17,1,30,29,26,26,26,25,22,22,21,14,17,14]
["2019-10-01",{"$f":"VLOOKUP(J283,'Control Panel'!$G$132:$K$171,5,FALSE)","v":"WF-2"},"WF",null,null,null,null,null,null,"F86078",null,7255,13,13,13,13,13,3,15,12,13,12,13,12,10,10,8,9,9,8]
["2019-10-01",{"$f":"VLOOKUP(J284,'Control Panel'!$G$132:$K$171,5,FALSE)","v":"WF-6"},"WF",null,null,null,null,null,null,"F86086",null,6133,26,23,23,23,24,7,34,27,26,24,24,25,33,13,27,18,26,21]
["2019-10-01",{"$f":"VLOOKUP(J285,'Control Panel'!$G$132:$K$171,5,FALSE)","v":"WF-4"},"WF",null,null,null,null,null,null,"F86088",null,4907,13,11,11,11,12,0,16,15,16,16,16,15,14,12,10,7,8,8]
["2019-10-01",{"$f":"VLOOKUP(J286,'Control Panel'!$G$132:$K$171,5,FALSE)","v":"WF-6"},"WF",null,null,null,null,null,null,"F86607",null,14019,60,52,54,54,51,25,49,46,42,41,42,43,65,60,56,54,57,55]
["2019-10-01",{"$f":"VLOOKUP(J287,'Control Panel'!$G$132:$K$171,5,FALSE)","v":"WF-2"},"WF",null,null,null,null,null,null,"F86616",null,7051,35,31,32,33,32,2,35,31,30,31,31,30,24,19,22,17,20,18]
["2019-10-01",{"$f":"VLOOKUP(J288,'Control Panel'!$G$132:$K$171,5,FALSE)","v":"WF-5"},"WF",null,null,null,null,null,null,"F86621",null,5774,28,25,25,25,25,10,13,11,9,8,8,9,12,1,12,9,12,9]
["2019-10-01",{"$f":"VLOOKUP(J289,'Control Panel'!$G$132:$K$171,5,FALSE)","v":"WF-5"},"WF",null,null,null,null,null,null,"F86625",null,6132,19,14,14,14,13,1,18,17,13,13,13,13,18,18,17,16,13,16]
["2019-10-01",{"$f":"VLOOKUP(J290,'Control Panel'!$G$132:$K$171,5,FALSE)","v":"WF-1"},"WF",null,null,null,null,null,null,"F86626",null,5632,19,16,16,16,17,3,12,10,9,9,10,11,27,25,24,21,24,20]
["2019-10-01",{"$f":"VLOOKUP(J291,'Control Panel'!$G$132:$K$171,5,FALSE)","v":"WF-2"},"WF",null,null,null,null,null,null,"F86627",null,13804,39,35,35,35,34,10,40,39,36,36,36,35,37,34,36,32,36,31]
["2019-10-01",{"$f":"VLOOKUP(J292,'Control Panel'!$G$132:$K$171,5,FALSE)","v":"WF-6"},"WF",null,null,null,null,null,null,"F86644",null,10672,31,27,27,27,26,6,37,34,34,35,35,35,36,35,34,22,35,27]
["2019-10-01",{"$f":"VLOOKUP(J293,'Control Panel'!$G$132:$K$171,5,FALSE)","v":"WF-4"},"WF",null,null,null,null,null,null,"F86650",null,8264,27,22,20,22,20,9,24,20,21,20,19,18,30,24,26,20,26,21]
["2019-10-01",{"$f":"VLOOKUP(J294,'Control Panel'!$G$132:$K$171,5,FALSE)","v":"WF-1"},"WF",null,null,null,null,null,null,"F86664",null,8419,22,18,18,18,19,3,28,27,25,25,25,25,30,28,28,25,28,27]
["2019-10-01",{"$f":"VLOOKUP(J295,'Control Panel'!$G$132:$K$171,5,FALSE)","v":"WF-5"},"WF",null,null,null,null,null,null,"F86666",null,14375,40,36,37,38,37,10,62,56,45,50,46,48,54,50,51,48,50,48]
["2019-10-01",{"$f":"VLOOKUP(J296,'Control Panel'!$G$132:$K$171,5,FALSE)","v":"WF-7"},"WF",null,null,null,null,null,null,"F86679",null,5972,33,30,30,31,31,11,41,39,37,38,38,37,27,14,24,22,25,21]
["2019-10-01",{"$f":"VLOOKUP(J297,'Control Panel'!$G$132:$K$171,5,FALSE)","v":"WF-1"},"WF",null,null,null,null,null,null,"F86689",null,4192,23,22,22,21,20,6,28,26,26,26,26,26,26,10,21,19,21,20]
["2019-10-01",{"$f":"VLOOKUP(J298,'Control Panel'!$G$132:$K$171,5,FALSE)","v":"WF-4"},"WF",null,null,null,null,null,null,"F86696",null,5378,17,14,14,15,13,2,15,14,13,13,14,15,17,14,14,15,14,14]
["2019-10-01",{"$f":"VLOOKUP(J299,'Control Panel'!$G$132:$K$171,5,FALSE)","v":"WF-1"},"WF",null,null,null,null,null,null,"F86700",null,3855,14,13,14,14,14,7,10,10,9,9,9,9,16,15,14,14,13,14]
["2019-10-01",{"$f":"VLOOKUP(J300,'Control Panel'!$G$132:$K$171,5,FALSE)","v":"WF-5"},"WF",null,null,null,null,null,null,"F86701",null,3376,14,11,11,11,10,6,11,11,9,9,9,10,8,3,7,8,7,8]
["2019-10-01",{"$f":"VLOOKUP(J301,'Control Panel'!$G$132:$K$171,5,FALSE)","v":"WF-5"},"WF",null,null,null,null,null,null,"F86705",null,3110,11,11,11,11,11,7,9,9,7,8,7,7,8,7,7,7,7,7]
["2019-10-01",{"$f":"VLOOKUP(J302,'Control Panel'!$G$132:$K$171,5,FALSE)","v":"WF-6"},"WF",null,null,null,null,null,null,"F86708",null,2802,5,4,4,4,3,1,7,7,6,6,6,6,15,14,14,8,14,8]
["2019-10-01",{"$f":"VLOOKUP(J303,'Control Panel'!$G$132:$K$171,5,FALSE)","v":"WF-4"},"WF",null,null,null,null,null,null,"F86712",null,3144,9,9,9,9,9,2,13,11,10,10,10,10,10,5,10,8,9,9]
["2019-10-01",{"$f":"VLOOKUP(J304,'Control Panel'!$G$132:$K$171,5,FALSE)","v":"WF-2"},"WF",null,null,null,null,null,null,"Y01291",null,8772,29,29,28,29,27,12,26,25,24,24,24,24,31,29,28,27,28,27]
["2019-10-01",{"$f":"VLOOKUP(J305,'Control Panel'!$G$132:$K$171,5,FALSE)","v":"WF-1"},"WF",null,null,null,null,null,null,"Y01839",null,6420,31,26,28,27,27,9,28,24,24,24,24,24,26,24,20,14,21,14]
["2019-10-01",{"$f":"VLOOKUP(J306,'Control Panel'!$G$132:$K$171,5,FALSE)","v":"WF-3"},"WF",null,null,null,null,null,null,"Y02585",null,6387,32,28,28,28,23,9,30,26,25,25,25,25,30,25,25,16,24,18]
["2019-10-01",{"$f":"VLOOKUP(J307,'Control Panel'!$G$132:$K$171,5,FALSE)","v":{"$error":"#N/A"}},null,null,null,null,null,null,null,"Total",null,267534,966,862,865,873,849,243,979,892,822,827,825,825,949,800,833,708,820,727]
["2019-11-01",{"$f":"VLOOKUP(J308,'Control Panel'!$G$132:$K$171,5,FALSE)","v":{"$error":"#N/A"}},"Childhood Immunisations Q3",null,"Last Run:",null,"Population Count",282402,null,null,"Search","All Patients","(01) 12 MONTH COHORT","(01.01) DTaP/IPV/Hib 6in1","(01.02) Men B (1st and 2nd)","(01.03) PCV","(01.04) Rotavirus","(01.05) BCG","(02) 24 MONTH COHORT","(02.01) DTaP/IPV/Hib Combined","(02.02) MMR","(02.03) HiB/Men C","(02.04) PCV (Booster)","(02.05) Men B (Booster)","(03) 5 YEAR COHORT","(03.01) DTaP/IPV/Hib Combined","(03.02) MMR (Primary)","(03.03) DTaP/IPV (Booster)","(03.04) HiB/Men C","(03.05) MMR (Booster)"]
["2019-11-01",{"$f":"VLOOKUP(J309,'Control Panel'!$G$132:$K$171,5,FALSE)","v":{"$error":"#N/A"}},null,null,"2019-12-02T09:23:00",null,"Males",143995,null,"Organisation Code"]
["2019-11-01",{"$f":"VLOOKUP(J310,'Control Panel'!$G$132:$K$171,5,FALSE)","v":"WF-6"},"WF",null,"Relative Date:",null,"Females",138407,null,"F86001",null,7897,24,23,23,23,22,2,22,19,15,15,16,15,23,21,20,20,19,20]
["2019-11-01",{"$f":"VLOOKUP(J311,'Control Panel'!$G$132:$K$171,5,FALSE)","v":"WF-1"},"WF",null,"2019-12-01",null,null,null,null,"F86005",null,8566,57,54,53,55,55,5,43,39,37,37,36,36,43,37,36,33,34,32]
["2019-11-01",{"$f":"VLOOKUP(J312,'Control Panel'!$G$132:$K$171,5,FALSE)","v":"WF-7"},"WF",null,null,null,null,null,null,"F86006",null,6352,12,10,10,10,10,2,18,18,16,17,17,17,16,15,15,10,15,10]
["2019-11-01",{"$f":"VLOOKUP(J313,'Control Panel'!$G$132:$K$171,5,FALSE)","v":"WF-3"},"WF",null,null,null,null,null,null,"F86011",null,9403,20,17,17,17,18,6,31,26,20,21,21,20,29,23,23,22,24,22]
["2019-11-01",{"$f":"VLOOKUP(J314,'Control Panel'!$G$132:$K$171,5,FALSE)","v":"WF-7"},"WF",null,null,null,null,null,null,"F86030",null,8192,33,31,31,31,31,14,29,27,26,26,26,26,29,27,27,23,26,27]
["2019-11-01",{"$f":"VLOOKUP(J315,'Control Panel'!$G$132:$K$171,5,FALSE)","v":"WF-4"},"WF",null,null,null,null,null,null,"F86036",null,15920,67,59,59,59,59,37,63,59,56,56,57,57,59,56,54,52,56,53]
["2019-11-01",{"$f":"VLOOKUP(J316,'Control Panel'!$G$132:$K$171,5,FALSE)","v":"WF-3"},"WF",null,null,null,null,null,null,"F86038",null,11344,31,28,28,28,29,4,45,41,39,38,38,38,47,43,39,37,39,39]
["2019-11-01",{"$f":"VLOOKUP(J317,'Control Panel'!$G$132:$K$171,5,FALSE)","v":"WF-4"},"WF",null,null,null,null,null,null,"F86044",null,9418,51,46,45,47,45,4,43,35,34,35,34,34,22,21,16,12,19,12]
["2019-11-01",{"$f":"VLOOKUP(J318,'Control Panel'!$G$132:$K$171,5,FALSE)","v":"WF-5"},"WF",null,null,null,null,null,null,"F86045",null,1966,5,5,5,5,5,3,2,2,2,1,1,0,4,4,4,2,3,3]
["2019-11-01",{"$f":"VLOOKUP(J319,'Control Panel'!$G$132:$K$171,5,FALSE)","v":"WF-7"},"WF",null,null,null,null,null,null,"F86058",null,15519,56,51,51,51,46,5,58,54,48,48,48,48,53,43,43,29,41,28]
["2019-11-01",{"$f":"VLOOKUP(J320,'Control Panel'!$G$132:$K$171,5,FALSE)","v":"WF-7"},"WF",null,null,null,null,null,null,"F86062",null,7368,17,14,15,15,15,1,29,28,25,25,25,24,22,22,21,14,17,14]
["2019-11-01",{"$f":"VLOOKUP(J321,'Control Panel'!$G$132:$K$171,5,FALSE)","v":"WF-2"},"WF",null,null,null,null,null,null,"F86078",null,7245,12,12,12,12,12,3,16,13,14,13,14,13,10,10,9,9,10,8]
["2019-11-01",{"$f":"VLOOKUP(J322,'Control Panel'!$G$132:$K$171,5,FALSE)","v":"WF-6"},"WF",null,null,null,null,null,null,"F86086",null,6159,26,23,23,23,24,7,35,27,26,24,24,25,33,14,28,19,27,22]
["2019-11-01",{"$f":"VLOOKUP(J323,'Control Panel'!$G$132:$K$171,5,FALSE)","v":"WF-4"},"WF",null,null,null,null,null,null,"F86088",null,4893,13,11,11,11,12,0,15,14,15,15,15,14,14,12,10,7,8,8]
["2019-11-01",{"$f":"VLOOKUP(J324,'Control Panel'!$G$132:$K$171,5,FALSE)","v":"WF-6"},"WF",null,null,null,null,null,null,"F86607",null,14017,60,52,54,54,51,25,49,46,42,41,42,43,65,59,55,53,56,54]
["2019-11-01",{"$f":"VLOOKUP(J325,'Control Panel'!$G$132:$K$171,5,FALSE)","v":"WF-2"},"WF",null,null,null,null,null,null,"F86616",null,7096,37,32,33,34,33,2,35,31,30,31,31,30,24,18,22,17,20,18]
["2019-11-01",{"$f":"VLOOKUP(J326,'Control Panel'!$G$132:$K$171,5,FALSE)","v":"WF-5"},"WF",null,null,null,null,null,null,"F86621",null,5842,28,25,25,25,25,10,13,12,9,8,8,9,11,1,11,9,11,9]
["2019-11-01",{"$f":"VLOOKUP(J327,'Control Panel'!$G$132:$K$171,5,FALSE)","v":"WF-5"},"WF",null,null,null,null,null,null,"F86625",null,6118,18,14,14,14,13,0,18,17,13,13,13,13,18,18,17,16,13,16]
["2019-11-01",{"$f":"VLOOKUP(J328,'Control Panel'!$G$132:$K$171,5,FALSE)","v":"WF-1"},"WF",null,null,null,null,null,null,"F86626",null,5709,21,18,18,18,19,3,13,11,10,10,11,12,26,24,23,20,23,19]
["2019-11-01",{"$f":"VLOOKUP(J329,'Control Panel'!$G$132:$K$171,5,FALSE)","v":"WF-2"},"WF",null,null,null,null,null,null,"F86627",null,13790,39,35,35,35,34,10,39,38,35,35,35,34,37,34,36,32,36,31]
["2019-11-01",{"$f":"VLOOKUP(J330,'Control Panel'!$G$132:$K$171,5,FALSE)","v":"WF-6"},"WF",null,null,null,null,null,null,"F86644",null,10718,31,27,27,27,26,7,37,34,34,35,35,35,37,35,34,22,35,27]
["2019-11-01",{"$f":"VLOOKUP(J331,'Control Panel'!$G$132:$K$171,5,FALSE)","v":"WF-4"},"WF",null,null,null,null,null,null,"F86650",null,8263,27,23,21,23,20,9,22,18,19,18,18,17,31,25,27,20,27,21]
["2019-11-01",{"$f":"VLOOKUP(J332,'Control Panel'!$G$132:$K$171,5,FALSE)","v":"WF-1"},"WF",null,null,null,null,null,null,"F86664",null,8393,22,18,18,18,19,3,29,27,26,26,26,25,32,30,30,26,30,28]
["2019-11-01",{"$f":"VLOOKUP(J333,'Control Panel'!$G$132:$K$171,5,FALSE)","v":"WF-5"},"WF",null,null,null,null,null,null,"F86666",null,14414,39,35,36,37,36,11,61,55,45,48,46,47,55,51,52,49,51,49]
["2019-11-01",{"$f":"VLOOKUP(J334,'Control Panel'!$G$132:$K$171,5,FALSE)","v":"WF-7"},"WF",null,null,null,null,null,null,"F86679",null,6005,34,30,30,31,32,11,41,39,37,38,38,37,27,14,24,22,25,21]
["2019-11-01",{"$f":"VLOOKUP(J335,'Control Panel'!$G$132:$K$171,5,FALSE)","v":"WF-1"},"WF",null,null,null,null,null,null,"F86689",null,4194,25,24,24,23,22,6,28,26,26,26,26,26,26,10,21,19,21,20]
["2019-11-01",{"$f":"VLOOKUP(J336,'Control Panel'!$G$132:$K$171,5,FALSE)","v":"WF-4"},"WF",null,null,null,null,null,null,"F86696",null,5396,16,13,13,14,12,2,16,14,14,14,15,16,17,14,14,15,14,14]
["2019-11-01",{"$f":"VLOOKUP(J337,'Control Panel'!$G$132:$K$171,5,FALSE)","v":"WF-1"},"WF",null,null,null,null,null,null,"F86700",null,3862,15,13,15,15,15,7,10,10,9,9,9,9,17,15,15,15,13,15]
["2019-11-01",{"$f":"VLOOKUP(J338,'Control Panel'!$G$132:$K$171,5,FALSE)","v":"WF-5"},"WF",null,null,null,null,null,null,"F86701",null,3388,14,11,11,11,10,6,11,11,9,9,9,10,10,5,9,8,9,10]
["2019-11-01",{"$f":"VLOOKUP(J339,'Control Panel'!$G$132:$K$171,5,FALSE)","v":"WF-5"},"WF",null,null,null,null,null,null,"F86705",null,3126,11,11,11,11,11,8,9,9,7,8,7,7,8,7,7,7,7,7]
["2019-11-01",{"$f":"VLOOKUP(J340,'Control Panel'!$G$132:$K$171,5,FALSE)","v":"WF-6"},"WF",null,null,null,null,null,null,"F86708",null,2802,5,4,4,4,3,1,7,7,6,6,6,6,15,14,14,8,14,8]
["2019-11-01",{"$f":"VLOOKUP(J341,'Control Panel'!$G$132:$K$171,5,FALSE)","v":"WF-4"},"WF",null,null,null,null,null,null,"F86712",null,3163,9,9,9,9,9,2,12,10,10,10,10,10,10,5,10,8,9,9]
["2019-11-01",{"$f":"VLOOKUP(J342,'Control Panel'!$G$132:$K$171,5,FALSE)","v":"WF-2"},"WF",null,null,null,null,null,null,"Y01291",null,8793,29,29,28,29,27,13,27,25,24,24,24,24,30,29,28,27,28,27]
["2019-11-01",{"$f":"VLOOKUP(J343,'Control Panel'!$G$132:$K$171,5,FALSE)","v":"WF-1"},"WF",null,null,null,null,null,null,"Y01839",null,6408,31,27,29,28,27,9,28,24,24,24,24,24,26,24,20,14,21,14]
["2019-11-01",{"$f":"VLOOKUP(J344,'Control Panel'!$G$132:$K$171,5,FALSE)","v":"WF-3"},"WF",null,null,null,null,null,null,"Y02585",null,6001,28,24,24,24,19,10,26,22,21,21,21,21,26,21,21,15,20,15]
["2019-11-01",{"$f":"VLOOKUP(J345,'Control Panel'!$G$132:$K$171,5,FALSE)","v":{"$error":"#N/A"}},null,null,null,null,null,null,null,"Total",null,267740,963,858,862,871,846,248,980,888,823,825,826,822,952,801,835,711,821,730]
["2019-12-01",{"$f":"VLOOKUP(J346,'Control Panel'!$G$132:$K$171,5,FALSE)","v":{"$error":"#N/A"}},"Childhood Immunisations Q3",null,"Last Run:",null,"Population Count",281977,null,null,"Search","All Patients","(01) 12 MONTH COHORT","(01.01) DTaP/IPV/Hib 6in1","(01.02) Men B (1st and 2nd)","(01.03) PCV","(01.04) Rotavirus","(01.05) BCG","(02) 24 MONTH COHORT","(02.01) DTaP/IPV/Hib Combined","(02.02) MMR","(02.03) HiB/Men C","(02.04) PCV (Booster)","(02.05) Men B (Booster)","(03) 5 YEAR COHORT","(03.01) DTaP/IPV/Hib Combined","(03.02) MMR (Primary)","(03.03) DTaP/IPV (Booster)","(03.04) HiB/Men C","(03.05) MMR (Booster)"]
["2019-12-01",{"$f":"VLOOKUP(J347,'Control Panel'!$G$132:$K$171,5,FALSE)","v":{"$error":"#N/A"}},null,null,"2020-01-07T14:12:00",null,"Males",143859,null,"Organisation Code"]
["2019-12-01",{"$f":"VLOOKUP(J348,'Control Panel'!$G$132:$K$171,5,FALSE)","v":"WF-6"},"WF",null,"Relative Date:",null,"Females",138118,null,"F86001",null,7909,24,23,23,23,22,2,22,19,15,15,16,15,23,21,20,20,19,20]
["2019-12-01",{"$f":"VLOOKUP(J349,'Control Panel'!$G$132:$K$171,5,FALSE)","v":"WF-1"},"WF",null,"2020-01-01",null,null,null,null,"F86005",null,8616,56,53,52,54,54,5,42,38,36,36,35,35,43,37,36,33,34,32]
["2019-12-01",{"$f":"VLOOKUP(J350,'Control Panel'!$G$132:$K$171,5,FALSE)","v":"WF-7"},"WF",null,null,null,null,null,null,"F86006",null,6390,12,10,10,10,10,2,18,18,16,17,17,17,16,15,15,10,15,10]
["2019-12-01",{"$f":"VLOOKUP(J351,'Control Panel'!$G$132:$K$171,5,FALSE)","v":"WF-3"},"WF",null,null,null,null,null,null,"F86011",null,9377,20,17,17,17,18,6,30,25,19,20,20,19,29,23,23,22,24,22]
["2019-12-01",{"$f":"VLOOKUP(J352,'Control Panel'!$G$132:$K$171,5,FALSE)","v":"WF-7"},"WF",null,null,null,null,null,null,"F86030",null,8251,32,30,30,30,30,14,29,26,25,25,25,25,30,27,27,23,26,27]
["2019-12-01",{"$f":"VLOOKUP(J353,'Control Panel'!$G$132:$K$171,5,FALSE)","v":"WF-4"},"WF",null,null,null,null,null,null,"F86036",null,15932,67,59,59,59,59,39,62,58,55,55,56,56,60,57,55,53,57,54]
["2019-12-01",{"$f":"VLOOKUP(J354,'Control Panel'!$G$132:$K$171,5,FALSE)","v":"WF-3"},"WF",null,null,null,null,null,null,"F86038",null,11366,31,28,28,28,29,4,44,40,38,37,37,37,47,43,39,37,39,39]
["2019-12-01",{"$f":"VLOOKUP(J355,'Control Panel'!$G$132:$K$171,5,FALSE)","v":"WF-4"},"WF",null,null,null,null,null,null,"F86044",null,9488,50,45,44,46,44,4,41,34,32,33,32,33,23,21,16,12,19,12]
["2019-12-01",{"$f":"VLOOKUP(J356,'Control Panel'!$G$132:$K$171,5,FALSE)","v":"WF-5"},"WF",null,null,null,null,null,null,"F86045",null,1979,5,5,5,5,5,3,2,2,2,1,1,0,4,4,4,2,3,3]
["2019-12-01",{"$f":"VLOOKUP(J357,'Control Panel'!$G$132:$K$171,5,FALSE)","v":"WF-7"},"WF",null,null,null,null,null,null,"F86058",null,15690,58,51,51,51,46,5,59,56,50,50,50,50,52,42,42,29,40,28]
["2019-12-01",{"$f":"VLOOKUP(J358,'Control Panel'!$G$132:$K$171,5,FALSE)","v":"WF-7"},"WF",null,null,null,null,null,null,"F86062",null,7373,17,14,15,15,15,1,29,28,25,25,25,24,22,22,21,14,17,14]
["2019-12-01",{"$f":"VLOOKUP(J359,'Control Panel'!$G$132:$K$171,5,FALSE)","v":"WF-2"},"WF",null,null,null,null,null,null,"F86078",null,7202,13,13,13,13,13,4,16,13,14,13,14,13,10,10,9,9,10,8]
["2019-12-01",{"$f":"VLOOKUP(J360,'Control Panel'!$G$132:$K$171,5,FALSE)","v":"WF-6"},"WF",null,null,null,null,null,null,"F86086",null,6234,27,23,23,23,24,7,36,28,27,25,25,26,33,14,28,19,27,22]
["2019-12-01",{"$f":"VLOOKUP(J361,'Control Panel'!$G$132:$K$171,5,FALSE)","v":"WF-4"},"WF",null,null,null,null,null,null,"F86088",null,4877,13,11,11,11,12,0,15,14,15,15,15,14,13,11,10,6,8,7]
["2019-12-01",{"$f":"VLOOKUP(J362,'Control Panel'!$G$132:$K$171,5,FALSE)","v":"WF-6"},"WF",null,null,null,null,null,null,"F86607",null,13983,57,49,51,51,48,22,50,47,43,42,43,44,65,59,55,53,56,54]
["2019-12-01",{"$f":"VLOOKUP(J363,'Control Panel'!$G$132:$K$171,5,FALSE)","v":"WF-2"},"WF",null,null,null,null,null,null,"F86616",null,7143,38,32,33,34,33,2,33,29,28,29,29,28,24,18,22,17,20,18]
["2019-12-01",{"$f":"VLOOKUP(J364,'Control Panel'!$G$132:$K$171,5,FALSE)","v":"WF-5"},"WF",null,null,null,null,null,null,"F86621",null,5864,28,25,25,25,25,10,13,12,9,8,8,9,11,1,11,10,11,10]
["2019-12-01",{"$f":"VLOOKUP(J365,'Control Panel'!$G$132:$K$171,5,FALSE)","v":"WF-5"},"WF",null,null,null,null,null,null,"F86625",null,6142,18,14,14,14,13,0,20,19,15,15,15,15,19,19,18,17,14,17]
["2019-12-01",{"$f":"VLOOKUP(J366,'Control Panel'!$G$132:$K$171,5,FALSE)","v":"WF-1"},"WF",null,null,null,null,null,null,"F86626",null,5758,21,18,18,18,19,3,13,12,10,10,11,12,26,24,23,20,23,20]
["2019-12-01",{"$f":"VLOOKUP(J367,'Control Panel'!$G$132:$K$171,5,FALSE)","v":"WF-2"},"WF",null,null,null,null,null,null,"F86627",null,13746,39,35,35,35,34,10,39,38,35,35,35,34,36,33,35,31,35,30]
["2019-12-01",{"$f":"VLOOKUP(J368,'Control Panel'!$G$132:$K$171,5,FALSE)","v":"WF-6"},"WF",null,null,null,null,null,null,"F86644",null,10519,32,27,27,28,26,8,36,33,33,34,34,34,34,32,31,20,32,25]
["2019-12-01",{"$f":"VLOOKUP(J369,'Control Panel'!$G$132:$K$171,5,FALSE)","v":"WF-4"},"WF",null,null,null,null,null,null,"F86650",null,8173,26,22,20,22,19,9,22,19,19,18,18,17,30,24,26,19,26,20]
["2019-12-01",{"$f":"VLOOKUP(J370,'Control Panel'!$G$132:$K$171,5,FALSE)","v":"WF-1"},"WF",null,null,null,null,null,null,"F86664",null,8404,22,18,18,18,19,3,31,29,28,28,28,26,32,31,30,26,30,28]
["2019-12-01",{"$f":"VLOOKUP(J371,'Control Panel'!$G$132:$K$171,5,FALSE)","v":"WF-5"},"WF",null,null,null,null,null,null,"F86666",null,14471,36,32,34,34,33,11,61,55,45,48,46,47,55,51,52,49,51,49]
["2019-12-01",{"$f":"VLOOKUP(J372,'Control Panel'!$G$132:$K$171,5,FALSE)","v":"WF-7"},"WF",null,null,null,null,null,null,"F86679",null,6029,34,30,30,31,32,11,40,38,36,37,37,36,27,14,24,22,25,21]
["2019-12-01",{"$f":"VLOOKUP(J373,'Control Panel'!$G$132:$K$171,5,FALSE)","v":"WF-1"},"WF",null,null,null,null,null,null,"F86689",null,4214,25,24,24,23,22,6,28,26,26,26,26,26,24,9,21,18,21,19]
["2019-12-01",{"$f":"VLOOKUP(J374,'Control Panel'!$G$132:$K$171,5,FALSE)","v":"WF-4"},"WF",null,null,null,null,null,null,"F86696",null,5503,17,14,14,15,12,2,16,14,14,14,15,16,17,14,16,15,14,14]
["2019-12-01",{"$f":"VLOOKUP(J375,'Control Panel'!$G$132:$K$171,5,FALSE)","v":"WF-1"},"WF",null,null,null,null,null,null,"F86700",null,3851,15,13,15,15,15,7,10,10,9,9,9,9,17,15,15,15,13,15]
["2019-12-01",{"$f":"VLOOKUP(J376,'Control Panel'!$G$132:$K$171,5,FALSE)","v":"WF-5"},"WF",null,null,null,null,null,null,"F86701",null,3401,14,11,11,11,10,6,10,10,9,9,9,9,10,5,9,8,9,10]
["2019-12-01",{"$f":"VLOOKUP(J377,'Control Panel'!$G$132:$K$171,5,FALSE)","v":"WF-5"},"WF",null,null,null,null,null,null,"F86705",null,3137,11,11,11,11,11,8,8,8,6,7,6,6,7,6,6,6,6,6]
["2019-12-01",{"$f":"VLOOKUP(J378,'Control Panel'!$G$132:$K$171,5,FALSE)","v":"WF-6"},"WF",null,null,null,null,null,null,"F86708",null,2775,5,4,4,4,3,1,7,7,6,6,6,6,15,14,14,8,14,8]
["2019-12-01",{"$f":"VLOOKUP(J379,'Control Panel'!$G$132:$K$171,5,FALSE)","v":"WF-4"},"WF",null,null,null,null,null,null,"F86712",null,3188,9,9,9,9,9,2,12,10,10,10,10,10,10,5,10,8,9,9]
["2019-12-01",{"$f":"VLOOKUP(J380,'Control Panel'!$G$132:$K$171,5,FALSE)","v":"WF-2"},"WF",null,null,null,null,null,null,"Y01291",null,8812,29,29,28,29,27,17,27,27,26,26,26,26,30,29,28,27,28,27]
["2019-12-01",{"$f":"VLOOKUP(J381,'Control Panel'!$G$132:$K$171,5,FALSE)","v":"WF-1"},"WF",null,null,null,null,null,null,"Y01839",null,6411,31,27,29,28,27,9,27,23,23,23,23,23,26,24,20,14,21,14]
["2019-12-01",{"$f":"VLOOKUP(J382,'Control Panel'!$G$132:$K$171,5,FALSE)","v":"WF-3"},"WF",null,null,null,null,null,null,"Y02585",null,5230,26,22,22,22,18,10,23,20,19,19,19,19,21,16,16,12,16,12]
["2019-12-01",{"$f":"VLOOKUP(J383,'Control Panel'!$G$132:$K$171,5,FALSE)","v":{"$error":"#N/A"}},null,null,null,null,null,null,null,"Total",null,267438,958,848,853,862,836,253,971,885,818,820,821,816,941,790,827,704,812,724]
["2020-01-01",{"$f":"VLOOKUP(J384,'Control Panel'!$G$132:$K$171,5,FALSE)","v":{"$error":"#N/A"}},"Childhood Immunisations Q4",null,"Last Run:",null,"Population Count",279614,null,null,"Search","All Patients","(01) 12 MONTH COHORT","(01.01) DTaP/IPV/Hib 6in1","(01.02) Men B (1st and 2nd)","(01.03) PCV","(01.04) Rotavirus","(01.05) BCG","(02) 24 MONTH COHORT","(02.01) DTaP/IPV/Hib Combined","(02.02) MMR","(02.03) HiB/Men C","(02.04) PCV (Booster)","(02.05) Men B (Booster)","(03) 5 YEAR COHORT","(03.01) DTaP/IPV/Hib Combined","(03.02) MMR (Primary)","(03.03) DTaP/IPV (Booster)","(03.04) HiB/Men C","(03.05) MMR (Booster)"]
["2020-01-01",{"$f":"VLOOKUP(J385,'Control Panel'!$G$132:$K$171,5,FALSE)","v":{"$error":"#N/A"}},null,null,"2020-02-03T15:36:00",null,"Males",142735,null,"Organisation Code"]
["2020-01-01",{"$f":"VLOOKUP(J386,'Control Panel'!$G$132:$K$171,5,FALSE)","v":"WF-6"},"WF",null,"Relative Date:",null,"Females",136879,null,"F86001",null,7912,18,17,17,17,18,5,17,16,13,13,13,14,21,18,19,14,19,16]
["2020-01-01",{"$f":"VLOOKUP(J387,'Control Panel'!$G$132:$K$171,5,FALSE)","v":"WF-1"},"WF",null,"2020-02-01",null,null,null,null,"F86005",null,8666,51,44,44,45,44,4,45,42,38,39,38,39,28,28,27,16,27,19]
["2020-01-01",{"$f":"VLOOKUP(J388,'Control Panel'!$G$132:$K$171,5,FALSE)","v":"WF-7"},"WF",null,null,null,null,null,null,"F86006",null,6388,10,9,8,9,8,1,19,18,17,17,17,17,22,20,20,17,20,18]
["2020-01-01",{"$f":"VLOOKUP(J389,'Control Panel'!$G$132:$K$171,5,FALSE)","v":"WF-3"},"WF",null,null,null,null,null,null,"F86011",null,9428,21,18,18,18,16,2,22,18,17,17,17,17,25,20,21,15,21,16]
["2020-01-01",{"$f":"VLOOKUP(J390,'Control Panel'!$G$132:$K$171,5,FALSE)","v":"WF-7"},"WF",null,null,null,null,null,null,"F86030",null,8260,37,30,30,30,31,15,17,15,12,13,13,13,30,29,29,29,30,29]
["2020-01-01",{"$f":"VLOOKUP(J391,'Control Panel'!$G$132:$K$171,5,FALSE)","v":"WF-4"},"WF",null,null,null,null,null,null,"F86036",null,15951,57,53,52,52,52,29,49,46,45,45,45,46,50,47,46,45,44,45]
["2020-01-01",{"$f":"VLOOKUP(J392,'Control Panel'!$G$132:$K$171,5,FALSE)","v":"WF-3"},"WF",null,null,null,null,null,null,"F86038",null,11566,46,41,41,42,43,2,40,36,35,35,35,36,37,34,31,27,31,28]
["2020-01-01",{"$f":"VLOOKUP(J393,'Control Panel'!$G$132:$K$171,5,FALSE)","v":"WF-4"},"WF",null,null,null,null,null,null,"F86044",null,9595,38,36,35,36,31,5,40,30,34,33,34,32,25,22,21,15,20,16]
["2020-01-01",{"$f":"VLOOKUP(J394,'Control Panel'!$G$132:$K$171,5,FALSE)","v":"WF-5"},"WF",null,null,null,null,null,null,"F86045",null,1992,3,3,3,3,3,0,4,4,3,3,3,4,6,5,4,4,5,5]
["2020-01-01",{"$f":"VLOOKUP(J395,'Control Panel'!$G$132:$K$171,5,FALSE)","v":"WF-7"},"WF",null,null,null,null,null,null,"F86058",null,15641,68,61,61,61,62,10,53,47,43,43,43,42,44,38,39,30,39,31]
["2020-01-01",{"$f":"VLOOKUP(J396,'Control Panel'!$G$132:$K$171,5,FALSE)","v":"WF-7"},"WF",null,null,null,null,null,null,"F86062",null,7341,21,19,18,19,18,2,15,15,14,13,13,12,15,12,12,11,8,12]
["2020-01-01",{"$f":"VLOOKUP(J397,'Control Panel'!$G$132:$K$171,5,FALSE)","v":"WF-2"},"WF",null,null,null,null,null,null,"F86078",null,7203,9,6,6,6,7,1,20,19,19,18,19,18,6,5,5,5,5,5]
["2020-01-01",{"$f":"VLOOKUP(J398,'Control Panel'!$G$132:$K$171,5,FALSE)","v":"WF-6"},"WF",null,null,null,null,null,null,"F86086",null,6305,17,15,14,15,14,4,30,28,26,26,26,25,32,28,28,19,28,23]
["2020-01-01",{"$f":"VLOOKUP(J399,'Control Panel'!$G$132:$K$171,5,FALSE)","v":"WF-4"},"WF",null,null,null,null,null,null,"F86088",null,4901,10,9,9,9,10,2,7,5,6,6,6,6,8,8,8,5,8,5]
["2020-01-01",{"$f":"VLOOKUP(J400,'Control Panel'!$G$132:$K$171,5,FALSE)","v":"WF-6"},"WF",null,null,null,null,null,null,"F86607",null,13943,49,45,47,47,44,19,66,61,54,55,54,55,49,45,44,43,47,43]
["2020-01-01",{"$f":"VLOOKUP(J401,'Control Panel'!$G$132:$K$171,5,FALSE)","v":"WF-2"},"WF",null,null,null,null,null,null,"F86616",null,7192,28,27,28,28,27,1,34,33,28,28,30,29,38,31,33,25,33,27]
["2020-01-01",{"$f":"VLOOKUP(J402,'Control Panel'!$G$132:$K$171,5,FALSE)","v":"WF-5"},"WF",null,null,null,null,null,null,"F86621",null,5918,18,15,15,15,14,11,19,17,14,15,15,14,11,5,9,10,8,9]
["2020-01-01",{"$f":"VLOOKUP(J403,'Control Panel'!$G$132:$K$171,5,FALSE)","v":"WF-5"},"WF",null,null,null,null,null,null,"F86625",null,6141,12,10,10,10,10,1,18,17,14,14,14,14,18,15,14,13,15,15]
["2020-01-01",{"$f":"VLOOKUP(J404,'Control Panel'!$G$132:$K$171,5,FALSE)","v":"WF-1"},"WF",null,null,null,null,null,null,"F86626",null,5898,21,20,20,20,20,5,14,13,13,13,13,13,19,17,17,14,16,14]
["2020-01-01",{"$f":"VLOOKUP(J405,'Control Panel'!$G$132:$K$171,5,FALSE)","v":"WF-2"},"WF",null,null,null,null,null,null,"F86627",null,13676,21,16,16,16,16,4,31,29,26,26,25,26,30,28,25,24,25,24]
["2020-01-01",{"$f":"VLOOKUP(J406,'Control Panel'!$G$132:$K$171,5,FALSE)","v":"WF-6"},"WF",null,null,null,null,null,null,"F86644",null,10468,26,24,23,23,24,5,27,24,23,23,23,23,40,36,38,32,35,33]
["2020-01-01",{"$f":"VLOOKUP(J407,'Control Panel'!$G$132:$K$171,5,FALSE)","v":"WF-4"},"WF",null,null,null,null,null,null,"F86650",null,8200,28,26,26,26,25,12,19,17,17,17,17,17,26,24,20,12,21,13]
["2020-01-01",{"$f":"VLOOKUP(J408,'Control Panel'!$G$132:$K$171,5,FALSE)","v":"WF-1"},"WF",null,null,null,null,null,null,"F86664",null,8404,22,19,19,19,20,2,16,15,13,13,13,12,28,27,25,23,25,22]
["2020-01-01",{"$f":"VLOOKUP(J409,'Control Panel'!$G$132:$K$171,5,FALSE)","v":"WF-5"},"WF",null,null,null,null,null,null,"F86666",null,14556,55,52,48,52,49,18,37,33,31,31,34,31,31,26,28,23,25,24]
["2020-01-01",{"$f":"VLOOKUP(J410,'Control Panel'!$G$132:$K$171,5,FALSE)","v":"WF-7"},"WF",null,null,null,null,null,null,"F86679",null,6046,29,26,26,26,27,11,18,18,18,18,17,17,18,8,15,13,15,14]
["2020-01-01",{"$f":"VLOOKUP(J411,'Control Panel'!$G$132:$K$171,5,FALSE)","v":"WF-1"},"WF",null,null,null,null,null,null,"F86689",null,4245,23,17,18,18,18,3,20,19,18,18,18,19,15,13,11,9,10,10]
["2020-01-01",{"$f":"VLOOKUP(J412,'Control Panel'!$G$132:$K$171,5,FALSE)","v":"WF-4"},"WF",null,null,null,null,null,null,"F86696",null,5492,12,11,11,11,10,4,21,18,18,18,18,17,18,17,16,8,16,10]
["2020-01-01",{"$f":"VLOOKUP(J413,'Control Panel'!$G$132:$K$171,5,FALSE)","v":"WF-1"},"WF",null,null,null,null,null,null,"F86700",null,3887,11,9,9,9,9,1,8,8,8,8,8,8,8,8,6,6,7,6]
["2020-01-01",{"$f":"VLOOKUP(J414,'Control Panel'!$G$132:$K$171,5,FALSE)","v":"WF-5"},"WF",null,null,null,null,null,null,"F86701",null,3448,13,12,12,12,12,7,7,5,5,5,4,5,7,5,7,7,7,7]
["2020-01-01",{"$f":"VLOOKUP(J415,'Control Panel'!$G$132:$K$171,5,FALSE)","v":"WF-5"},"WF",null,null,null,null,null,null,"F86705",null,3156,5,3,3,3,3,1,7,5,4,4,4,4,13,12,12,10,11,10]
["2020-01-01",{"$f":"VLOOKUP(J416,'Control Panel'!$G$132:$K$171,5,FALSE)","v":"WF-6"},"WF",null,null,null,null,null,null,"F86708",null,2764,5,4,4,4,1,2,6,4,3,3,3,3,7,7,7,5,7,5]
["2020-01-01",{"$f":"VLOOKUP(J417,'Control Panel'!$G$132:$K$171,5,FALSE)","v":"WF-4"},"WF",null,null,null,null,null,null,"F86712",null,3198,9,9,9,9,9,1,13,12,10,11,11,11,8,3,4,4,4,4]
["2020-01-01",{"$f":"VLOOKUP(J418,'Control Panel'!$G$132:$K$171,5,FALSE)","v":"WF-2"},"WF",null,null,null,null,null,null,"Y01291",null,8829,40,36,36,37,37,13,25,21,21,21,21,21,33,32,33,25,33,27]
["2020-01-01",{"$f":"VLOOKUP(J419,'Control Panel'!$G$132:$K$171,5,FALSE)","v":"WF-1"},"WF",null,null,null,null,null,null,"Y01839",null,6423,27,25,25,25,24,9,26,24,21,21,21,21,21,7,20,17,21,16]
["2020-01-01",{"$f":"VLOOKUP(J420,'Control Panel'!$G$132:$K$171,5,FALSE)","v":"WF-3"},"WF",null,null,null,null,null,null,"Y02585",null,4019,10,7,7,7,7,4,10,10,7,7,7,7,13,9,9,5,8,5]
["2020-01-01",{"$f":"VLOOKUP(J421,'Control Panel'!$G$132:$K$171,5,FALSE)","v":{"$error":"#N/A"}},null,null,null,null,null,null,null,"Total",null,267052,870,774,768,779,763,216,820,742,688,690,692,688,800,689,703,580,694,606]
["2020-02-01",{"$f":"VLOOKUP(J422,'Control Panel'!$G$132:$K$171,5,FALSE)","v":{"$error":"#N/A"}},"Childhood Immunisations Q4",null,"Last Run:",null,"Population Count",279275,null,null,"Search","All Patients","(01) 12 MONTH COHORT","(01.01) DTaP/IPV/Hib 6in1","(01.02) Men B (1st and 2nd)","(01.03) PCV","(01.04) Rotavirus","(01.05) BCG","(02) 24 MONTH COHORT","(02.01) DTaP/IPV/Hib Combined","(02.02) MMR","(02.03) HiB/Men C","(02.04) PCV (Booster)","(02.05) Men B (Booster)","(03) 5 YEAR COHORT","(03.01) DTaP/IPV/Hib Combined","(03.02) MMR (Primary)","(03.03) DTaP/IPV (Booster)","(03.04) HiB/Men C","(03.05) MMR (Booster)"]
["2020-02-01",{"$f":"VLOOKUP(J423,'Control Panel'!$G$132:$K$171,5,FALSE)","v":{"$error":"#N/A"}},null,null,"2020-03-02T13:53:00",null,"Males",142506,null,"Organisation Code"]
["2020-02-01",{"$f":"VLOOKUP(J424,'Control Panel'!$G$132:$K$171,5,FALSE)","v":"WF-6"},"WF",null,"Relative Date:",null,"Females",136769,null,"F86001",null,7949,18,17,17,17,18,5,17,16,13,13,13,14,21,18,19,14,19,16]
["2020-02-01",{"$f":"VLOOKUP(J425,'Control Panel'!$G$132:$K$171,5,FALSE)","v":"WF-1"},"WF",null,"2020-03-01",null,null,null,null,"F86005",null,8687,50,45,45,45,44,4,44,42,38,39,39,39,28,28,28,16,28,19]
["2020-02-01",{"$f":"VLOOKUP(J426,'Control Panel'!$G$132:$K$171,5,FALSE)","v":"WF-7"},"WF",null,null,null,null,null,null,"F86006",null,6444,11,10,9,10,9,2,19,18,17,17,17,17,21,19,19,17,19,17]
["2020-02-01",{"$f":"VLOOKUP(J427,'Control Panel'!$G$132:$K$171,5,FALSE)","v":"WF-3"},"WF",null,null,null,null,null,null,"F86011",null,9440,21,18,18,18,16,2,23,19,18,18,18,18,25,20,21,15,21,16]
["2020-02-01",{"$f":"VLOOKUP(J428,'Control Panel'!$G$132:$K$171,5,FALSE)","v":"WF-7"},"WF",null,null,null,null,null,null,"F86030",null,8253,37,30,30,30,31,15,17,15,12,13,13,13,30,29,29,29,30,29]
["2020-02-01",{"$f":"VLOOKUP(J429,'Control Panel'!$G$132:$K$171,5,FALSE)","v":"WF-4"},"WF",null,null,null,null,null,null,"F86036",null,15970,58,53,52,52,52,31,49,46,45,45,45,46,51,48,47,46,45,46]
["2020-02-01",{"$f":"VLOOKUP(J430,'Control Panel'!$G$132:$K$171,5,FALSE)","v":"WF-3"},"WF",null,null,null,null,null,null,"F86038",null,11640,46,41,41,42,42,5,40,36,35,35,35,36,37,34,31,27,31,28]
["2020-02-01",{"$f":"VLOOKUP(J431,'Control Panel'!$G$132:$K$171,5,FALSE)","v":"WF-4"},"WF",null,null,null,null,null,null,"F86044",null,9649,38,36,35,36,31,6,39,29,33,32,33,31,26,24,23,16,21,17]
["2020-02-01",{"$f":"VLOOKUP(J432,'Control Panel'!$G$132:$K$171,5,FALSE)","v":"WF-5"},"WF",null,null,null,null,null,null,"F86045",null,2001,3,3,3,3,3,0,4,4,3,3,3,4,6,5,4,4,5,5]
["2020-02-01",{"$f":"VLOOKUP(J433,'Control Panel'!$G$132:$K$171,5,FALSE)","v":"WF-7"},"WF",null,null,null,null,null,null,"F86058",null,15572,69,62,62,62,63,10,53,47,43,43,43,42,44,38,39,30,39,31]
["2020-02-01",{"$f":"VLOOKUP(J434,'Control Panel'!$G$132:$K$171,5,FALSE)","v":"WF-7"},"WF",null,null,null,null,null,null,"F86062",null,7351,20,18,17,18,17,2,17,17,16,15,15,14,14,11,11,11,7,12]
["2020-02-01",{"$f":"VLOOKUP(J435,'Control Panel'!$G$132:$K$171,5,FALSE)","v":"WF-2"},"WF",null,null,null,null,null,null,"F86078",null,7161,9,6,6,6,7,1,20,19,19,18,19,18,7,6,6,6,6,6]
["2020-02-01",{"$f":"VLOOKUP(J436,'Control Panel'!$G$132:$K$171,5,FALSE)","v":"WF-6"},"WF",null,null,null,null,null,null,"F86086",null,6328,18,16,15,16,15,5,31,29,27,27,27,26,32,27,27,19,27,22]
["2020-02-01",{"$f":"VLOOKUP(J437,'Control Panel'!$G$132:$K$171,5,FALSE)","v":"WF-4"},"WF",null,null,null,null,null,null,"F86088",null,4896,9,8,8,8,9,2,7,5,6,6,6,6,8,8,8,5,8,5]
["2020-02-01",{"$f":"VLOOKUP(J438,'Control Panel'!$G$132:$K$171,5,FALSE)","v":"WF-6"},"WF",null,null,null,null,null,null,"F86607",null,13990,47,43,45,45,42,17,67,61,54,55,54,55,49,45,44,43,47,43]
["2020-02-01",{"$f":"VLOOKUP(J439,'Control Panel'!$G$132:$K$171,5,FALSE)","v":"WF-2"},"WF",null,null,null,null,null,null,"F86616",null,7243,28,27,28,28,27,1,35,33,28,28,30,29,38,31,33,25,33,27]
["2020-02-01",{"$f":"VLOOKUP(J440,'Control Panel'!$G$132:$K$171,5,FALSE)","v":"WF-5"},"WF",null,null,null,null,null,null,"F86621",null,5926,16,14,14,14,13,11,19,17,14,15,15,14,11,5,9,10,8,9]
["2020-02-01",{"$f":"VLOOKUP(J441,'Control Panel'!$G$132:$K$171,5,FALSE)","v":"WF-5"},"WF",null,null,null,null,null,null,"F86625",null,6148,11,9,9,9,9,0,18,17,14,14,14,14,19,15,14,13,15,15]
["2020-02-01",{"$f":"VLOOKUP(J442,'Control Panel'!$G$132:$K$171,5,FALSE)","v":"WF-1"},"WF",null,null,null,null,null,null,"F86626",null,5988,20,19,19,19,19,5,14,13,13,13,13,13,19,17,17,15,16,15]
["2020-02-01",{"$f":"VLOOKUP(J443,'Control Panel'!$G$132:$K$171,5,FALSE)","v":"WF-2"},"WF",null,null,null,null,null,null,"F86627",null,13632,22,17,17,17,16,4,31,29,26,26,25,26,30,28,25,24,25,24]
["2020-02-01",{"$f":"VLOOKUP(J444,'Control Panel'!$G$132:$K$171,5,FALSE)","v":"WF-6"},"WF",null,null,null,null,null,null,"F86644",null,10381,26,24,23,23,24,5,27,24,23,23,23,23,39,35,38,31,34,32]
["2020-02-01",{"$f":"VLOOKUP(J445,'Control Panel'!$G$132:$K$171,5,FALSE)","v":"WF-4"},"WF",null,null,null,null,null,null,"F86650",null,8191,28,27,27,27,25,12,19,17,17,17,17,17,26,24,20,12,21,13]
["2020-02-01",{"$f":"VLOOKUP(J446,'Control Panel'!$G$132:$K$171,5,FALSE)","v":"WF-1"},"WF",null,null,null,null,null,null,"F86664",null,8400,22,19,19,19,20,2,16,15,14,14,14,13,27,26,24,22,24,21]
["2020-02-01",{"$f":"VLOOKUP(J447,'Control Panel'!$G$132:$K$171,5,FALSE)","v":"WF-5"},"WF",null,null,null,null,null,null,"F86666",null,14618,55,52,48,52,49,19,35,31,29,29,32,29,31,26,28,23,25,24]
["2020-02-01",{"$f":"VLOOKUP(J448,'Control Panel'!$G$132:$K$171,5,FALSE)","v":"WF-7"},"WF",null,null,null,null,null,null,"F86679",null,6091,28,25,25,25,26,10,18,18,18,18,17,17,18,8,15,13,15,14]
["2020-02-01",{"$f":"VLOOKUP(J449,'Control Panel'!$G$132:$K$171,5,FALSE)","v":"WF-1"},"WF",null,null,null,null,null,null,"F86689",null,4277,23,17,18,18,18,3,20,19,18,18,18,19,16,13,11,9,10,10]
["2020-02-01",{"$f":"VLOOKUP(J450,'Control Panel'!$G$132:$K$171,5,FALSE)","v":"WF-4"},"WF",null,null,null,null,null,null,"F86696",null,5554,12,11,11,11,10,4,21,18,18,18,18,17,19,18,17,9,16,10]
["2020-02-01",{"$f":"VLOOKUP(J451,'Control Panel'!$G$132:$K$171,5,FALSE)","v":"WF-1"},"WF",null,null,null,null,null,null,"F86700",null,3901,11,9,9,9,9,1,8,8,8,8,8,8,8,8,6,6,7,6]
["2020-02-01",{"$f":"VLOOKUP(J452,'Control Panel'!$G$132:$K$171,5,FALSE)","v":"WF-5"},"WF",null,null,null,null,null,null,"F86701",null,3467,13,12,12,12,12,7,7,5,5,5,4,5,7,5,7,7,7,7]
["2020-02-01",{"$f":"VLOOKUP(J453,'Control Panel'!$G$132:$K$171,5,FALSE)","v":"WF-5"},"WF",null,null,null,null,null,null,"F86705",null,3221,5,3,3,3,3,1,7,5,4,4,4,4,13,12,12,10,11,10]
["2020-02-01",{"$f":"VLOOKUP(J454,'Control Panel'!$G$132:$K$171,5,FALSE)","v":"WF-6"},"WF",null,null,null,null,null,null,"F86708",null,2773,4,3,3,3,1,2,6,4,3,3,3,3,7,7,7,5,7,5]
["2020-02-01",{"$f":"VLOOKUP(J455,'Control Panel'!$G$132:$K$171,5,FALSE)","v":"WF-4"},"WF",null,null,null,null,null,null,"F86712",null,3195,9,9,9,9,9,1,13,12,10,11,11,11,8,3,4,4,4,4]
["2020-02-01",{"$f":"VLOOKUP(J456,'Control Panel'!$G$132:$K$171,5,FALSE)","v":"WF-2"},"WF",null,null,null,null,null,null,"Y01291",null,8833,40,36,36,37,37,16,25,21,21,21,21,21,33,32,33,25,33,27]
["2020-02-01",{"$f":"VLOOKUP(J457,'Control Panel'!$G$132:$K$171,5,FALSE)","v":"WF-1"},"WF",null,null,null,null,null,null,"Y01839",null,6417,27,25,25,25,24,9,26,24,22,22,22,22,22,7,20,17,21,16]
["2020-02-01",{"$f":"VLOOKUP(J458,'Control Panel'!$G$132:$K$171,5,FALSE)","v":{"$error":"#N/A"}},null,null,null,null,null,null,null,"Total",null,263587,854,764,758,768,750,220,812,733,684,686,689,684,790,680,696,578,685,601]
["2020-03-01",{"$f":"VLOOKUP(J459,'Control Panel'!$G$132:$K$171,5,FALSE)","v":{"$error":"#N/A"}},"Childhood Immunisations Q4",null,"Last Run:",null,"Population Count",278643,null,null,"Search","All Patients","(01) 12 MONTH COHORT","(01.01) DTaP/IPV/Hib 6in1","(01.02) Men B (1st and 2nd)","(01.03) PCV","(01.04) Rotavirus","(01.05) BCG","(02) 24 MONTH COHORT","(02.01) DTaP/IPV/Hib Combined","(02.02) MMR","(02.03) HiB/Men C","(02.04) PCV (Booster)","(02.05) Men B (Booster)","(03) 5 YEAR COHORT","(03.01) DTaP/IPV/Hib Combined","(03.02) MMR (Primary)","(03.03) DTaP/IPV (Booster)","(03.04) HiB/Men C","(03.05) MMR (Booster)"]
["2020-03-01",{"$f":"VLOOKUP(J460,'Control Panel'!$G$132:$K$171,5,FALSE)","v":{"$error":"#N/A"}},null,null,"2020-04-02T09:26:00",null,"Males",142146,null,"Organisation Code"]
["2020-03-01",{"$f":"VLOOKUP(J461,'Control Panel'!$G$132:$K$171,5,FALSE)","v":"WF-6"},"WF",null,"Relative Date:",null,"Females",136497,null,"F86001",null,7976,18,17,17,17,18,5,17,16,13,13,13,14,21,18,19,14,19,16]
["2020-03-01",{"$f":"VLOOKUP(J462,'Control Panel'!$G$132:$K$171,5,FALSE)","v":"WF-1"},"WF",null,"2020-04-01",null,null,null,null,"F86005",null,8743,50,45,45,45,44,5,43,41,38,40,39,39,28,28,28,16,28,19]
["2020-03-01",{"$f":"VLOOKUP(J463,'Control Panel'!$G$132:$K$171,5,FALSE)","v":"WF-7"},"WF",null,null,null,null,null,null,"F86006",null,6435,11,10,9,10,9,2,19,18,17,17,17,17,20,18,18,17,18,17]
["2020-03-01",{"$f":"VLOOKUP(J464,'Control Panel'!$G$132:$K$171,5,FALSE)","v":"WF-3"},"WF",null,null,null,null,null,null,"F86011",null,9916,22,19,19,19,17,3,23,19,18,18,18,18,25,20,21,15,21,16]
["2020-03-01",{"$f":"VLOOKUP(J465,'Control Panel'!$G$132:$K$171,5,FALSE)","v":"WF-7"},"WF",null,null,null,null,null,null,"F86030",null,8299,37,32,32,32,31,15,17,15,12,13,13,13,29,28,28,28,29,28]
["2020-03-01",{"$f":"VLOOKUP(J466,'Control Panel'!$G$132:$K$171,5,FALSE)","v":"WF-4"},"WF",null,null,null,null,null,null,"F86036",null,15888,57,53,52,52,51,31,49,46,45,45,45,46,52,48,47,46,45,46]
["2020-03-01",{"$f":"VLOOKUP(J467,'Control Panel'!$G$132:$K$171,5,FALSE)","v":"WF-3"},"WF",null,null,null,null,null,null,"F86038",null,12240,48,44,44,45,45,8,42,38,37,37,37,38,41,36,33,27,32,28]
["2020-03-01",{"$f":"VLOOKUP(J468,'Control Panel'!$G$132:$K$171,5,FALSE)","v":"WF-4"},"WF",null,null,null,null,null,null,"F86044",null,9698,37,35,34,35,30,5,39,29,33,32,33,31,26,24,23,16,21,17]
["2020-03-01",{"$f":"VLOOKUP(J469,'Control Panel'!$G$132:$K$171,5,FALSE)","v":"WF-5"},"WF",null,null,null,null,null,null,"F86045",null,1991,3,3,3,3,3,0,4,4,3,3,3,4,7,5,4,4,5,5]
["2020-03-01",{"$f":"VLOOKUP(J470,'Control Panel'!$G$132:$K$171,5,FALSE)","v":"WF-7"},"WF",null,null,null,null,null,null,"F86058",null,15610,68,61,61,61,62,9,53,47,43,43,43,42,44,38,39,30,39,31]
["2020-03-01",{"$f":"VLOOKUP(J471,'Control Panel'!$G$132:$K$171,5,FALSE)","v":"WF-7"},"WF",null,null,null,null,null,null,"F86062",null,7356,20,18,17,18,17,2,16,16,15,14,14,13,14,11,11,11,7,12]
["2020-03-01",{"$f":"VLOOKUP(J472,'Control Panel'!$G$132:$K$171,5,FALSE)","v":"WF-2"},"WF",null,null,null,null,null,null,"F86078",null,7154,9,6,6,6,7,1,20,19,19,18,19,18,7,6,6,6,6,6]
["2020-03-01",{"$f":"VLOOKUP(J473,'Control Panel'!$G$132:$K$171,5,FALSE)","v":"WF-6"},"WF",null,null,null,null,null,null,"F86086",null,6384,18,16,15,16,15,5,31,29,27,27,27,26,32,27,27,19,27,22]
["2020-03-01",{"$f":"VLOOKUP(J474,'Control Panel'!$G$132:$K$171,5,FALSE)","v":"WF-4"},"WF",null,null,null,null,null,null,"F86088",null,4878,9,8,8,8,9,2,7,5,6,6,6,6,8,8,8,5,8,5]
["2020-03-01",{"$f":"VLOOKUP(J475,'Control Panel'!$G$132:$K$171,5,FALSE)","v":"WF-6"},"WF",null,null,null,null,null,null,"F86607",null,14051,47,43,45,45,42,17,67,61,54,55,54,55,49,45,44,43,47,43]
["2020-03-01",{"$f":"VLOOKUP(J476,'Control Panel'!$G$132:$K$171,5,FALSE)","v":"WF-2"},"WF",null,null,null,null,null,null,"F86616",null,7278,29,28,28,28,27,1,35,33,28,28,30,29,38,31,33,25,33,27]
["2020-03-01",{"$f":"VLOOKUP(J477,'Control Panel'!$G$132:$K$171,5,FALSE)","v":"WF-5"},"WF",null,null,null,null,null,null,"F86621",null,5974,16,14,14,14,13,11,18,16,14,15,15,14,11,6,10,10,8,9]
["2020-03-01",{"$f":"VLOOKUP(J478,'Control Panel'!$G$132:$K$171,5,FALSE)","v":"WF-5"},"WF",null,null,null,null,null,null,"F86625",null,6145,11,9,9,9,9,0,18,17,14,14,14,14,18,14,13,12,14,14]
["2020-03-01",{"$f":"VLOOKUP(J479,'Control Panel'!$G$132:$K$171,5,FALSE)","v":"WF-1"},"WF",null,null,null,null,null,null,"F86626",null,6022,20,19,19,19,19,5,14,13,13,13,13,13,20,17,17,15,16,15]
["2020-03-01",{"$f":"VLOOKUP(J480,'Control Panel'!$G$132:$K$171,5,FALSE)","v":"WF-2"},"WF",null,null,null,null,null,null,"F86627",null,13615,22,17,17,17,16,4,31,29,26,26,25,26,30,28,25,24,25,24]
["2020-03-01",{"$f":"VLOOKUP(J481,'Control Panel'!$G$132:$K$171,5,FALSE)","v":"WF-6"},"WF",null,null,null,null,null,null,"F86644",null,10412,26,24,23,23,24,5,27,24,23,23,23,23,39,36,38,31,35,32]
["2020-03-01",{"$f":"VLOOKUP(J482,'Control Panel'!$G$132:$K$171,5,FALSE)","v":"WF-4"},"WF",null,null,null,null,null,null,"F86650",null,8181,28,27,27,27,25,12,21,17,17,17,17,17,26,24,20,12,21,13]
["2020-03-01",{"$f":"VLOOKUP(J483,'Control Panel'!$G$132:$K$171,5,FALSE)","v":"WF-1"},"WF",null,null,null,null,null,null,"F86664",null,8433,23,19,19,19,20,2,16,15,14,14,14,13,27,26,24,22,24,21]
["2020-03-01",{"$f":"VLOOKUP(J484,'Control Panel'!$G$132:$K$171,5,FALSE)","v":"WF-5"},"WF",null,null,null,null,null,null,"F86666",null,14758,55,52,48,52,49,19,35,31,29,29,32,29,30,26,27,22,24,23]
["2020-03-01",{"$f":"VLOOKUP(J485,'Control Panel'!$G$132:$K$171,5,FALSE)","v":"WF-7"},"WF",null,null,null,null,null,null,"F86679",null,6104,28,25,25,25,26,10,18,18,18,18,17,17,18,8,15,13,15,14]
["2020-03-01",{"$f":"VLOOKUP(J486,'Control Panel'!$G$132:$K$171,5,FALSE)","v":"WF-1"},"WF",null,null,null,null,null,null,"F86689",null,4293,22,16,17,17,17,3,20,19,18,18,18,19,16,13,11,9,10,10]
["2020-03-01",{"$f":"VLOOKUP(J487,'Control Panel'!$G$132:$K$171,5,FALSE)","v":"WF-4"},"WF",null,null,null,null,null,null,"F86696",null,6128,15,11,11,11,10,4,24,21,20,20,20,19,19,18,17,9,16,10]
["2020-03-01",{"$f":"VLOOKUP(J488,'Control Panel'!$G$132:$K$171,5,FALSE)","v":"WF-1"},"WF",null,null,null,null,null,null,"F86700",null,3916,11,9,9,9,9,1,9,9,9,9,9,9,8,8,6,6,7,6]
["2020-03-01",{"$f":"VLOOKUP(J489,'Control Panel'!$G$132:$K$171,5,FALSE)","v":"WF-5"},"WF",null,null,null,null,null,null,"F86701",null,3528,13,12,12,12,12,7,7,5,5,5,4,5,7,5,7,7,7,7]
["2020-03-01",{"$f":"VLOOKUP(J490,'Control Panel'!$G$132:$K$171,5,FALSE)","v":"WF-5"},"WF",null,null,null,null,null,null,"F86705",null,3262,5,3,3,3,3,1,7,5,4,4,4,4,13,12,12,10,11,10]
["2020-03-01",{"$f":"VLOOKUP(J491,'Control Panel'!$G$132:$K$171,5,FALSE)","v":"WF-6"},"WF",null,null,null,null,null,null,"F86708",null,2822,4,3,3,3,1,2,6,4,3,3,3,3,7,7,7,5,7,5]
["2020-03-01",{"$f":"VLOOKUP(J492,'Control Panel'!$G$132:$K$171,5,FALSE)","v":"WF-4"},"WF",null,null,null,null,null,null,"F86712",null,3344,9,9,9,9,9,1,13,12,10,11,11,11,9,3,4,4,4,4]
["2020-03-01",{"$f":"VLOOKUP(J493,'Control Panel'!$G$132:$K$171,5,FALSE)","v":"WF-2"},"WF",null,null,null,null,null,null,"Y01291",null,8872,40,35,35,37,36,19,24,21,21,21,21,21,33,32,33,28,33,30]
["2020-03-01",{"$f":"VLOOKUP(J494,'Control Panel'!$G$132:$K$171,5,FALSE)","v":"WF-1"},"WF",null,null,null,null,null,null,"Y01839",null,6457,27,26,26,26,25,10,26,24,22,22,22,22,22,7,20,17,21,16]
["2020-03-01",{"$f":"VLOOKUP(J495,'Control Panel'!$G$132:$K$171,5,FALSE)","v":{"$error":"#N/A"}},null,null,null,null,null,null,null,"Total",null,266163,858,768,761,772,750,227,816,736,688,691,693,688,794,681,695,578,683,601]
["2020-04-01",{"$f":"VLOOKUP(J496,'Control Panel'!$G$132:$K$171,5,FALSE)","v":{"$error":"#N/A"}},"Childhood Immunisations Q1",null,"Last Run:",null,"Population Count",279904,null,null,"Search","All Patients","(01) 12 MONTH COHORT","(01.01) DTaP/IPV/Hib 6in1","(01.02) Men B (1st and 2nd)","(01.03) PCV","(01.04) Rotavirus","(01.05) BCG","(02) 24 MONTH COHORT","(02.01) DTaP/IPV/Hib Combined","(02.02) MMR","(02.03) HiB/Men C","(02.04) PCV (Booster)","(02.05) Men B (Booster)","(03) 5 YEAR COHORT","(03.01) DTaP/IPV/Hib Combined","(03.02) MMR (Primary)","(03.03) DTaP/IPV (Booster)","(03.04) HiB/Men C","(03.05) MMR (Booster)"]
["2020-04-01",{"$f":"VLOOKUP(J497,'Control Panel'!$G$132:$K$171,5,FALSE)","v":{"$error":"#N/A"}},null,null,"2020-05-06T14:07:00",null,"Males",142767,null,"Organisation Code"]
["2020-04-01",{"$f":"VLOOKUP(J498,'Control Panel'!$G$132:$K$171,5,FALSE)","v":"WF-6"},"WF",null,"Relative Date:",null,"Females",137137,null,"F86001",null,7962,20,16,15,16,17,8,21,20,17,16,16,17,36,32,31,25,31,27]
["2020-04-01",{"$f":"VLOOKUP(J499,'Control Panel'!$G$132:$K$171,5,FALSE)","v":"WF-1"},"WF",null,"2020-05-01",null,null,null,null,"F86005",null,8770,38,37,37,37,37,6,55,50,44,44,44,43,24,23,23,18,23,18]
["2020-04-01",{"$f":"VLOOKUP(J500,'Control Panel'!$G$132:$K$171,5,FALSE)","v":"WF-7"},"WF",null,null,null,null,null,null,"F86006",null,6428,23,20,21,22,20,3,25,21,22,22,23,22,17,16,16,13,14,15]
["2020-04-01",{"$f":"VLOOKUP(J501,'Control Panel'!$G$132:$K$171,5,FALSE)","v":"WF-3"},"WF",null,null,null,null,null,null,"F86011",null,9839,25,21,21,21,21,6,29,25,21,21,22,23,27,21,21,15,21,17]
["2020-04-01",{"$f":"VLOOKUP(J502,'Control Panel'!$G$132:$K$171,5,FALSE)","v":"WF-7"},"WF",null,null,null,null,null,null,"F86030",null,8338,35,34,34,34,34,13,42,37,35,35,36,35,22,18,18,13,15,16]
["2020-04-01",{"$f":"VLOOKUP(J503,'Control Panel'!$G$132:$K$171,5,FALSE)","v":"WF-4"},"WF",null,null,null,null,null,null,"F86036",null,15813,43,40,39,41,40,27,44,43,39,41,39,40,45,40,40,35,40,35]
["2020-04-01",{"$f":"VLOOKUP(J504,'Control Panel'!$G$132:$K$171,5,FALSE)","v":"WF-3"},"WF",null,null,null,null,null,null,"F86038",null,12647,46,40,39,40,38,7,53,41,40,39,40,39,44,35,34,25,33,28]
["2020-04-01",{"$f":"VLOOKUP(J505,'Control Panel'!$G$132:$K$171,5,FALSE)","v":"WF-4"},"WF",null,null,null,null,null,null,"F86044",null,9647,56,53,52,53,52,12,33,24,24,25,24,25,27,21,19,14,20,15]
["2020-04-01",{"$f":"VLOOKUP(J506,'Control Panel'!$G$132:$K$171,5,FALSE)","v":"WF-5"},"WF",null,null,null,null,null,null,"F86045",null,1988,4,4,4,4,4,4,4,4,4,4,4,4,1,1,1,1,1,1]
["2020-04-01",{"$f":"VLOOKUP(J507,'Control Panel'!$G$132:$K$171,5,FALSE)","v":"WF-7"},"WF",null,null,null,null,null,null,"F86058",null,15569,49,44,44,44,44,22,67,55,51,51,51,51,58,54,51,33,52,36]
["2020-04-01",{"$f":"VLOOKUP(J508,'Control Panel'!$G$132:$K$171,5,FALSE)","v":"WF-7"},"WF",null,null,null,null,null,null,"F86062",null,7326,27,26,26,26,26,9,29,24,21,20,21,22,16,14,14,8,5,8]
["2020-04-01",{"$f":"VLOOKUP(J509,'Control Panel'!$G$132:$K$171,5,FALSE)","v":"WF-2"},"WF",null,null,null,null,null,null,"F86078",null,7144,10,8,8,8,8,4,17,15,14,15,14,14,15,12,12,10,12,11]
["2020-04-01",{"$f":"VLOOKUP(J510,'Control Panel'!$G$132:$K$171,5,FALSE)","v":"WF-6"},"WF",null,null,null,null,null,null,"F86086",null,6386,28,25,25,26,23,7,22,21,21,22,22,22,19,17,16,8,16,12]
["2020-04-01",{"$f":"VLOOKUP(J511,'Control Panel'!$G$132:$K$171,5,FALSE)","v":"WF-4"},"WF",null,null,null,null,null,null,"F86088",null,4861,15,13,12,13,13,1,7,4,5,5,6,5,9,8,8,5,8,5]
["2020-04-01",{"$f":"VLOOKUP(J512,'Control Panel'!$G$132:$K$171,5,FALSE)","v":"WF-6"},"WF",null,null,null,null,null,null,"F86607",null,14097,43,38,38,38,34,13,54,50,46,46,45,44,47,42,43,43,43,42]
["2020-04-01",{"$f":"VLOOKUP(J513,'Control Panel'!$G$132:$K$171,5,FALSE)","v":"WF-2"},"WF",null,null,null,null,null,null,"F86616",null,7274,49,44,44,44,44,7,20,16,17,17,17,16,40,33,34,30,32,32]
["2020-04-01",{"$f":"VLOOKUP(J514,'Control Panel'!$G$132:$K$171,5,FALSE)","v":"WF-5"},"WF",null,null,null,null,null,null,"F86621",null,5946,21,20,20,20,19,12,19,19,19,19,19,19,12,11,12,12,12,12]
["2020-04-01",{"$f":"VLOOKUP(J515,'Control Panel'!$G$132:$K$171,5,FALSE)","v":"WF-5"},"WF",null,null,null,null,null,null,"F86625",null,6139,20,15,14,15,12,3,16,13,13,13,13,13,10,9,10,8,10,8]
["2020-04-01",{"$f":"VLOOKUP(J516,'Control Panel'!$G$132:$K$171,5,FALSE)","v":"WF-1"},"WF",null,null,null,null,null,null,"F86626",null,6021,19,16,17,17,18,9,16,15,11,11,11,11,24,21,20,14,20,15]
["2020-04-01",{"$f":"VLOOKUP(J517,'Control Panel'!$G$132:$K$171,5,FALSE)","v":"WF-2"},"WF",null,null,null,null,null,null,"F86627",null,13556,38,32,33,33,30,5,35,32,31,32,32,31,40,39,36,28,34,28]
["2020-04-01",{"$f":"VLOOKUP(J518,'Control Panel'!$G$132:$K$171,5,FALSE)","v":"WF-6"},"WF",null,null,null,null,null,null,"F86644",null,10401,37,33,33,33,33,7,29,22,20,21,21,21,31,27,28,21,28,26]
["2020-04-01",{"$f":"VLOOKUP(J519,'Control Panel'!$G$132:$K$171,5,FALSE)","v":"WF-4"},"WF",null,null,null,null,null,null,"F86650",null,8194,30,24,25,26,22,16,31,26,22,21,22,21,25,23,21,17,19,17]
["2020-04-01",{"$f":"VLOOKUP(J520,'Control Panel'!$G$132:$K$171,5,FALSE)","v":"WF-1"},"WF",null,null,null,null,null,null,"F86664",null,8414,27,24,24,24,25,3,25,21,20,20,20,20,40,40,37,37,35,37]
["2020-04-01",{"$f":"VLOOKUP(J521,'Control Panel'!$G$132:$K$171,5,FALSE)","v":"WF-5"},"WF",null,null,null,null,null,null,"F86666",null,14788,55,51,49,50,47,28,45,41,39,38,39,40,51,48,45,40,43,43]
["2020-04-01",{"$f":"VLOOKUP(J522,'Control Panel'!$G$132:$K$171,5,FALSE)","v":"WF-7"},"WF",null,null,null,null,null,null,"F86679",null,6103,40,39,39,39,38,16,28,27,26,26,26,26,20,18,19,18,19,18]
["2020-04-01",{"$f":"VLOOKUP(J523,'Control Panel'!$G$132:$K$171,5,FALSE)","v":"WF-1"},"WF",null,null,null,null,null,null,"F86689",null,4295,29,26,25,26,24,10,37,34,33,32,33,33,27,26,25,25,25,24]
["2020-04-01",{"$f":"VLOOKUP(J524,'Control Panel'!$G$132:$K$171,5,FALSE)","v":"WF-4"},"WF",null,null,null,null,null,null,"F86696",null,6099,21,19,19,19,17,4,13,11,10,10,10,10,20,16,16,13,16,13]
["2020-04-01",{"$f":"VLOOKUP(J525,'Control Panel'!$G$132:$K$171,5,FALSE)","v":"WF-1"},"WF",null,null,null,null,null,null,"F86700",null,3908,13,10,9,10,10,7,11,11,11,11,10,11,10,10,8,7,9,7]
["2020-04-01",{"$f":"VLOOKUP(J526,'Control Panel'!$G$132:$K$171,5,FALSE)","v":"WF-5"},"WF",null,null,null,null,null,null,"F86701",null,3529,6,5,5,5,5,3,10,10,9,9,9,9,7,6,6,5,6,5]
["2020-04-01",{"$f":"VLOOKUP(J527,'Control Panel'!$G$132:$K$171,5,FALSE)","v":"WF-5"},"WF",null,null,null,null,null,null,"F86705",null,3376,6,5,5,5,6,5,17,15,15,15,14,14,12,12,12,10,12,10]
["2020-04-01",{"$f":"VLOOKUP(J528,'Control Panel'!$G$132:$K$171,5,FALSE)","v":"WF-6"},"WF",null,null,null,null,null,null,"F86708",null,2823,5,4,4,4,3,3,9,9,8,8,8,8,13,13,12,10,12,10]
["2020-04-01",{"$f":"VLOOKUP(J529,'Control Panel'!$G$132:$K$171,5,FALSE)","v":"WF-4"},"WF",null,null,null,null,null,null,"F86712",null,3329,8,7,7,7,7,4,5,4,4,4,4,4,6,5,6,5,5,5]
["2020-04-01",{"$f":"VLOOKUP(J530,'Control Panel'!$G$132:$K$171,5,FALSE)","v":"WF-2"},"WF",null,null,null,null,null,null,"Y01291",null,8851,32,31,30,31,29,24,26,20,20,20,20,18,31,27,27,19,27,20]
["2020-04-01",{"$f":"VLOOKUP(J531,'Control Panel'!$G$132:$K$171,5,FALSE)","v":"WF-1"},"WF",null,null,null,null,null,null,"Y01839",null,6443,23,23,23,23,22,6,28,23,20,20,21,20,15,7,12,8,12,7]
["2020-04-01",{"$f":"VLOOKUP(J532,'Control Panel'!$G$132:$K$171,5,FALSE)","v":{"$error":"#N/A"}},null,null,null,null,null,null,null,"total",null,266304,941,847,840,854,822,314,922,803,752,753,756,751,841,745,733,593,710,623]
["2020-05-01",{"$f":"VLOOKUP(J533,'Control Panel'!$G$132:$K$171,5,FALSE)","v":{"$error":"#N/A"}},"Childhood Immunisations Q1",null,"Last Run:",null,"Population Count",279936,null,null,"Search","All Patients","(01) 12 MONTH COHORT","(01.01) DTaP/IPV/Hib 6in1","(01.02) Men B (1st and 2nd)","(01.03) PCV","(01.04) Rotavirus","(01.05) BCG","(02) 24 MONTH COHORT","(02.01) DTaP/IPV/Hib Combined","(02.02) MMR","(02.03) HiB/Men C","(02.04) PCV (Booster)","(02.05) Men B (Booster)","(03) 5 YEAR COHORT","(03.01) DTaP/IPV/Hib Combined","(03.02) MMR (Primary)","(03.03) DTaP/IPV (Booster)","(03.04) HiB/Men C","(03.05) MMR (Booster)"]
["2020-05-01",{"$f":"VLOOKUP(J534,'Control Panel'!$G$132:$K$171,5,FALSE)","v":{"$error":"#N/A"}},null,null,"2020-06-02T09:49:00",null,"Males",142809,null,"Organisation Code"]
["2020-05-01",{"$f":"VLOOKUP(J535,'Control Panel'!$G$132:$K$171,5,FALSE)","v":"WF-6"},"WF",null,"Relative Date:",null,"Females",137127,null,"F86001",null,7967,20,16,15,16,17,8,23,22,19,18,18,19,36,32,31,25,31,27]
["2020-05-01",{"$f":"VLOOKUP(J536,'Control Panel'!$G$132:$K$171,5,FALSE)","v":"WF-1"},"WF",null,"2020-06-01",null,null,null,null,"F86005",null,8785,38,37,37,37,37,6,56,52,46,46,46,44,24,23,23,18,23,18]
["2020-05-01",{"$f":"VLOOKUP(J537,'Control Panel'!$G$132:$K$171,5,FALSE)","v":"WF-7"},"WF",null,null,null,null,null,null,"F86006",null,6431,23,21,22,23,21,3,25,21,22,22,23,22,17,16,16,13,14,15]
["2020-05-01",{"$f":"VLOOKUP(J538,'Control Panel'!$G$132:$K$171,5,FALSE)","v":"WF-3"},"WF",null,null,null,null,null,null,"F86011",null,9844,25,21,21,21,21,6,27,23,19,19,20,21,27,22,21,15,21,17]
["2020-05-01",{"$f":"VLOOKUP(J539,'Control Panel'!$G$132:$K$171,5,FALSE)","v":"WF-7"},"WF",null,null,null,null,null,null,"F86030",null,8331,35,34,34,34,34,13,41,36,34,34,35,34,23,20,20,13,16,16]
["2020-05-01",{"$f":"VLOOKUP(J540,'Control Panel'!$G$132:$K$171,5,FALSE)","v":"WF-4"},"WF",null,null,null,null,null,null,"F86036",null,15799,43,40,39,41,40,28,44,43,39,41,39,40,45,40,40,35,40,35]
["2020-05-01",{"$f":"VLOOKUP(J541,'Control Panel'!$G$132:$K$171,5,FALSE)","v":"WF-3"},"WF",null,null,null,null,null,null,"F86038",null,12635,45,41,40,41,39,7,53,41,40,39,40,39,44,35,34,25,33,28]
["2020-05-01",{"$f":"VLOOKUP(J542,'Control Panel'!$G$132:$K$171,5,FALSE)","v":"WF-4"},"WF",null,null,null,null,null,null,"F86044",null,9649,55,52,51,52,52,12,32,23,23,24,23,24,28,22,20,15,21,16]
["2020-05-01",{"$f":"VLOOKUP(J543,'Control Panel'!$G$132:$K$171,5,FALSE)","v":"WF-5"},"WF",null,null,null,null,null,null,"F86045",null,1993,5,4,4,5,4,5,4,4,4,4,4,4,1,1,1,1,1,1]
["2020-05-01",{"$f":"VLOOKUP(J544,'Control Panel'!$G$132:$K$171,5,FALSE)","v":"WF-7"},"WF",null,null,null,null,null,null,"F86058",null,15562,49,44,44,44,44,22,66,54,50,50,50,50,56,53,49,31,50,34]
["2020-05-01",{"$f":"VLOOKUP(J545,'Control Panel'!$G$132:$K$171,5,FALSE)","v":"WF-7"},"WF",null,null,null,null,null,null,"F86062",null,7294,26,25,25,25,25,8,29,24,21,20,21,22,16,14,14,8,5,8]
["2020-05-01",{"$f":"VLOOKUP(J546,'Control Panel'!$G$132:$K$171,5,FALSE)","v":"WF-2"},"WF",null,null,null,null,null,null,"F86078",null,7136,10,8,8,8,8,4,17,15,14,15,14,14,15,12,12,10,12,11]
["2020-05-01",{"$f":"VLOOKUP(J547,'Control Panel'!$G$132:$K$171,5,FALSE)","v":"WF-6"},"WF",null,null,null,null,null,null,"F86086",null,6406,28,25,25,26,23,7,22,21,21,22,22,22,19,17,16,8,16,12]
["2020-05-01",{"$f":"VLOOKUP(J548,'Control Panel'!$G$132:$K$171,5,FALSE)","v":"WF-4"},"WF",null,null,null,null,null,null,"F86088",null,4846,15,13,12,13,13,2,7,5,6,6,6,6,9,8,8,5,8,5]
["2020-05-01",{"$f":"VLOOKUP(J549,'Control Panel'!$G$132:$K$171,5,FALSE)","v":"WF-6"},"WF",null,null,null,null,null,null,"F86607",null,14101,43,38,38,38,34,13,54,50,47,47,46,45,47,42,43,43,43,42]
["2020-05-01",{"$f":"VLOOKUP(J550,'Control Panel'!$G$132:$K$171,5,FALSE)","v":"WF-2"},"WF",null,null,null,null,null,null,"F86616",null,7277,48,43,43,43,43,7,20,16,18,18,18,17,40,33,34,30,32,32]
["2020-05-01",{"$f":"VLOOKUP(J551,'Control Panel'!$G$132:$K$171,5,FALSE)","v":"WF-5"},"WF",null,null,null,null,null,null,"F86621",null,5950,21,20,20,20,19,12,19,19,19,19,19,19,13,11,13,12,12,12]
["2020-05-01",{"$f":"VLOOKUP(J552,'Control Panel'!$G$132:$K$171,5,FALSE)","v":"WF-5"},"WF",null,null,null,null,null,null,"F86625",null,6146,20,15,14,15,12,3,16,13,13,13,13,13,10,9,10,8,10,8]
["2020-05-01",{"$f":"VLOOKUP(J553,'Control Panel'!$G$132:$K$171,5,FALSE)","v":"WF-1"},"WF",null,null,null,null,null,null,"F86626",null,6045,19,16,17,17,18,9,16,15,11,11,11,11,24,22,20,14,20,15]
["2020-05-01",{"$f":"VLOOKUP(J554,'Control Panel'!$G$132:$K$171,5,FALSE)","v":"WF-2"},"WF",null,null,null,null,null,null,"F86627",null,13566,39,33,34,34,31,5,35,32,31,32,32,31,40,39,36,28,34,28]
["2020-05-01",{"$f":"VLOOKUP(J555,'Control Panel'!$G$132:$K$171,5,FALSE)","v":"WF-6"},"WF",null,null,null,null,null,null,"F86644",null,10277,37,33,33,33,33,7,27,20,19,20,20,20,30,26,27,20,27,25]
["2020-05-01",{"$f":"VLOOKUP(J556,'Control Panel'!$G$132:$K$171,5,FALSE)","v":"WF-4"},"WF",null,null,null,null,null,null,"F86650",null,8217,30,24,25,26,22,16,31,26,22,21,22,21,25,23,21,17,19,17]
["2020-05-01",{"$f":"VLOOKUP(J557,'Control Panel'!$G$132:$K$171,5,FALSE)","v":"WF-1"},"WF",null,null,null,null,null,null,"F86664",null,8432,27,24,24,24,25,3,25,21,20,20,20,20,40,40,37,37,35,37]
["2020-05-01",{"$f":"VLOOKUP(J558,'Control Panel'!$G$132:$K$171,5,FALSE)","v":"WF-5"},"WF",null,null,null,null,null,null,"F86666",null,14793,55,51,49,51,47,28,45,41,39,38,39,40,51,48,45,40,43,43]
["2020-05-01",{"$f":"VLOOKUP(J559,'Control Panel'!$G$132:$K$171,5,FALSE)","v":"WF-7"},"WF",null,null,null,null,null,null,"F86679",null,6084,41,39,39,39,38,16,28,27,26,26,26,26,20,18,19,18,19,18]
["2020-05-01",{"$f":"VLOOKUP(J560,'Control Panel'!$G$132:$K$171,5,FALSE)","v":"WF-1"},"WF",null,null,null,null,null,null,"F86689",null,4305,29,26,25,26,24,10,36,34,33,32,33,33,27,26,25,25,25,24]
["2020-05-01",{"$f":"VLOOKUP(J561,'Control Panel'!$G$132:$K$171,5,FALSE)","v":"WF-4"},"WF",null,null,null,null,null,null,"F86696",null,6105,21,19,19,19,17,4,13,11,11,11,11,11,20,16,16,13,16,13]
["2020-05-01",{"$f":"VLOOKUP(J562,'Control Panel'!$G$132:$K$171,5,FALSE)","v":"WF-1"},"WF",null,null,null,null,null,null,"F86700",null,3926,13,10,9,10,10,7,11,11,11,11,10,11,10,10,8,7,9,7]
["2020-05-01",{"$f":"VLOOKUP(J563,'Control Panel'!$G$132:$K$171,5,FALSE)","v":"WF-5"},"WF",null,null,null,null,null,null,"F86701",null,3543,6,5,5,5,5,3,9,9,8,8,8,8,9,6,6,5,6,5]
["2020-05-01",{"$f":"VLOOKUP(J564,'Control Panel'!$G$132:$K$171,5,FALSE)","v":"WF-5"},"WF",null,null,null,null,null,null,"F86705",null,3390,6,5,5,5,6,5,17,15,15,15,14,14,12,12,12,10,12,10]
["2020-05-01",{"$f":"VLOOKUP(J565,'Control Panel'!$G$132:$K$171,5,FALSE)","v":"WF-6"},"WF",null,null,null,null,null,null,"F86708",null,2818,5,4,4,4,3,3,9,9,8,8,8,8,13,13,12,10,12,10]
["2020-05-01",{"$f":"VLOOKUP(J566,'Control Panel'!$G$132:$K$171,5,FALSE)","v":"WF-4"},"WF",null,null,null,null,null,null,"F86712",null,3334,8,7,7,7,7,4,5,4,4,4,4,4,6,5,6,5,5,5]
["2020-05-01",{"$f":"VLOOKUP(J567,'Control Panel'!$G$132:$K$171,5,FALSE)","v":"WF-2"},"WF",null,null,null,null,null,null,"Y01291",null,8897,32,31,30,31,29,24,26,20,20,20,20,18,30,26,26,22,26,23]
["2020-05-01",{"$f":"VLOOKUP(J568,'Control Panel'!$G$132:$K$171,5,FALSE)","v":"WF-1"},"WF",null,null,null,null,null,null,"Y01839",null,6452,23,23,23,23,22,6,28,23,20,20,21,20,15,7,12,8,12,7]
["2020-05-01",{"$f":"VLOOKUP(J569,'Control Panel'!$G$132:$K$171,5,FALSE)","v":{"$error":"#N/A"}},null,null,null,null,null,null,null,"total",null,266336,940,847,840,856,823,316,916,800,753,754,756,751,842,747,733,594,708,624]
["2020-06-01",{"$f":"VLOOKUP(J570,'Control Panel'!$G$132:$K$171,5,FALSE)","v":{"$error":"#N/A"}},"Childhood Immunisations Q1",null,"Last Run:",null,"Population Count",279987,null,null,"Search","All Patients","(01) 12 MONTH COHORT","(01.01) DTaP/IPV/Hib 6in1","(01.02) Men B (1st and 2nd)","(01.03) PCV","(01.04) Rotavirus","(01.05) BCG","(02) 24 MONTH COHORT","(02.01) DTaP/IPV/Hib Combined","(02.02) MMR","(02.03) HiB/Men C","(02.04) PCV (Booster)","(02.05) Men B (Booster)","(03) 5 YEAR COHORT","(03.01) DTaP/IPV/Hib Combined","(03.02) MMR (Primary)","(03.03) DTaP/IPV (Booster)","(03.04) HiB/Men C","(03.05) MMR (Booster)"]
["2020-06-01",{"$f":"VLOOKUP(J571,'Control Panel'!$G$132:$K$171,5,FALSE)","v":{"$error":"#N/A"}},null,null,"2020-07-02T12:06:00",null,"Males",142924,null,"Organisation Code"]
["2020-06-01",{"$f":"VLOOKUP(J572,'Control Panel'!$G$132:$K$171,5,FALSE)","v":"WF-6"},"WF",null,"Relative Date:",null,"Females",137063,null,"F86001",null,7968,20,16,15,16,17,8,23,22,19,18,18,19,36,32,31,25,31,27]
["2020-06-01",{"$f":"VLOOKUP(J573,'Control Panel'!$G$132:$K$171,5,FALSE)","v":"WF-1"},"WF",null,"2020-07-01",null,null,null,null,"F86005",null,8811,38,37,37,37,37,6,57,53,47,47,47,45,24,23,24,18,23,19]
["2020-06-01",{"$f":"VLOOKUP(J574,'Control Panel'!$G$132:$K$171,5,FALSE)","v":"WF-7"},"WF",null,null,null,null,null,null,"F86006",null,6437,23,21,22,23,21,3,25,21,22,22,23,22,18,17,17,14,14,16]
["2020-06-01",{"$f":"VLOOKUP(J575,'Control Panel'!$G$132:$K$171,5,FALSE)","v":"WF-3"},"WF",null,null,null,null,null,null,"F86011",null,9853,26,21,21,22,22,6,27,23,19,19,20,21,27,22,21,15,21,17]
["2020-06-01",{"$f":"VLOOKUP(J576,'Control Panel'!$G$132:$K$171,5,FALSE)","v":"WF-7"},"WF",null,null,null,null,null,null,"F86030",null,8317,35,34,34,34,34,13,40,35,33,33,34,33,22,19,19,12,16,15]
["2020-06-01",{"$f":"VLOOKUP(J577,'Control Panel'!$G$132:$K$171,5,FALSE)","v":"WF-4"},"WF",null,null,null,null,null,null,"F86036",null,15783,43,40,39,41,40,28,45,44,40,42,40,41,44,40,40,35,40,35]
["2020-06-01",{"$f":"VLOOKUP(J578,'Control Panel'!$G$132:$K$171,5,FALSE)","v":"WF-3"},"WF",null,null,null,null,null,null,"F86038",null,12584,45,41,40,41,39,7,53,41,40,39,40,39,44,35,34,25,33,28]
["2020-06-01",{"$f":"VLOOKUP(J579,'Control Panel'!$G$132:$K$171,5,FALSE)","v":"WF-4"},"WF",null,null,null,null,null,null,"F86044",null,9688,55,52,51,52,52,12,32,23,23,24,23,24,28,22,20,15,21,16]
["2020-06-01",{"$f":"VLOOKUP(J580,'Control Panel'!$G$132:$K$171,5,FALSE)","v":"WF-5"},"WF",null,null,null,null,null,null,"F86045",null,1996,5,4,4,5,4,5,4,4,4,4,4,4,1,1,1,1,1,1]
["2020-06-01",{"$f":"VLOOKUP(J581,'Control Panel'!$G$132:$K$171,5,FALSE)","v":"WF-7"},"WF",null,null,null,null,null,null,"F86058",null,15571,52,45,45,46,45,23,65,53,49,49,49,49,56,53,49,31,50,34]
["2020-06-01",{"$f":"VLOOKUP(J582,'Control Panel'!$G$132:$K$171,5,FALSE)","v":"WF-7"},"WF",null,null,null,null,null,null,"F86062",null,7290,26,25,25,25,25,8,29,24,21,20,21,22,16,14,14,8,5,8]
["2020-06-01",{"$f":"VLOOKUP(J583,'Control Panel'!$G$132:$K$171,5,FALSE)","v":"WF-2"},"WF",null,null,null,null,null,null,"F86078",null,7119,10,8,8,8,8,4,17,15,14,15,14,14,15,12,12,10,12,11]
["2020-06-01",{"$f":"VLOOKUP(J584,'Control Panel'!$G$132:$K$171,5,FALSE)","v":"WF-6"},"WF",null,null,null,null,null,null,"F86086",null,6340,28,25,25,26,23,7,22,21,21,22,22,22,19,17,16,8,16,12]
["2020-06-01",{"$f":"VLOOKUP(J585,'Control Panel'!$G$132:$K$171,5,FALSE)","v":"WF-4"},"WF",null,null,null,null,null,null,"F86088",null,4840,15,13,12,13,13,2,8,6,7,7,7,7,9,8,8,5,8,5]
["2020-06-01",{"$f":"VLOOKUP(J586,'Control Panel'!$G$132:$K$171,5,FALSE)","v":"WF-6"},"WF",null,null,null,null,null,null,"F86607",null,14019,43,38,38,38,34,13,55,50,47,47,47,46,47,42,43,43,43,42]
["2020-06-01",{"$f":"VLOOKUP(J587,'Control Panel'!$G$132:$K$171,5,FALSE)","v":"WF-2"},"WF",null,null,null,null,null,null,"F86616",null,7314,48,43,43,43,43,7,20,16,18,18,18,17,40,33,34,30,32,32]
["2020-06-01",{"$f":"VLOOKUP(J588,'Control Panel'!$G$132:$K$171,5,FALSE)","v":"WF-5"},"WF",null,null,null,null,null,null,"F86621",null,5936,21,20,20,20,19,12,19,19,19,19,19,19,13,11,13,12,12,12]
["2020-06-01",{"$f":"VLOOKUP(J589,'Control Panel'!$G$132:$K$171,5,FALSE)","v":"WF-5"},"WF",null,null,null,null,null,null,"F86625",null,6151,20,15,14,15,12,4,16,13,13,13,13,13,10,9,10,8,10,8]
["2020-06-01",{"$f":"VLOOKUP(J590,'Control Panel'!$G$132:$K$171,5,FALSE)","v":"WF-1"},"WF",null,null,null,null,null,null,"F86626",null,6084,19,16,17,17,18,9,16,15,11,11,11,11,24,22,20,15,20,16]
["2020-06-01",{"$f":"VLOOKUP(J591,'Control Panel'!$G$132:$K$171,5,FALSE)","v":"WF-2"},"WF",null,null,null,null,null,null,"F86627",null,13563,39,33,34,34,31,5,36,33,32,33,33,32,40,39,36,28,34,28]
["2020-06-01",{"$f":"VLOOKUP(J592,'Control Panel'!$G$132:$K$171,5,FALSE)","v":"WF-6"},"WF",null,null,null,null,null,null,"F86644",null,10322,37,33,33,33,33,7,27,20,19,20,20,20,30,26,27,20,27,25]
["2020-06-01",{"$f":"VLOOKUP(J593,'Control Panel'!$G$132:$K$171,5,FALSE)","v":"WF-4"},"WF",null,null,null,null,null,null,"F86650",null,8175,30,24,25,26,22,16,30,25,22,21,22,21,24,22,20,16,18,16]
["2020-06-01",{"$f":"VLOOKUP(J594,'Control Panel'!$G$132:$K$171,5,FALSE)","v":"WF-1"},"WF",null,null,null,null,null,null,"F86664",null,8449,28,25,25,25,25,3,25,21,20,20,20,20,40,40,37,37,35,37]
["2020-06-01",{"$f":"VLOOKUP(J595,'Control Panel'!$G$132:$K$171,5,FALSE)","v":"WF-5"},"WF",null,null,null,null,null,null,"F86666",null,14835,55,51,49,51,47,28,44,40,38,37,38,39,51,48,45,40,43,43]
["2020-06-01",{"$f":"VLOOKUP(J596,'Control Panel'!$G$132:$K$171,5,FALSE)","v":"WF-7"},"WF",null,null,null,null,null,null,"F86679",null,6081,40,38,38,38,37,16,28,27,26,26,26,26,20,18,19,18,19,18]
["2020-06-01",{"$f":"VLOOKUP(J597,'Control Panel'!$G$132:$K$171,5,FALSE)","v":"WF-1"},"WF",null,null,null,null,null,null,"F86689",null,4328,29,26,25,26,24,10,36,34,34,33,33,33,27,26,25,25,25,24]
["2020-06-01",{"$f":"VLOOKUP(J598,'Control Panel'!$G$132:$K$171,5,FALSE)","v":"WF-4"},"WF",null,null,null,null,null,null,"F86696",null,6116,21,19,19,19,17,4,14,13,13,12,13,12,20,17,16,13,16,14]
["2020-06-01",{"$f":"VLOOKUP(J599,'Control Panel'!$G$132:$K$171,5,FALSE)","v":"WF-1"},"WF",null,null,null,null,null,null,"F86700",null,3929,13,10,9,10,10,7,11,11,11,11,10,11,10,10,8,7,9,7]
["2020-06-01",{"$f":"VLOOKUP(J600,'Control Panel'!$G$132:$K$171,5,FALSE)","v":"WF-5"},"WF",null,null,null,null,null,null,"F86701",null,3544,6,5,5,5,5,3,9,9,8,8,8,8,9,6,6,5,6,5]
["2020-06-01",{"$f":"VLOOKUP(J601,'Control Panel'!$G$132:$K$171,5,FALSE)","v":"WF-5"},"WF",null,null,null,null,null,null,"F86705",null,3400,6,5,5,5,6,5,18,16,15,15,14,14,12,12,12,10,12,10]
["2020-06-01",{"$f":"VLOOKUP(J602,'Control Panel'!$G$132:$K$171,5,FALSE)","v":"WF-6"},"WF",null,null,null,null,null,null,"F86708",null,2813,5,4,4,4,3,3,9,9,8,8,8,8,13,13,12,10,12,10]
["2020-06-01",{"$f":"VLOOKUP(J603,'Control Panel'!$G$132:$K$171,5,FALSE)","v":"WF-4"},"WF",null,null,null,null,null,null,"F86712",null,3339,8,7,7,7,7,4,5,4,4,4,4,4,6,5,6,5,5,5]
["2020-06-01",{"$f":"VLOOKUP(J604,'Control Panel'!$G$132:$K$171,5,FALSE)","v":"WF-2"},"WF",null,null,null,null,null,null,"Y01291",null,8902,32,31,30,31,29,25,27,21,21,21,21,19,30,26,26,22,26,23]
["2020-06-01",{"$f":"VLOOKUP(J605,'Control Panel'!$G$132:$K$171,5,FALSE)","v":"WF-1"},"WF",null,null,null,null,null,null,"Y01839",null,6449,22,22,22,22,21,6,28,23,22,22,23,22,15,7,12,8,12,7]
["2020-06-01",{"$f":"VLOOKUP(J606,'Control Panel'!$G$132:$K$171,5,FALSE)","v":{"$error":"#N/A"}},null,null,null,null,null,null,null,"total",null,266346,943,847,840,858,823,319,920,804,760,760,763,757,840,747,733,594,707,626]
["2020-07-01",{"$f":"VLOOKUP(J607,'Control Panel'!$G$132:$K$171,5,FALSE)","v":{"$error":"#N/A"}},"Childhood Immunisations Q2",null,"Last Run:",null,"Population Count",280611,null,null,"Search","All Patients","(01) 12 MONTH COHORT","(01.01) DTaP/IPV/Hib 6in1","(01.02) Men B (1st and 2nd)","(01.03) PCV","(01.04) Rotavirus","(01.05) BCG","(02) 24 MONTH COHORT","(02.01) DTaP/IPV/Hib Combined","(02.02) MMR","(02.03) HiB/Men C","(02.04) PCV (Booster)","(02.05) Men B (Booster)","(03) 5 YEAR COHORT","(03.01) DTaP/IPV/Hib Combined","(03.02) MMR (Primary)","(03.03) DTaP/IPV (Booster)","(03.04) HiB/Men C","(03.05) MMR (Booster)"]
["2020-07-01",{"$f":"VLOOKUP(J608,'Control Panel'!$G$132:$K$171,5,FALSE)","v":{"$error":"#N/A"}},null,null,"2020-08-03T10:41:00",null,"Males",143691,null,"Organisation Code"]
["2020-07-01",{"$f":"VLOOKUP(J609,'Control Panel'!$G$132:$K$171,5,FALSE)","v":"WF-6"},"WF",null,"Relative Date:",null,"Females",136920,null,"F86001",null,7962,31,25,25,25,26,11,29,27,25,25,25,26,24,21,22,12,21,15]
["2020-07-01",{"$f":"VLOOKUP(J610,'Control Panel'!$G$132:$K$171,5,FALSE)","v":"WF-1"},"WF",null,"2020-08-01",null,null,null,null,"F86005",null,8868,42,37,36,39,36,5,48,40,40,41,40,40,41,36,36,31,36,32]
["2020-07-01",{"$f":"VLOOKUP(J611,'Control Panel'!$G$132:$K$171,5,FALSE)","v":"WF-7"},"WF",null,null,null,null,null,null,"F86006",null,6468,13,11,11,11,11,2,14,13,11,10,10,10,21,20,21,16,20,17]
["2020-07-01",{"$f":"VLOOKUP(J612,'Control Panel'!$G$132:$K$171,5,FALSE)","v":"WF-3"},"WF",null,null,null,null,null,null,"F86011",null,9859,24,22,21,22,23,13,15,14,15,15,15,14,33,28,26,17,27,20]
["2020-07-01",{"$f":"VLOOKUP(J613,'Control Panel'!$G$132:$K$171,5,FALSE)","v":"WF-7"},"WF",null,null,null,null,null,null,"F86030",null,8331,36,29,31,31,27,14,20,20,18,18,18,18,24,23,21,15,22,19]
["2020-07-01",{"$f":"VLOOKUP(J614,'Control Panel'!$G$132:$K$171,5,FALSE)","v":"WF-4"},"WF",null,null,null,null,null,null,"F86036",null,15799,73,68,67,68,64,27,67,62,59,57,58,59,64,61,58,53,60,51]
["2020-07-01",{"$f":"VLOOKUP(J615,'Control Panel'!$G$132:$K$171,5,FALSE)","v":"WF-3"},"WF",null,null,null,null,null,null,"F86038",null,12582,31,24,24,25,25,2,55,52,50,50,50,50,54,50,50,39,48,40]
["2020-07-01",{"$f":"VLOOKUP(J616,'Control Panel'!$G$132:$K$171,5,FALSE)","v":"WF-4"},"WF",null,null,null,null,null,null,"F86044",null,9749,48,45,45,46,45,11,44,34,32,33,33,33,33,29,28,20,28,20]
["2020-07-01",{"$f":"VLOOKUP(J617,'Control Panel'!$G$132:$K$171,5,FALSE)","v":"WF-5"},"WF",null,null,null,null,null,null,"F86045",null,1994,4,2,2,2,4,2,2,2,2,2,2,2,9,8,8,7,8,6]
["2020-07-01",{"$f":"VLOOKUP(J618,'Control Panel'!$G$132:$K$171,5,FALSE)","v":"WF-7"},"WF",null,null,null,null,null,null,"F86058",null,15587,64,54,54,55,58,24,65,55,49,50,49,50,46,42,41,33,41,35]
["2020-07-01",{"$f":"VLOOKUP(J619,'Control Panel'!$G$132:$K$171,5,FALSE)","v":"WF-7"},"WF",null,null,null,null,null,null,"F86062",null,7313,16,13,13,13,14,4,22,18,16,16,16,16,32,26,26,15,25,15]
["2020-07-01",{"$f":"VLOOKUP(J620,'Control Panel'!$G$132:$K$171,5,FALSE)","v":"WF-2"},"WF",null,null,null,null,null,null,"F86078",null,7107,12,11,11,11,11,2,19,17,14,16,16,15,9,9,9,8,9,8]
["2020-07-01",{"$f":"VLOOKUP(J621,'Control Panel'!$G$132:$K$171,5,FALSE)","v":"WF-6"},"WF",null,null,null,null,null,null,"F86086",null,6311,35,29,29,29,32,4,24,18,17,18,17,18,27,24,25,16,24,19]
["2020-07-01",{"$f":"VLOOKUP(J622,'Control Panel'!$G$132:$K$171,5,FALSE)","v":"WF-4"},"WF",null,null,null,null,null,null,"F86088",null,4832,10,9,9,9,9,3,12,11,8,8,8,9,9,8,8,5,8,5]
["2020-07-01",{"$f":"VLOOKUP(J623,'Control Panel'!$G$132:$K$171,5,FALSE)","v":"WF-6"},"WF",null,null,null,null,null,null,"F86607",null,13999,40,34,35,34,34,18,51,47,45,46,45,46,51,45,45,40,42,42]
["2020-07-01",{"$f":"VLOOKUP(J624,'Control Panel'!$G$132:$K$171,5,FALSE)","v":"WF-2"},"WF",null,null,null,null,null,null,"F86616",null,7364,44,40,40,41,40,5,29,25,25,26,26,26,32,27,28,18,27,22]
["2020-07-01",{"$f":"VLOOKUP(J625,'Control Panel'!$G$132:$K$171,5,FALSE)","v":"WF-5"},"WF",null,null,null,null,null,null,"F86621",null,5949,19,17,17,18,18,15,21,19,17,16,16,16,14,14,13,11,13,12]
["2020-07-01",{"$f":"VLOOKUP(J626,'Control Panel'!$G$132:$K$171,5,FALSE)","v":"WF-5"},"WF",null,null,null,null,null,null,"F86625",null,6141,14,11,12,12,11,1,15,9,8,7,7,7,16,14,13,12,14,11]
["2020-07-01",{"$f":"VLOOKUP(J627,'Control Panel'!$G$132:$K$171,5,FALSE)","v":"WF-1"},"WF",null,null,null,null,null,null,"F86626",null,6127,20,17,16,18,18,2,20,16,18,17,18,16,25,24,23,21,23,21]
["2020-07-01",{"$f":"VLOOKUP(J628,'Control Panel'!$G$132:$K$171,5,FALSE)","v":"WF-2"},"WF",null,null,null,null,null,null,"F86627",null,13552,24,20,20,20,19,6,36,34,29,30,30,31,32,32,30,28,31,27]
["2020-07-01",{"$f":"VLOOKUP(J629,'Control Panel'!$G$132:$K$171,5,FALSE)","v":"WF-6"},"WF",null,null,null,null,null,null,"F86644",null,10253,39,34,36,36,35,11,23,21,21,21,21,21,29,26,23,23,26,23]
["2020-07-01",{"$f":"VLOOKUP(J630,'Control Panel'!$G$132:$K$171,5,FALSE)","v":"WF-4"},"WF",null,null,null,null,null,null,"F86650",null,8143,24,21,21,21,19,5,34,33,29,29,30,30,30,26,25,15,25,15]
["2020-07-01",{"$f":"VLOOKUP(J631,'Control Panel'!$G$132:$K$171,5,FALSE)","v":"WF-1"},"WF",null,null,null,null,null,null,"F86664",null,8449,32,30,30,30,30,7,34,31,29,30,30,30,33,32,31,28,32,28]
["2020-07-01",{"$f":"VLOOKUP(J632,'Control Panel'!$G$132:$K$171,5,FALSE)","v":"WF-5"},"WF",null,null,null,null,null,null,"F86666",null,14862,49,44,43,45,43,23,47,41,42,41,42,41,39,31,32,30,31,29]
["2020-07-01",{"$f":"VLOOKUP(J633,'Control Panel'!$G$132:$K$171,5,FALSE)","v":"WF-7"},"WF",null,null,null,null,null,null,"F86679",null,6094,28,27,27,27,25,11,31,29,29,29,28,28,30,29,28,24,28,25]
["2020-07-01",{"$f":"VLOOKUP(J634,'Control Panel'!$G$132:$K$171,5,FALSE)","v":"WF-1"},"WF",null,null,null,null,null,null,"F86689",null,4339,23,21,21,21,21,12,33,32,32,31,31,31,25,24,25,22,24,24]
["2020-07-01",{"$f":"VLOOKUP(J635,'Control Panel'!$G$132:$K$171,5,FALSE)","v":"WF-4"},"WF",null,null,null,null,null,null,"F86696",null,6121,30,28,28,27,27,4,16,15,15,15,15,15,18,18,18,9,17,10]
["2020-07-01",{"$f":"VLOOKUP(J636,'Control Panel'!$G$132:$K$171,5,FALSE)","v":"WF-1"},"WF",null,null,null,null,null,null,"F86700",null,3948,11,10,10,10,10,3,11,8,8,8,8,8,14,12,12,13,12,13]
["2020-07-01",{"$f":"VLOOKUP(J637,'Control Panel'!$G$132:$K$171,5,FALSE)","v":"WF-5"},"WF",null,null,null,null,null,null,"F86701",null,3560,16,12,12,12,13,4,15,14,13,13,13,13,10,9,9,7,9,7]
["2020-07-01",{"$f":"VLOOKUP(J638,'Control Panel'!$G$132:$K$171,5,FALSE)","v":"WF-5"},"WF",null,null,null,null,null,null,"F86705",null,3416,7,7,7,7,7,6,10,10,9,10,9,10,9,9,9,9,8,9]
["2020-07-01",{"$f":"VLOOKUP(J639,'Control Panel'!$G$132:$K$171,5,FALSE)","v":"WF-6"},"WF",null,null,null,null,null,null,"F86708",null,2821,10,8,9,9,6,0,7,6,4,3,4,4,9,9,8,6,8,6]
["2020-07-01",{"$f":"VLOOKUP(J640,'Control Panel'!$G$132:$K$171,5,FALSE)","v":"WF-4"},"WF",null,null,null,null,null,null,"F86712",null,3331,5,5,5,5,5,2,18,16,16,16,16,16,7,4,5,5,5,5]
["2020-07-01",{"$f":"VLOOKUP(J641,'Control Panel'!$G$132:$K$171,5,FALSE)","v":"WF-2"},"WF",null,null,null,null,null,null,"Y01291",null,8917,24,22,22,22,19,14,30,29,28,28,29,27,26,25,25,23,25,24]
["2020-07-01",{"$f":"VLOOKUP(J642,'Control Panel'!$G$132:$K$171,5,FALSE)","v":"WF-1"},"WF",null,null,null,null,null,null,"Y01839",null,6452,12,9,9,9,8,6,25,24,22,22,22,22,27,24,24,20,24,21]
["2020-07-01",{"$f":"VLOOKUP(J643,'Control Panel'!$G$132:$K$171,5,FALSE)","v":{"$error":"#N/A"}},null,null,null,null,null,null,null,"total",null,266600,910,796,798,810,793,279,942,842,795,797,797,798,902,819,805,651,801,676]
["2020-08-01",{"$f":"VLOOKUP(J644,'Control Panel'!$G$132:$K$171,5,FALSE)","v":{"$error":"#N/A"}},"Childhood Immunisations Q2",null,"Last Run:",null,"Population Count",280568,null,null,"Search","All Patients","(01) 12 MONTH COHORT","(01.01) DTaP/IPV/Hib 6in1","(01.02) Men B (1st and 2nd)","(01.03) PCV","(01.04) Rotavirus","(01.05) BCG","(02) 24 MONTH COHORT","(02.01) DTaP/IPV/Hib Combined","(02.02) MMR","(02.03) HiB/Men C","(02.04) PCV (Booster)","(02.05) Men B (Booster)","(03) 5 YEAR COHORT","(03.01) DTaP/IPV/Hib Combined","(03.02) MMR (Primary)","(03.03) DTaP/IPV (Booster)","(03.04) HiB/Men C","(03.05) MMR (Booster)"]
["2020-08-01",{"$f":"VLOOKUP(J645,'Control Panel'!$G$132:$K$171,5,FALSE)","v":{"$error":"#N/A"}},null,null,"2020-09-03T10:47:00",null,"Males",143710,null,"Organisation Code"]
["2020-08-01",{"$f":"VLOOKUP(J646,'Control Panel'!$G$132:$K$171,5,FALSE)","v":"WF-6"},"WF",null,"Relative Date:",null,"Females",136858,null,"F86001",null,7947,31,25,25,25,26,12,28,26,24,24,24,25,24,21,22,12,21,15]
["2020-08-01",{"$f":"VLOOKUP(J647,'Control Panel'!$G$132:$K$171,5,FALSE)","v":"WF-1"},"WF",null,"2020-09-01",null,null,null,null,"F86005",null,8890,42,37,36,39,36,5,48,40,40,41,40,40,41,36,36,31,36,32]
["2020-08-01",{"$f":"VLOOKUP(J648,'Control Panel'!$G$132:$K$171,5,FALSE)","v":"WF-7"},"WF",null,null,null,null,null,null,"F86006",null,6472,13,10,10,10,10,1,13,13,11,10,10,10,21,20,21,16,20,17]
["2020-08-01",{"$f":"VLOOKUP(J649,'Control Panel'!$G$132:$K$171,5,FALSE)","v":"WF-3"},"WF",null,null,null,null,null,null,"F86011",null,9862,24,22,21,22,23,13,15,14,15,15,15,14,33,28,26,17,27,20]
["2020-08-01",{"$f":"VLOOKUP(J650,'Control Panel'!$G$132:$K$171,5,FALSE)","v":"WF-7"},"WF",null,null,null,null,null,null,"F86030",null,8305,36,29,31,31,27,14,20,20,18,18,18,18,24,23,21,15,22,19]
["2020-08-01",{"$f":"VLOOKUP(J651,'Control Panel'!$G$132:$K$171,5,FALSE)","v":"WF-4"},"WF",null,null,null,null,null,null,"F86036",null,15769,72,67,66,67,63,29,67,62,60,58,59,59,64,61,58,54,60,52]
["2020-08-01",{"$f":"VLOOKUP(J652,'Control Panel'!$G$132:$K$171,5,FALSE)","v":"WF-3"},"WF",null,null,null,null,null,null,"F86038",null,12560,30,23,23,24,24,2,55,52,50,50,50,50,53,49,49,38,47,39]
["2020-08-01",{"$f":"VLOOKUP(J653,'Control Panel'!$G$132:$K$171,5,FALSE)","v":"WF-4"},"WF",null,null,null,null,null,null,"F86044",null,9768,48,45,45,46,45,11,44,33,32,33,33,33,33,29,28,20,28,20]
["2020-08-01",{"$f":"VLOOKUP(J654,'Control Panel'!$G$132:$K$171,5,FALSE)","v":"WF-5"},"WF",null,null,null,null,null,null,"F86045",null,1999,4,2,2,2,4,2,2,2,2,2,2,2,9,8,8,7,8,6]
["2020-08-01",{"$f":"VLOOKUP(J655,'Control Panel'!$G$132:$K$171,5,FALSE)","v":"WF-7"},"WF",null,null,null,null,null,null,"F86058",null,15559,63,53,53,54,57,24,64,54,48,49,48,49,45,41,40,32,40,34]
["2020-08-01",{"$f":"VLOOKUP(J656,'Control Panel'!$G$132:$K$171,5,FALSE)","v":"WF-7"},"WF",null,null,null,null,null,null,"F86062",null,7331,17,14,14,14,15,4,21,18,15,15,15,15,32,26,26,15,25,15]
["2020-08-01",{"$f":"VLOOKUP(J657,'Control Panel'!$G$132:$K$171,5,FALSE)","v":"WF-2"},"WF",null,null,null,null,null,null,"F86078",null,7100,12,11,11,11,11,2,18,17,14,16,16,15,9,9,9,9,9,9]
["2020-08-01",{"$f":"VLOOKUP(J658,'Control Panel'!$G$132:$K$171,5,FALSE)","v":"WF-6"},"WF",null,null,null,null,null,null,"F86086",null,6313,35,29,29,29,32,4,24,18,17,18,17,18,28,25,26,17,25,20]
["2020-08-01",{"$f":"VLOOKUP(J659,'Control Panel'!$G$132:$K$171,5,FALSE)","v":"WF-4"},"WF",null,null,null,null,null,null,"F86088",null,4834,10,9,9,9,9,3,12,11,8,8,8,9,9,8,8,5,8,5]
["2020-08-01",{"$f":"VLOOKUP(J660,'Control Panel'!$G$132:$K$171,5,FALSE)","v":"WF-6"},"WF",null,null,null,null,null,null,"F86607",null,14021,40,34,35,34,34,18,50,46,44,45,44,45,51,45,45,40,42,42]
["2020-08-01",{"$f":"VLOOKUP(J661,'Control Panel'!$G$132:$K$171,5,FALSE)","v":"WF-2"},"WF",null,null,null,null,null,null,"F86616",null,7357,44,40,40,41,40,5,28,25,25,26,26,26,32,27,28,18,27,22]
["2020-08-01",{"$f":"VLOOKUP(J662,'Control Panel'!$G$132:$K$171,5,FALSE)","v":"WF-5"},"WF",null,null,null,null,null,null,"F86621",null,5942,18,16,16,17,17,14,21,19,17,16,16,16,14,14,13,11,13,12]
["2020-08-01",{"$f":"VLOOKUP(J663,'Control Panel'!$G$132:$K$171,5,FALSE)","v":"WF-5"},"WF",null,null,null,null,null,null,"F86625",null,6106,14,11,12,12,11,1,15,9,8,7,7,7,16,14,13,12,14,11]
["2020-08-01",{"$f":"VLOOKUP(J664,'Control Panel'!$G$132:$K$171,5,FALSE)","v":"WF-1"},"WF",null,null,null,null,null,null,"F86626",null,6192,20,17,16,18,18,2,21,20,21,19,20,20,25,24,23,21,23,21]
["2020-08-01",{"$f":"VLOOKUP(J665,'Control Panel'!$G$132:$K$171,5,FALSE)","v":"WF-2"},"WF",null,null,null,null,null,null,"F86627",null,13571,24,20,21,21,19,6,36,34,29,30,30,31,32,32,30,28,31,27]
["2020-08-01",{"$f":"VLOOKUP(J666,'Control Panel'!$G$132:$K$171,5,FALSE)","v":"WF-6"},"WF",null,null,null,null,null,null,"F86644",null,10207,39,34,36,36,35,11,22,20,20,20,20,20,28,25,22,22,25,22]
["2020-08-01",{"$f":"VLOOKUP(J667,'Control Panel'!$G$132:$K$171,5,FALSE)","v":"WF-4"},"WF",null,null,null,null,null,null,"F86650",null,8137,24,21,21,21,19,5,34,33,29,29,30,30,30,26,25,15,25,15]
["2020-08-01",{"$f":"VLOOKUP(J668,'Control Panel'!$G$132:$K$171,5,FALSE)","v":"WF-1"},"WF",null,null,null,null,null,null,"F86664",null,8456,32,30,30,30,30,7,34,31,29,30,30,30,33,32,31,28,32,28]
["2020-08-01",{"$f":"VLOOKUP(J669,'Control Panel'!$G$132:$K$171,5,FALSE)","v":"WF-5"},"WF",null,null,null,null,null,null,"F86666",null,14878,49,44,43,45,43,23,47,41,42,41,42,41,39,31,32,30,31,29]
["2020-08-01",{"$f":"VLOOKUP(J670,'Control Panel'!$G$132:$K$171,5,FALSE)","v":"WF-7"},"WF",null,null,null,null,null,null,"F86679",null,6089,28,27,27,27,25,11,31,29,29,29,28,29,30,29,28,24,28,25]
["2020-08-01",{"$f":"VLOOKUP(J671,'Control Panel'!$G$132:$K$171,5,FALSE)","v":"WF-1"},"WF",null,null,null,null,null,null,"F86689",null,4345,23,21,21,21,21,12,33,32,32,31,31,31,25,24,25,22,24,24]
["2020-08-01",{"$f":"VLOOKUP(J672,'Control Panel'!$G$132:$K$171,5,FALSE)","v":"WF-4"},"WF",null,null,null,null,null,null,"F86696",null,6162,30,28,28,27,27,4,16,15,15,15,15,15,17,17,17,11,16,12]
["2020-08-01",{"$f":"VLOOKUP(J673,'Control Panel'!$G$132:$K$171,5,FALSE)","v":"WF-1"},"WF",null,null,null,null,null,null,"F86700",null,3931,11,10,10,10,10,3,10,7,7,7,7,7,14,12,12,13,12,13]
["2020-08-01",{"$f":"VLOOKUP(J674,'Control Panel'!$G$132:$K$171,5,FALSE)","v":"WF-5"},"WF",null,null,null,null,null,null,"F86701",null,3560,16,12,12,12,13,4,15,14,13,13,13,13,10,9,9,7,9,7]
["2020-08-01",{"$f":"VLOOKUP(J675,'Control Panel'!$G$132:$K$171,5,FALSE)","v":"WF-5"},"WF",null,null,null,null,null,null,"F86705",null,3399,8,8,8,8,8,6,10,10,9,10,9,10,9,9,9,9,8,9]
["2020-08-01",{"$f":"VLOOKUP(J676,'Control Panel'!$G$132:$K$171,5,FALSE)","v":"WF-6"},"WF",null,null,null,null,null,null,"F86708",null,2811,10,8,9,9,6,0,7,6,4,3,4,4,9,9,8,6,8,6]
["2020-08-01",{"$f":"VLOOKUP(J677,'Control Panel'!$G$132:$K$171,5,FALSE)","v":"WF-4"},"WF",null,null,null,null,null,null,"F86712",null,3345,5,5,5,5,5,2,18,16,16,16,16,16,7,4,5,5,5,5]
["2020-08-01",{"$f":"VLOOKUP(J678,'Control Panel'!$G$132:$K$171,5,FALSE)","v":"WF-2"},"WF",null,null,null,null,null,null,"Y01291",null,8930,24,22,22,22,19,14,30,29,28,28,29,27,26,25,25,23,25,24]
["2020-08-01",{"$f":"VLOOKUP(J679,'Control Panel'!$G$132:$K$171,5,FALSE)","v":"WF-1"},"WF",null,null,null,null,null,null,"Y01839",null,6447,12,9,9,9,8,6,25,24,22,22,22,22,27,24,24,20,24,21]
["2020-08-01",{"$f":"VLOOKUP(J680,'Control Panel'!$G$132:$K$171,5,FALSE)","v":{"$error":"#N/A"}},null,null,null,null,null,null,null,"total",null,266595,908,793,796,808,790,280,934,840,793,794,794,797,899,816,802,653,798,678]
["2020-09-01",{"$f":"VLOOKUP(J681,'Control Panel'!$G$132:$K$171,5,FALSE)","v":{"$error":"#N/A"}},"Childhood Immunisations Q2",null,"Last Run:",null,"Population Count",280186,null,null,"Search","All Patients","(01) 12 MONTH COHORT","(01.01) DTaP/IPV/Hib 6in1","(01.02) Men B (1st and 2nd)","(01.03) PCV","(01.04) Rotavirus","(01.05) BCG","(02) 24 MONTH COHORT","(02.01) DTaP/IPV/Hib Combined","(02.02) MMR","(02.03) HiB/Men C","(02.04) PCV (Booster)","(02.05) Men B (Booster)","(03) 5 YEAR COHORT","(03.01) DTaP/IPV/Hib Combined","(03.02) MMR (Primary)","(03.03) DTaP/IPV (Booster)","(03.04) HiB/Men C","(03.05) MMR (Booster)"]
["2020-09-01",{"$f":"VLOOKUP(J682,'Control Panel'!$G$132:$K$171,5,FALSE)","v":{"$error":"#N/A"}},null,null,"2020-10-02T11:58:00",null,"Males",143534,null,"Organisation Code"]
["2020-09-01",{"$f":"VLOOKUP(J683,'Control Panel'!$G$132:$K$171,5,FALSE)","v":"WF-6"},"WF",null,"Relative Date:",null,"Females",136652,null,"F86001",null,7941,31,25,25,25,26,12,29,27,25,25,25,26,24,21,22,12,21,15]
["2020-09-01",{"$f":"VLOOKUP(J684,'Control Panel'!$G$132:$K$171,5,FALSE)","v":"WF-1"},"WF",null,"2020-10-01",null,null,null,null,"F86005",null,8928,43,38,37,39,36,5,48,40,40,41,40,40,41,36,36,31,36,32]
["2020-09-01",{"$f":"VLOOKUP(J685,'Control Panel'!$G$132:$K$171,5,FALSE)","v":"WF-7"},"WF",null,null,null,null,null,null,"F86006",null,6483,12,9,9,9,9,1,13,13,11,10,10,10,21,20,21,16,20,17]
["2020-09-01",{"$f":"VLOOKUP(J686,'Control Panel'!$G$132:$K$171,5,FALSE)","v":"WF-3"},"WF",null,null,null,null,null,null,"F86011",null,9869,23,21,20,21,22,13,16,15,16,16,16,15,33,28,26,17,27,20]
["2020-09-01",{"$f":"VLOOKUP(J687,'Control Panel'!$G$132:$K$171,5,FALSE)","v":"WF-7"},"WF",null,null,null,null,null,null,"F86030",null,8316,37,30,32,32,28,15,21,20,18,18,18,18,24,23,21,15,22,19]
["2020-09-01",{"$f":"VLOOKUP(J688,'Control Panel'!$G$132:$K$171,5,FALSE)","v":"WF-4"},"WF",null,null,null,null,null,null,"F86036",null,15777,70,65,64,65,61,28,67,62,60,58,59,59,64,61,58,55,60,53]
["2020-09-01",{"$f":"VLOOKUP(J689,'Control Panel'!$G$132:$K$171,5,FALSE)","v":"WF-3"},"WF",null,null,null,null,null,null,"F86038",null,12204,30,23,24,25,24,2,54,51,48,48,48,48,51,47,47,36,45,37]
["2020-09-01",{"$f":"VLOOKUP(J690,'Control Panel'!$G$132:$K$171,5,FALSE)","v":"WF-4"},"WF",null,null,null,null,null,null,"F86044",null,9769,47,44,44,45,44,11,42,31,30,31,31,31,33,29,28,20,28,20]
["2020-09-01",{"$f":"VLOOKUP(J691,'Control Panel'!$G$132:$K$171,5,FALSE)","v":"WF-5"},"WF",null,null,null,null,null,null,"F86045",null,1996,4,3,3,3,4,2,2,2,2,2,2,2,9,8,8,7,8,6]
["2020-09-01",{"$f":"VLOOKUP(J692,'Control Panel'!$G$132:$K$171,5,FALSE)","v":"WF-7"},"WF",null,null,null,null,null,null,"F86058",null,15508,63,55,55,55,57,23,64,54,48,49,48,49,45,41,40,32,40,34]
["2020-09-01",{"$f":"VLOOKUP(J693,'Control Panel'!$G$132:$K$171,5,FALSE)","v":"WF-7"},"WF",null,null,null,null,null,null,"F86062",null,7332,17,14,14,14,15,4,21,18,15,15,15,15,32,26,26,15,26,15]
["2020-09-01",{"$f":"VLOOKUP(J694,'Control Panel'!$G$132:$K$171,5,FALSE)","v":"WF-2"},"WF",null,null,null,null,null,null,"F86078",null,7081,12,11,11,11,11,2,18,17,14,16,16,15,9,9,9,9,9,9]
["2020-09-01",{"$f":"VLOOKUP(J695,'Control Panel'!$G$132:$K$171,5,FALSE)","v":"WF-6"},"WF",null,null,null,null,null,null,"F86086",null,6298,35,29,29,29,32,4,24,18,17,18,17,18,28,25,26,17,25,20]
["2020-09-01",{"$f":"VLOOKUP(J696,'Control Panel'!$G$132:$K$171,5,FALSE)","v":"WF-4"},"WF",null,null,null,null,null,null,"F86088",null,4826,9,8,8,8,8,3,12,11,8,8,8,9,9,8,8,5,8,5]
["2020-09-01",{"$f":"VLOOKUP(J697,'Control Panel'!$G$132:$K$171,5,FALSE)","v":"WF-6"},"WF",null,null,null,null,null,null,"F86607",null,14018,39,33,34,33,33,17,49,45,43,44,43,44,51,45,45,40,42,42]
["2020-09-01",{"$f":"VLOOKUP(J698,'Control Panel'!$G$132:$K$171,5,FALSE)","v":"WF-2"},"WF",null,null,null,null,null,null,"F86616",null,7403,44,40,40,41,40,5,28,25,25,26,26,26,33,28,28,18,28,22]
["2020-09-01",{"$f":"VLOOKUP(J699,'Control Panel'!$G$132:$K$171,5,FALSE)","v":"WF-5"},"WF",null,null,null,null,null,null,"F86621",null,5953,18,16,16,17,17,14,20,18,17,16,16,16,14,14,13,11,13,12]
["2020-09-01",{"$f":"VLOOKUP(J700,'Control Panel'!$G$132:$K$171,5,FALSE)","v":"WF-5"},"WF",null,null,null,null,null,null,"F86625",null,6087,14,11,12,12,11,1,16,10,8,7,7,7,16,14,13,12,14,11]
["2020-09-01",{"$f":"VLOOKUP(J701,'Control Panel'!$G$132:$K$171,5,FALSE)","v":"WF-1"},"WF",null,null,null,null,null,null,"F86626",null,6255,20,17,16,18,18,2,21,20,21,19,20,20,27,24,23,21,23,21]
["2020-09-01",{"$f":"VLOOKUP(J702,'Control Panel'!$G$132:$K$171,5,FALSE)","v":"WF-2"},"WF",null,null,null,null,null,null,"F86627",null,13537,24,20,21,21,19,6,36,34,29,30,30,31,31,31,29,27,30,26]
["2020-09-01",{"$f":"VLOOKUP(J703,'Control Panel'!$G$132:$K$171,5,FALSE)","v":"WF-6"},"WF",null,null,null,null,null,null,"F86644",null,10223,38,34,36,36,35,10,22,20,20,20,20,20,27,24,21,22,24,22]
["2020-09-01",{"$f":"VLOOKUP(J704,'Control Panel'!$G$132:$K$171,5,FALSE)","v":"WF-4"},"WF",null,null,null,null,null,null,"F86650",null,8127,24,21,21,21,19,5,33,32,28,28,30,30,30,26,25,17,25,17]
["2020-09-01",{"$f":"VLOOKUP(J705,'Control Panel'!$G$132:$K$171,5,FALSE)","v":"WF-1"},"WF",null,null,null,null,null,null,"F86664",null,8477,32,30,30,30,30,7,35,32,30,31,31,31,33,32,31,28,32,28]
["2020-09-01",{"$f":"VLOOKUP(J706,'Control Panel'!$G$132:$K$171,5,FALSE)","v":"WF-5"},"WF",null,null,null,null,null,null,"F86666",null,14859,50,45,44,46,44,23,47,41,42,41,42,41,39,31,32,30,31,29]
["2020-09-01",{"$f":"VLOOKUP(J707,'Control Panel'!$G$132:$K$171,5,FALSE)","v":"WF-7"},"WF",null,null,null,null,null,null,"F86679",null,6060,28,27,27,27,25,11,30,28,28,28,27,28,29,28,27,23,27,24]
["2020-09-01",{"$f":"VLOOKUP(J708,'Control Panel'!$G$132:$K$171,5,FALSE)","v":"WF-1"},"WF",null,null,null,null,null,null,"F86689",null,4352,24,22,22,22,22,13,33,32,32,31,31,31,25,24,25,22,24,24]
["2020-09-01",{"$f":"VLOOKUP(J709,'Control Panel'!$G$132:$K$171,5,FALSE)","v":"WF-4"},"WF",null,null,null,null,null,null,"F86696",null,6208,30,28,28,27,27,4,17,16,16,16,16,16,17,17,17,11,16,12]
["2020-09-01",{"$f":"VLOOKUP(J710,'Control Panel'!$G$132:$K$171,5,FALSE)","v":"WF-1"},"WF",null,null,null,null,null,null,"F86700",null,3927,11,10,10,10,10,3,10,7,7,7,7,7,14,12,12,13,12,13]
["2020-09-01",{"$f":"VLOOKUP(J711,'Control Panel'!$G$132:$K$171,5,FALSE)","v":"WF-5"},"WF",null,null,null,null,null,null,"F86701",null,3572,16,12,12,12,13,4,15,14,13,13,13,13,10,9,9,7,9,7]
["2020-09-01",{"$f":"VLOOKUP(J712,'Control Panel'!$G$132:$K$171,5,FALSE)","v":"WF-5"},"WF",null,null,null,null,null,null,"F86705",null,3415,8,8,8,8,8,7,10,10,9,10,9,10,9,9,9,9,8,9]
["2020-09-01",{"$f":"VLOOKUP(J713,'Control Panel'!$G$132:$K$171,5,FALSE)","v":"WF-6"},"WF",null,null,null,null,null,null,"F86708",null,2786,9,8,8,8,6,1,7,6,4,3,4,4,9,9,8,6,8,6]
["2020-09-01",{"$f":"VLOOKUP(J714,'Control Panel'!$G$132:$K$171,5,FALSE)","v":"WF-4"},"WF",null,null,null,null,null,null,"F86712",null,3335,5,5,5,5,5,2,18,16,16,16,16,16,7,4,5,5,5,5]
["2020-09-01",{"$f":"VLOOKUP(J715,'Control Panel'!$G$132:$K$171,5,FALSE)","v":"WF-2"},"WF",null,null,null,null,null,null,"Y01291",null,8921,23,21,21,21,19,13,30,29,28,28,29,27,25,24,24,22,24,23]
["2020-09-01",{"$f":"VLOOKUP(J716,'Control Panel'!$G$132:$K$171,5,FALSE)","v":"WF-1"},"WF",null,null,null,null,null,null,"Y01839",null,6427,12,9,9,9,8,6,24,23,21,21,21,21,27,24,24,20,24,21]
["2020-09-01",{"$f":"VLOOKUP(J717,'Control Panel'!$G$132:$K$171,5,FALSE)","v":{"$error":"#N/A"}},null,null,null,null,null,null,null,"total",null,266270,902,792,795,805,786,279,932,837,789,790,791,794,896,811,796,651,794,676]
["2020-10-01",{"$f":"VLOOKUP(J718,'Control Panel'!$G$132:$K$171,5,FALSE)","v":{"$error":"#N/A"}},"Childhood Immunisations Q3",null,"Last Run:",null,"Population Count",280284,null,null,"Search","All Patients","(01) 12 MONTH COHORT","(01.01) DTaP/IPV/Hib 6in1","(01.02) Men B (1st and 2nd)","(01.03) PCV","(01.04) Rotavirus","(01.05) BCG","(02) 24 MONTH COHORT","(02.01) DTaP/IPV/Hib Combined","(02.02) MMR","(02.03) HiB/Men C","(02.04) PCV (Booster)","(02.05) Men B (Booster)","(03) 5 YEAR COHORT","(03.01) DTaP/IPV/Hib Combined","(03.02) MMR (Primary)","(03.03) DTaP/IPV (Booster)","(03.04) HiB/Men C","(03.05) MMR (Booster)"]
["2020-10-01",{"$f":"VLOOKUP(J719,'Control Panel'!$G$132:$K$171,5,FALSE)","v":{"$error":"#N/A"}},null,null,"2020-11-02T10:16:00",null,"Males",143412,null,"Organisation Code"]
["2020-10-01",{"$f":"VLOOKUP(J720,'Control Panel'!$G$132:$K$171,5,FALSE)","v":"WF-6"},"WF",null,"Relative Date:",null,"Females",136872,null,"F86001",null,7933,25,22,22,20,20,11,25,23,21,21,21,21,44,38,38,26,38,26]
["2020-10-01",{"$f":"VLOOKUP(J721,'Control Panel'!$G$132:$K$171,5,FALSE)","v":"WF-1"},"WF",null,"2020-11-01",null,null,null,null,"F86005",null,8959,48,44,45,44,44,5,53,50,46,46,47,46,22,17,18,16,19,16]
["2020-10-01",{"$f":"VLOOKUP(J722,'Control Panel'!$G$132:$K$171,5,FALSE)","v":"WF-7"},"WF",null,null,null,null,null,null,"F86006",null,6514,20,16,16,15,17,3,13,11,10,10,10,10,27,26,26,22,26,23]
["2020-10-01",{"$f":"VLOOKUP(J723,'Control Panel'!$G$132:$K$171,5,FALSE)","v":"WF-3"},"WF",null,null,null,null,null,null,"F86011",null,9845,20,15,16,15,15,9,24,18,19,19,19,17,29,26,25,21,25,22]
["2020-10-01",{"$f":"VLOOKUP(J724,'Control Panel'!$G$132:$K$171,5,FALSE)","v":"WF-7"},"WF",null,null,null,null,null,null,"F86030",null,8294,36,36,36,36,31,22,30,30,29,28,28,29,22,20,18,14,17,16]
["2020-10-01",{"$f":"VLOOKUP(J725,'Control Panel'!$G$132:$K$171,5,FALSE)","v":"WF-4"},"WF",null,null,null,null,null,null,"F86036",null,15795,48,39,39,40,39,17,63,59,53,53,53,54,48,46,45,41,46,41]
["2020-10-01",{"$f":"VLOOKUP(J726,'Control Panel'!$G$132:$K$171,5,FALSE)","v":"WF-3"},"WF",null,null,null,null,null,null,"F86038",null,12058,43,40,40,38,39,10,34,32,26,27,28,28,40,36,34,32,35,33]
["2020-10-01",{"$f":"VLOOKUP(J727,'Control Panel'!$G$132:$K$171,5,FALSE)","v":"WF-4"},"WF",null,null,null,null,null,null,"F86044",null,9841,47,44,44,44,45,11,50,45,38,37,39,38,36,30,29,26,29,26]
["2020-10-01",{"$f":"VLOOKUP(J728,'Control Panel'!$G$132:$K$171,5,FALSE)","v":"WF-5"},"WF",null,null,null,null,null,null,"F86045",null,1986,2,2,2,2,2,1,6,5,6,6,6,6,5,5,4,4,4,4]
["2020-10-01",{"$f":"VLOOKUP(J729,'Control Panel'!$G$132:$K$171,5,FALSE)","v":"WF-7"},"WF",null,null,null,null,null,null,"F86058",null,15598,71,56,57,55,66,24,63,54,48,48,48,48,72,63,63,46,63,47]
["2020-10-01",{"$f":"VLOOKUP(J730,'Control Panel'!$G$132:$K$171,5,FALSE)","v":"WF-7"},"WF",null,null,null,null,null,null,"F86062",null,7323,27,17,18,18,25,11,18,17,14,14,15,16,16,13,14,7,14,8]
["2020-10-01",{"$f":"VLOOKUP(J731,'Control Panel'!$G$132:$K$171,5,FALSE)","v":"WF-2"},"WF",null,null,null,null,null,null,"F86078",null,7057,9,8,8,8,8,5,10,10,9,10,10,10,24,23,22,20,22,20]
["2020-10-01",{"$f":"VLOOKUP(J732,'Control Panel'!$G$132:$K$171,5,FALSE)","v":"WF-6"},"WF",null,null,null,null,null,null,"F86086",null,6301,31,27,27,22,26,12,29,27,26,25,24,25,27,25,24,14,24,19]
["2020-10-01",{"$f":"VLOOKUP(J733,'Control Panel'!$G$132:$K$171,5,FALSE)","v":"WF-4"},"WF",null,null,null,null,null,null,"F86088",null,4809,9,8,8,8,8,2,12,11,10,10,10,10,16,14,13,12,14,12]
["2020-10-01",{"$f":"VLOOKUP(J734,'Control Panel'!$G$132:$K$171,5,FALSE)","v":"WF-6"},"WF",null,null,null,null,null,null,"F86607",null,14080,55,42,46,45,46,23,48,43,42,43,43,43,47,45,45,45,45,46]
["2020-10-01",{"$f":"VLOOKUP(J735,'Control Panel'!$G$132:$K$171,5,FALSE)","v":"WF-2"},"WF",null,null,null,null,null,null,"F86616",null,7438,29,24,24,23,25,7,38,31,29,29,29,30,25,22,22,19,22,19]
["2020-10-01",{"$f":"VLOOKUP(J736,'Control Panel'!$G$132:$K$171,5,FALSE)","v":"WF-5"},"WF",null,null,null,null,null,null,"F86621",null,5987,17,15,15,14,13,10,26,24,22,21,21,21,13,13,13,10,13,11]
["2020-10-01",{"$f":"VLOOKUP(J737,'Control Panel'!$G$132:$K$171,5,FALSE)","v":"WF-5"},"WF",null,null,null,null,null,null,"F86625",null,6041,16,13,12,12,11,2,18,15,9,10,11,11,16,15,16,13,16,13]
["2020-10-01",{"$f":"VLOOKUP(J738,'Control Panel'!$G$132:$K$171,5,FALSE)","v":"WF-1"},"WF",null,null,null,null,null,null,"F86626",null,6302,36,30,30,30,33,7,17,15,14,14,15,14,18,17,17,16,18,16]
["2020-10-01",{"$f":"VLOOKUP(J739,'Control Panel'!$G$132:$K$171,5,FALSE)","v":"WF-2"},"WF",null,null,null,null,null,null,"F86627",null,13571,29,27,27,26,26,10,39,35,35,35,35,35,39,35,32,25,32,25]
["2020-10-01",{"$f":"VLOOKUP(J740,'Control Panel'!$G$132:$K$171,5,FALSE)","v":"WF-6"},"WF",null,null,null,null,null,null,"F86644",null,10196,13,12,12,12,12,2,28,25,25,24,24,23,31,28,27,26,26,28]
["2020-10-01",{"$f":"VLOOKUP(J741,'Control Panel'!$G$132:$K$171,5,FALSE)","v":"WF-4"},"WF",null,null,null,null,null,null,"F86650",null,8132,28,24,24,23,21,9,29,23,22,23,23,23,30,28,28,23,28,24]
["2020-10-01",{"$f":"VLOOKUP(J742,'Control Panel'!$G$132:$K$171,5,FALSE)","v":"WF-1"},"WF",null,null,null,null,null,null,"F86664",null,8519,30,26,26,25,27,5,23,20,19,19,19,18,20,18,14,13,14,13]
["2020-10-01",{"$f":"VLOOKUP(J743,'Control Panel'!$G$132:$K$171,5,FALSE)","v":"WF-5"},"WF",null,null,null,null,null,null,"F86666",null,14873,50,37,39,35,38,19,36,32,32,33,32,33,62,55,54,51,52,53]
["2020-10-01",{"$f":"VLOOKUP(J744,'Control Panel'!$G$132:$K$171,5,FALSE)","v":"WF-7"},"WF",null,null,null,null,null,null,"F86679",null,6057,33,30,30,30,31,13,37,33,30,31,32,31,22,20,21,19,21,19]
["2020-10-01",{"$f":"VLOOKUP(J745,'Control Panel'!$G$132:$K$171,5,FALSE)","v":"WF-1"},"WF",null,null,null,null,null,null,"F86689",null,4352,20,19,18,17,19,4,25,25,25,25,25,25,24,20,22,18,20,21]
["2020-10-01",{"$f":"VLOOKUP(J746,'Control Panel'!$G$132:$K$171,5,FALSE)","v":"WF-4"},"WF",null,null,null,null,null,null,"F86696",null,6274,24,23,23,24,23,3,18,16,13,13,14,14,13,12,12,7,12,10]
["2020-10-01",{"$f":"VLOOKUP(J747,'Control Panel'!$G$132:$K$171,5,FALSE)","v":"WF-1"},"WF",null,null,null,null,null,null,"F86700",null,3925,12,11,11,11,10,4,15,14,13,13,13,13,11,11,11,11,10,11]
["2020-10-01",{"$f":"VLOOKUP(J748,'Control Panel'!$G$132:$K$171,5,FALSE)","v":"WF-5"},"WF",null,null,null,null,null,null,"F86701",null,3579,11,9,9,9,10,3,13,10,10,10,10,10,10,9,9,6,9,6]
["2020-10-01",{"$f":"VLOOKUP(J749,'Control Panel'!$G$132:$K$171,5,FALSE)","v":"WF-5"},"WF",null,null,null,null,null,null,"F86705",null,3420,8,7,7,7,6,2,11,10,7,7,7,7,5,5,5,4,4,5]
["2020-10-01",{"$f":"VLOOKUP(J750,'Control Panel'!$G$132:$K$171,5,FALSE)","v":"WF-6"},"WF",null,null,null,null,null,null,"F86708",null,2778,6,6,5,6,6,0,4,3,3,3,3,3,6,6,6,4,6,4]
["2020-10-01",{"$f":"VLOOKUP(J751,'Control Panel'!$G$132:$K$171,5,FALSE)","v":"WF-4"},"WF",null,null,null,null,null,null,"F86712",null,3339,9,8,8,8,7,1,12,11,9,9,9,9,5,5,5,5,5,5]
["2020-10-01",{"$f":"VLOOKUP(J752,'Control Panel'!$G$132:$K$171,5,FALSE)","v":"WF-2"},"WF",null,null,null,null,null,null,"Y01291",null,8881,34,33,32,33,33,22,29,29,28,28,28,28,30,28,29,21,28,22]
["2020-10-01",{"$f":"VLOOKUP(J753,'Control Panel'!$G$132:$K$171,5,FALSE)","v":"WF-1"},"WF",null,null,null,null,null,null,"Y01839",null,6409,33,29,28,29,29,3,29,26,23,23,23,23,22,22,19,17,19,17]
["2020-10-01",{"$f":"VLOOKUP(J754,'Control Panel'!$G$132:$K$171,5,FALSE)","v":{"$error":"#N/A"}},null,null,null,null,null,null,null,"total",null,266466,929,799,804,784,811,292,925,832,765,767,774,772,877,796,780,654,776,681]
["2020-11-01",{"$f":"VLOOKUP(J755,'Control Panel'!$G$132:$K$171,5,FALSE)","v":{"$error":"#N/A"}},"Childhood Immunisations Q3",null,"Last Run:",null,"Population Count",280244,null,null,"Search","All Patients","(01) 12 MONTH COHORT","(01.01) DTaP/IPV/Hib 6in1","(01.02) Men B (1st and 2nd)","(01.03) PCV","(01.04) Rotavirus","(01.05) BCG","(02) 24 MONTH COHORT","(02.01) DTaP/IPV/Hib Combined","(02.02) MMR","(02.03) HiB/Men C","(02.04) PCV (Booster)","(02.05) Men B (Booster)","(03) 5 YEAR COHORT","(03.01) DTaP/IPV/Hib Combined","(03.02) MMR (Primary)","(03.03) DTaP/IPV (Booster)","(03.04) HiB/Men C","(03.05) MMR (Booster)"]
["2020-11-01",{"$f":"VLOOKUP(J756,'Control Panel'!$G$132:$K$171,5,FALSE)","v":{"$error":"#N/A"}},null,null,"2020-12-02T12:56:00",null,"Males",143438,null,"Organisation Code"]
["2020-11-01",{"$f":"VLOOKUP(J757,'Control Panel'!$G$132:$K$171,5,FALSE)","v":"WF-6"},"WF",null,"Relative Date:",null,"Females",136806,null,"F86001",null,7917,25,22,22,20,20,11,25,24,22,22,22,22,44,38,38,26,38,26]
["2020-11-01",{"$f":"VLOOKUP(J758,'Control Panel'!$G$132:$K$171,5,FALSE)","v":"WF-1"},"WF",null,"2020-12-01",null,null,null,null,"F86005",null,9029,48,45,45,45,44,5,53,50,46,46,47,46,22,17,18,16,19,16]
["2020-11-01",{"$f":"VLOOKUP(J759,'Control Panel'!$G$132:$K$171,5,FALSE)","v":"WF-7"},"WF",null,null,null,null,null,null,"F86006",null,6551,20,16,16,15,17,3,14,11,10,10,10,10,27,26,26,22,26,23]
["2020-11-01",{"$f":"VLOOKUP(J760,'Control Panel'!$G$132:$K$171,5,FALSE)","v":"WF-3"},"WF",null,null,null,null,null,null,"F86011",null,9810,20,15,16,15,15,9,23,18,19,19,19,17,30,27,26,22,26,23]
["2020-11-01",{"$f":"VLOOKUP(J761,'Control Panel'!$G$132:$K$171,5,FALSE)","v":"WF-7"},"WF",null,null,null,null,null,null,"F86030",null,8315,34,34,34,34,29,20,30,30,29,28,28,29,22,20,18,14,17,16]
["2020-11-01",{"$f":"VLOOKUP(J762,'Control Panel'!$G$132:$K$171,5,FALSE)","v":"WF-4"},"WF",null,null,null,null,null,null,"F86036",null,15748,47,39,39,39,39,17,63,59,54,54,54,55,48,46,45,42,46,42]
["2020-11-01",{"$f":"VLOOKUP(J763,'Control Panel'!$G$132:$K$171,5,FALSE)","v":"WF-3"},"WF",null,null,null,null,null,null,"F86038",null,11979,43,40,40,38,39,10,34,32,26,27,28,28,41,37,35,33,36,34]
["2020-11-01",{"$f":"VLOOKUP(J764,'Control Panel'!$G$132:$K$171,5,FALSE)","v":"WF-4"},"WF",null,null,null,null,null,null,"F86044",null,10012,48,44,44,44,45,11,50,45,38,37,39,38,36,30,29,26,29,26]
["2020-11-01",{"$f":"VLOOKUP(J765,'Control Panel'!$G$132:$K$171,5,FALSE)","v":"WF-5"},"WF",null,null,null,null,null,null,"F86045",null,2002,2,2,2,2,2,1,7,6,7,7,7,6,5,5,4,4,4,4]
["2020-11-01",{"$f":"VLOOKUP(J766,'Control Panel'!$G$132:$K$171,5,FALSE)","v":"WF-7"},"WF",null,null,null,null,null,null,"F86058",null,15552,70,55,56,54,65,24,65,55,49,49,49,49,73,63,63,47,63,48]
["2020-11-01",{"$f":"VLOOKUP(J767,'Control Panel'!$G$132:$K$171,5,FALSE)","v":"WF-7"},"WF",null,null,null,null,null,null,"F86062",null,7335,27,17,18,18,25,11,18,17,14,14,15,16,16,13,14,7,14,8]
["2020-11-01",{"$f":"VLOOKUP(J768,'Control Panel'!$G$132:$K$171,5,FALSE)","v":"WF-2"},"WF",null,null,null,null,null,null,"F86078",null,7037,9,8,8,8,8,5,9,9,8,9,9,9,24,23,22,20,22,20]
["2020-11-01",{"$f":"VLOOKUP(J769,'Control Panel'!$G$132:$K$171,5,FALSE)","v":"WF-6"},"WF",null,null,null,null,null,null,"F86086",null,6296,31,27,27,22,26,12,29,27,26,25,24,25,27,25,24,14,24,19]
["2020-11-01",{"$f":"VLOOKUP(J770,'Control Panel'!$G$132:$K$171,5,FALSE)","v":"WF-4"},"WF",null,null,null,null,null,null,"F86088",null,4818,9,8,8,8,8,2,12,11,10,10,10,10,16,14,13,12,14,12]
["2020-11-01",{"$f":"VLOOKUP(J771,'Control Panel'!$G$132:$K$171,5,FALSE)","v":"WF-6"},"WF",null,null,null,null,null,null,"F86607",null,14111,53,42,46,45,44,21,48,42,41,42,42,42,47,45,45,45,45,46]
["2020-11-01",{"$f":"VLOOKUP(J772,'Control Panel'!$G$132:$K$171,5,FALSE)","v":"WF-2"},"WF",null,null,null,null,null,null,"F86616",null,7426,29,24,24,23,25,8,38,31,29,29,29,30,25,21,21,18,21,18]
["2020-11-01",{"$f":"VLOOKUP(J773,'Control Panel'!$G$132:$K$171,5,FALSE)","v":"WF-5"},"WF",null,null,null,null,null,null,"F86621",null,6009,17,15,15,14,13,10,26,24,22,21,21,21,13,13,13,10,13,11]
["2020-11-01",{"$f":"VLOOKUP(J774,'Control Panel'!$G$132:$K$171,5,FALSE)","v":"WF-5"},"WF",null,null,null,null,null,null,"F86625",null,6023,16,13,12,12,11,2,18,15,9,10,11,11,16,15,16,13,16,13]
["2020-11-01",{"$f":"VLOOKUP(J775,'Control Panel'!$G$132:$K$171,5,FALSE)","v":"WF-1"},"WF",null,null,null,null,null,null,"F86626",null,6343,36,30,30,30,33,7,17,15,14,14,15,14,18,17,17,16,18,16]
["2020-11-01",{"$f":"VLOOKUP(J776,'Control Panel'!$G$132:$K$171,5,FALSE)","v":"WF-2"},"WF",null,null,null,null,null,null,"F86627",null,13549,30,28,28,27,27,11,39,34,34,34,34,34,39,35,32,25,32,25]
["2020-11-01",{"$f":"VLOOKUP(J777,'Control Panel'!$G$132:$K$171,5,FALSE)","v":"WF-6"},"WF",null,null,null,null,null,null,"F86644",null,10037,12,11,11,11,11,2,28,25,25,24,24,23,31,28,26,25,25,27]
["2020-11-01",{"$f":"VLOOKUP(J778,'Control Panel'!$G$132:$K$171,5,FALSE)","v":"WF-4"},"WF",null,null,null,null,null,null,"F86650",null,8086,27,23,23,22,20,9,28,22,21,22,22,22,30,28,28,23,28,24]
["2020-11-01",{"$f":"VLOOKUP(J779,'Control Panel'!$G$132:$K$171,5,FALSE)","v":"WF-1"},"WF",null,null,null,null,null,null,"F86664",null,8451,29,26,26,25,26,5,23,20,19,19,19,18,19,17,13,12,13,12]
["2020-11-01",{"$f":"VLOOKUP(J780,'Control Panel'!$G$132:$K$171,5,FALSE)","v":"WF-5"},"WF",null,null,null,null,null,null,"F86666",null,14877,49,36,38,34,37,19,36,33,33,34,33,33,62,55,54,51,52,53]
["2020-11-01",{"$f":"VLOOKUP(J781,'Control Panel'!$G$132:$K$171,5,FALSE)","v":"WF-7"},"WF",null,null,null,null,null,null,"F86679",null,6064,32,29,29,29,30,14,37,34,31,32,33,32,22,20,21,19,21,19]
["2020-11-01",{"$f":"VLOOKUP(J782,'Control Panel'!$G$132:$K$171,5,FALSE)","v":"WF-1"},"WF",null,null,null,null,null,null,"F86689",null,4349,20,19,18,17,19,4,25,25,25,25,25,25,24,20,22,18,20,21]
["2020-11-01",{"$f":"VLOOKUP(J783,'Control Panel'!$G$132:$K$171,5,FALSE)","v":"WF-4"},"WF",null,null,null,null,null,null,"F86696",null,6317,24,23,23,24,23,3,18,16,13,13,14,14,12,11,11,6,11,9]
["2020-11-01",{"$f":"VLOOKUP(J784,'Control Panel'!$G$132:$K$171,5,FALSE)","v":"WF-1"},"WF",null,null,null,null,null,null,"F86700",null,3914,11,10,10,10,9,3,15,14,13,13,13,13,11,11,11,11,10,11]
["2020-11-01",{"$f":"VLOOKUP(J785,'Control Panel'!$G$132:$K$171,5,FALSE)","v":"WF-5"},"WF",null,null,null,null,null,null,"F86701",null,3608,13,10,9,9,11,4,14,11,11,11,11,11,10,9,9,6,9,6]
["2020-11-01",{"$f":"VLOOKUP(J786,'Control Panel'!$G$132:$K$171,5,FALSE)","v":"WF-5"},"WF",null,null,null,null,null,null,"F86705",null,3451,9,8,8,8,7,2,11,10,7,7,7,7,5,5,5,4,4,5]
["2020-11-01",{"$f":"VLOOKUP(J787,'Control Panel'!$G$132:$K$171,5,FALSE)","v":"WF-6"},"WF",null,null,null,null,null,null,"F86708",null,2772,6,6,5,6,6,0,4,3,3,3,3,3,6,6,6,4,6,4]
["2020-11-01",{"$f":"VLOOKUP(J788,'Control Panel'!$G$132:$K$171,5,FALSE)","v":"WF-4"},"WF",null,null,null,null,null,null,"F86712",null,3351,9,8,8,8,7,1,12,11,9,9,9,9,5,5,5,5,5,5]
["2020-11-01",{"$f":"VLOOKUP(J789,'Control Panel'!$G$132:$K$171,5,FALSE)","v":"WF-2"},"WF",null,null,null,null,null,null,"Y01291",null,8891,34,33,32,33,33,23,29,29,28,28,28,28,29,27,28,21,27,22]
["2020-11-01",{"$f":"VLOOKUP(J790,'Control Panel'!$G$132:$K$171,5,FALSE)","v":"WF-1"},"WF",null,null,null,null,null,null,"Y01839",null,6413,33,29,28,29,29,11,29,26,23,23,23,23,22,22,19,17,19,17]
["2020-11-01",{"$f":"VLOOKUP(J791,'Control Panel'!$G$132:$K$171,5,FALSE)","v":{"$error":"#N/A"}},null,null,null,null,null,null,null,"total",null,266443,922,795,798,778,803,300,927,834,768,770,777,773,877,794,777,654,773,681]
["2020-12-01",{"$f":"VLOOKUP(J792,'Control Panel'!$G$132:$K$171,5,FALSE)","v":{"$error":"#N/A"}},"Childhood Immunisations Q3",null,"Last Run:",null,"Population Count",280533,null,null,"Search","All Patients","(01) 12 MONTH COHORT","(01.01) DTaP/IPV/Hib 6in1","(01.02) Men B (1st and 2nd)","(01.03) PCV","(01.04) Rotavirus","(01.05) BCG","(02) 24 MONTH COHORT","(02.01) DTaP/IPV/Hib Combined","(02.02) MMR","(02.03) HiB/Men C","(02.04) PCV (Booster)","(02.05) Men B (Booster)","(03) 5 YEAR COHORT","(03.01) DTaP/IPV/Hib Combined","(03.02) MMR (Primary)","(03.03) DTaP/IPV (Booster)","(03.04) HiB/Men C","(03.05) MMR (Booster)"]
["2020-12-01",{"$f":"VLOOKUP(J793,'Control Panel'!$G$132:$K$171,5,FALSE)","v":{"$error":"#N/A"}},null,null,"2021-01-04T13:29:00",null,"Males",143620,null,"Organisation Code"]
["2020-12-01",{"$f":"VLOOKUP(J794,'Control Panel'!$G$132:$K$171,5,FALSE)","v":"WF-6"},"WF",null,"Relative Date:",null,"Females",136913,null,"F86001",null,7921,26,22,22,20,20,11,24,23,21,21,21,21,44,38,38,26,38,26]
["2020-12-01",{"$f":"VLOOKUP(J795,'Control Panel'!$G$132:$K$171,5,FALSE)","v":"WF-1"},"WF",null,"2021-01-01",null,null,null,null,"F86005",null,9025,47,45,45,44,43,5,53,49,45,46,46,45,22,17,18,16,19,16]
["2020-12-01",{"$f":"VLOOKUP(J796,'Control Panel'!$G$132:$K$171,5,FALSE)","v":"WF-7"},"WF",null,null,null,null,null,null,"F86006",null,6573,20,16,16,15,17,3,14,11,10,10,10,10,27,26,26,22,26,23]
["2020-12-01",{"$f":"VLOOKUP(J797,'Control Panel'!$G$132:$K$171,5,FALSE)","v":"WF-3"},"WF",null,null,null,null,null,null,"F86011",null,9798,20,15,16,15,15,9,23,18,19,19,19,17,30,27,26,22,26,23]
["2020-12-01",{"$f":"VLOOKUP(J798,'Control Panel'!$G$132:$K$171,5,FALSE)","v":"WF-7"},"WF",null,null,null,null,null,null,"F86030",null,8260,36,36,36,36,31,22,30,30,29,28,28,29,22,20,18,14,17,16]
["2020-12-01",{"$f":"VLOOKUP(J799,'Control Panel'!$G$132:$K$171,5,FALSE)","v":"WF-4"},"WF",null,null,null,null,null,null,"F86036",null,15790,47,39,39,39,39,17,63,59,54,54,54,55,48,46,45,42,46,42]
["2020-12-01",{"$f":"VLOOKUP(J800,'Control Panel'!$G$132:$K$171,5,FALSE)","v":"WF-3"},"WF",null,null,null,null,null,null,"F86038",null,11939,45,40,40,38,39,11,34,31,25,26,27,27,41,37,35,33,36,34]
["2020-12-01",{"$f":"VLOOKUP(J801,'Control Panel'!$G$132:$K$171,5,FALSE)","v":"WF-4"},"WF",null,null,null,null,null,null,"F86044",null,10128,48,44,44,44,45,11,50,45,38,37,39,38,36,30,29,26,29,26]
["2020-12-01",{"$f":"VLOOKUP(J802,'Control Panel'!$G$132:$K$171,5,FALSE)","v":"WF-5"},"WF",null,null,null,null,null,null,"F86045",null,1998,2,2,2,2,2,1,7,6,7,7,7,6,5,5,4,4,4,4]
["2020-12-01",{"$f":"VLOOKUP(J803,'Control Panel'!$G$132:$K$171,5,FALSE)","v":"WF-7"},"WF",null,null,null,null,null,null,"F86058",null,15690,70,55,56,54,65,24,65,56,50,50,50,50,72,62,62,46,62,47]
["2020-12-01",{"$f":"VLOOKUP(J804,'Control Panel'!$G$132:$K$171,5,FALSE)","v":"WF-7"},"WF",null,null,null,null,null,null,"F86062",null,7330,26,16,17,17,24,11,18,17,14,14,15,16,17,14,15,8,15,9]
["2020-12-01",{"$f":"VLOOKUP(J805,'Control Panel'!$G$132:$K$171,5,FALSE)","v":"WF-2"},"WF",null,null,null,null,null,null,"F86078",null,7013,9,8,8,8,8,5,9,9,8,9,9,9,24,23,22,20,22,20]
["2020-12-01",{"$f":"VLOOKUP(J806,'Control Panel'!$G$132:$K$171,5,FALSE)","v":"WF-6"},"WF",null,null,null,null,null,null,"F86086",null,6275,30,26,26,22,25,13,29,27,26,25,24,25,27,25,24,14,24,19]
["2020-12-01",{"$f":"VLOOKUP(J807,'Control Panel'!$G$132:$K$171,5,FALSE)","v":"WF-4"},"WF",null,null,null,null,null,null,"F86088",null,4814,10,9,9,9,9,2,12,11,10,10,10,10,16,14,13,12,14,12]
["2020-12-01",{"$f":"VLOOKUP(J808,'Control Panel'!$G$132:$K$171,5,FALSE)","v":"WF-6"},"WF",null,null,null,null,null,null,"F86607",null,14124,52,42,46,45,44,20,48,43,42,43,43,43,48,46,46,45,46,46]
["2020-12-01",{"$f":"VLOOKUP(J809,'Control Panel'!$G$132:$K$171,5,FALSE)","v":"WF-2"},"WF",null,null,null,null,null,null,"F86616",null,7426,28,23,23,22,24,8,38,31,29,29,29,30,25,21,21,18,21,18]
["2020-12-01",{"$f":"VLOOKUP(J810,'Control Panel'!$G$132:$K$171,5,FALSE)","v":"WF-5"},"WF",null,null,null,null,null,null,"F86621",null,6021,17,15,15,14,13,10,26,24,22,21,21,21,13,13,13,10,13,11]
["2020-12-01",{"$f":"VLOOKUP(J811,'Control Panel'!$G$132:$K$171,5,FALSE)","v":"WF-5"},"WF",null,null,null,null,null,null,"F86625",null,6021,16,13,12,12,11,2,18,15,9,10,11,11,16,15,16,13,16,13]
["2020-12-01",{"$f":"VLOOKUP(J812,'Control Panel'!$G$132:$K$171,5,FALSE)","v":"WF-1"},"WF",null,null,null,null,null,null,"F86626",null,6410,35,29,29,29,32,6,17,15,14,14,15,14,18,17,17,16,18,16]
["2020-12-01",{"$f":"VLOOKUP(J813,'Control Panel'!$G$132:$K$171,5,FALSE)","v":"WF-2"},"WF",null,null,null,null,null,null,"F86627",null,13524,31,29,29,28,28,12,39,34,34,34,34,34,38,34,31,24,31,24]
["2020-12-01",{"$f":"VLOOKUP(J814,'Control Panel'!$G$132:$K$171,5,FALSE)","v":"WF-6"},"WF",null,null,null,null,null,null,"F86644",null,10011,12,11,11,11,11,2,28,25,25,24,24,23,30,27,25,24,24,26]
["2020-12-01",{"$f":"VLOOKUP(J815,'Control Panel'!$G$132:$K$171,5,FALSE)","v":"WF-4"},"WF",null,null,null,null,null,null,"F86650",null,8073,27,23,23,22,21,9,28,23,22,23,23,23,30,28,28,23,28,24]
["2020-12-01",{"$f":"VLOOKUP(J816,'Control Panel'!$G$132:$K$171,5,FALSE)","v":"WF-1"},"WF",null,null,null,null,null,null,"F86664",null,8487,29,26,26,25,26,5,23,20,19,19,19,18,19,17,13,12,13,12]
["2020-12-01",{"$f":"VLOOKUP(J817,'Control Panel'!$G$132:$K$171,5,FALSE)","v":"WF-5"},"WF",null,null,null,null,null,null,"F86666",null,14894,49,37,39,34,37,19,36,33,33,34,33,33,62,55,54,51,52,53]
["2020-12-01",{"$f":"VLOOKUP(J818,'Control Panel'!$G$132:$K$171,5,FALSE)","v":"WF-7"},"WF",null,null,null,null,null,null,"F86679",null,6060,32,30,30,30,30,14,38,34,31,32,33,32,23,21,22,20,22,20]
["2020-12-01",{"$f":"VLOOKUP(J819,'Control Panel'!$G$132:$K$171,5,FALSE)","v":"WF-1"},"WF",null,null,null,null,null,null,"F86689",null,4368,20,19,18,17,19,4,25,25,25,25,25,25,24,20,22,18,20,21]
["2020-12-01",{"$f":"VLOOKUP(J820,'Control Panel'!$G$132:$K$171,5,FALSE)","v":"WF-4"},"WF",null,null,null,null,null,null,"F86696",null,6334,24,23,23,23,23,3,17,15,12,12,13,13,11,10,10,5,10,8]
["2020-12-01",{"$f":"VLOOKUP(J821,'Control Panel'!$G$132:$K$171,5,FALSE)","v":"WF-1"},"WF",null,null,null,null,null,null,"F86700",null,3903,11,10,10,10,9,3,15,14,13,13,13,13,11,11,11,11,10,11]
["2020-12-01",{"$f":"VLOOKUP(J822,'Control Panel'!$G$132:$K$171,5,FALSE)","v":"WF-5"},"WF",null,null,null,null,null,null,"F86701",null,3634,14,12,9,10,13,6,14,11,11,11,11,11,10,9,9,6,9,6]
["2020-12-01",{"$f":"VLOOKUP(J823,'Control Panel'!$G$132:$K$171,5,FALSE)","v":"WF-5"},"WF",null,null,null,null,null,null,"F86705",null,3460,9,9,8,9,8,3,11,10,7,7,7,7,5,5,5,4,4,5]
["2020-12-01",{"$f":"VLOOKUP(J824,'Control Panel'!$G$132:$K$171,5,FALSE)","v":"WF-6"},"WF",null,null,null,null,null,null,"F86708",null,2765,6,6,5,6,6,0,4,3,3,3,3,3,6,6,6,4,6,4]
["2020-12-01",{"$f":"VLOOKUP(J825,'Control Panel'!$G$132:$K$171,5,FALSE)","v":"WF-4"},"WF",null,null,null,null,null,null,"F86712",null,3370,9,8,8,8,7,2,12,11,9,9,9,9,5,5,5,5,5,5]
["2020-12-01",{"$f":"VLOOKUP(J826,'Control Panel'!$G$132:$K$171,5,FALSE)","v":"WF-2"},"WF",null,null,null,null,null,null,"Y01291",null,8887,35,33,32,33,33,25,29,29,28,28,28,28,29,27,28,21,27,22]
["2020-12-01",{"$f":"VLOOKUP(J827,'Control Panel'!$G$132:$K$171,5,FALSE)","v":"WF-1"},"WF",null,null,null,null,null,null,"Y01839",null,6407,33,29,28,29,29,11,28,25,22,22,22,22,21,21,18,16,18,16]
["2020-12-01",{"$f":"VLOOKUP(J828,'Control Panel'!$G$132:$K$171,5,FALSE)","v":{"$error":"#N/A"}},null,null,null,null,null,null,null,"total",null,266733,925,800,800,780,806,309,925,832,766,769,775,771,875,792,775,651,771,678]
["2021-01-01",{"$f":"VLOOKUP(J829,'Control Panel'!$G$132:$K$171,5,FALSE)","v":{"$error":"#N/A"}},"Childhood Immunisations Q4",null,"Last Run:",null,"Population Count",279801,null,null,"Search","All Patients","(01) 12 MONTH COHORT","(01.01) DTaP/IPV/Hib 6in1","(01.02) Men B (1st and 2nd)","(01.03) PCV","(01.04) Rotavirus","(01.05) BCG","(02) 24 MONTH COHORT","(02.01) DTaP/IPV/Hib Combined","(02.02) MMR","(02.03) HiB/Men C","(02.04) PCV (Booster)","(02.05) Men B (Booster)","(03) 5 YEAR COHORT","(03.01) DTaP/IPV/Hib Combined","(03.02) MMR (Primary)","(03.03) DTaP/IPV (Booster)","(03.04) HiB/Men C","(03.05) MMR (Booster)"]
["2021-01-01",{"$f":"VLOOKUP(J830,'Control Panel'!$G$132:$K$171,5,FALSE)","v":{"$error":"#N/A"}},null,null,"2021-02-03T10:09:00",null,"Males",143415,null,"Organisation Code"]
["2021-01-01",{"$f":"VLOOKUP(J831,'Control Panel'!$G$132:$K$171,5,FALSE)","v":"WF-6"},"WF",null,"Relative Date:",null,"Females",136386,null,"F86001",null,7901,23,19,19,21,17,6,18,16,12,12,12,13,24,22,21,15,21,17]
["2021-01-01",{"$f":"VLOOKUP(J832,'Control Panel'!$G$132:$K$171,5,FALSE)","v":"WF-1"},"WF",null,"2021-02-01",null,null,null,null,"F86005",null,9019,53,49,47,48,46,2,53,48,45,45,46,46,34,30,30,27,29,27]
["2021-01-01",{"$f":"VLOOKUP(J833,'Control Panel'!$G$132:$K$171,5,FALSE)","v":"WF-7"},"WF",null,null,null,null,null,null,"F86006",null,6622,17,13,13,14,12,1,14,12,9,10,9,10,13,12,12,11,12,11]
["2021-01-01",{"$f":"VLOOKUP(J834,'Control Panel'!$G$132:$K$171,5,FALSE)","v":"WF-3"},"WF",null,null,null,null,null,null,"F86011",null,9732,24,22,22,22,22,10,20,19,13,13,13,13,22,21,22,15,22,16]
["2021-01-01",{"$f":"VLOOKUP(J835,'Control Panel'!$G$132:$K$171,5,FALSE)","v":"WF-7"},"WF",null,null,null,null,null,null,"F86030",null,8196,30,28,28,29,26,19,33,31,30,30,29,30,25,24,25,24,25,25]
["2021-01-01",{"$f":"VLOOKUP(J836,'Control Panel'!$G$132:$K$171,5,FALSE)","v":"WF-4"},"WF",null,null,null,null,null,null,"F86036",null,15649,38,36,36,37,37,10,51,48,45,45,45,44,48,43,43,41,42,40]
["2021-01-01",{"$f":"VLOOKUP(J837,'Control Panel'!$G$132:$K$171,5,FALSE)","v":"WF-3"},"WF",null,null,null,null,null,null,"F86038",null,11867,31,27,27,28,28,3,44,41,37,36,37,36,46,38,40,38,39,40]
["2021-01-01",{"$f":"VLOOKUP(J838,'Control Panel'!$G$132:$K$171,5,FALSE)","v":"WF-4"},"WF",null,null,null,null,null,null,"F86044",null,10245,43,38,38,37,35,13,44,40,35,36,36,35,26,20,17,11,18,11]
["2021-01-01",{"$f":"VLOOKUP(J839,'Control Panel'!$G$132:$K$171,5,FALSE)","v":"WF-5"},"WF",null,null,null,null,null,null,"F86045",null,2005,5,5,5,5,5,3,3,3,3,3,3,3,2,2,2,2,2,2]
["2021-01-01",{"$f":"VLOOKUP(J840,'Control Panel'!$G$132:$K$171,5,FALSE)","v":"WF-7"},"WF",null,null,null,null,null,null,"F86058",null,15837,68,49,47,51,48,21,61,57,41,42,42,42,65,60,58,34,58,35]
["2021-01-01",{"$f":"VLOOKUP(J841,'Control Panel'!$G$132:$K$171,5,FALSE)","v":"WF-7"},"WF",null,null,null,null,null,null,"F86062",null,7332,12,9,10,11,10,5,20,18,9,10,10,10,23,21,19,20,19,20]
["2021-01-01",{"$f":"VLOOKUP(J842,'Control Panel'!$G$132:$K$171,5,FALSE)","v":"WF-2"},"WF",null,null,null,null,null,null,"F86078",null,7006,12,11,11,12,10,5,7,5,4,4,4,4,22,22,22,19,22,18]
["2021-01-01",{"$f":"VLOOKUP(J843,'Control Panel'!$G$132:$K$171,5,FALSE)","v":"WF-6"},"WF",null,null,null,null,null,null,"F86086",null,6253,30,25,25,26,23,13,17,15,16,15,14,15,22,20,19,14,19,14]
["2021-01-01",{"$f":"VLOOKUP(J844,'Control Panel'!$G$132:$K$171,5,FALSE)","v":"WF-4"},"WF",null,null,null,null,null,null,"F86088",null,4814,8,6,5,6,6,5,9,8,5,5,5,5,6,6,6,4,6,4]
["2021-01-01",{"$f":"VLOOKUP(J845,'Control Panel'!$G$132:$K$171,5,FALSE)","v":"WF-6"},"WF",null,null,null,null,null,null,"F86607",null,14225,50,38,47,47,46,28,49,46,41,40,39,40,55,53,52,46,51,52]
["2021-01-01",{"$f":"VLOOKUP(J846,'Control Panel'!$G$132:$K$171,5,FALSE)","v":"WF-2"},"WF",null,null,null,null,null,null,"F86616",null,7432,27,25,25,25,25,3,29,27,26,26,27,26,30,27,23,21,25,22]
["2021-01-01",{"$f":"VLOOKUP(J847,'Control Panel'!$G$132:$K$171,5,FALSE)","v":"WF-5"},"WF",null,null,null,null,null,null,"F86621",null,6079,22,20,20,21,20,14,17,14,13,14,14,13,16,15,15,13,15,12]
["2021-01-01",{"$f":"VLOOKUP(J848,'Control Panel'!$G$132:$K$171,5,FALSE)","v":"WF-5"},"WF",null,null,null,null,null,null,"F86625",null,5999,13,9,9,10,10,3,11,9,9,9,9,9,12,12,12,7,11,7]
["2021-01-01",{"$f":"VLOOKUP(J849,'Control Panel'!$G$132:$K$171,5,FALSE)","v":"WF-1"},"WF",null,null,null,null,null,null,"F86626",null,6450,23,16,15,18,15,1,20,18,15,15,15,15,14,13,13,9,13,9]
["2021-01-01",{"$f":"VLOOKUP(J850,'Control Panel'!$G$132:$K$171,5,FALSE)","v":"WF-2"},"WF",null,null,null,null,null,null,"F86627",null,13501,28,25,25,25,23,1,23,19,18,17,16,16,35,32,31,26,31,26]
["2021-01-01",{"$f":"VLOOKUP(J851,'Control Panel'!$G$132:$K$171,5,FALSE)","v":"WF-6"},"WF",null,null,null,null,null,null,"F86644",null,9998,26,25,24,25,23,11,25,24,25,25,25,24,36,34,30,26,30,31]
["2021-01-01",{"$f":"VLOOKUP(J852,'Control Panel'!$G$132:$K$171,5,FALSE)","v":"WF-4"},"WF",null,null,null,null,null,null,"F86650",null,8142,18,14,14,14,12,4,26,25,24,24,24,24,21,20,19,13,19,13]
["2021-01-01",{"$f":"VLOOKUP(J853,'Control Panel'!$G$132:$K$171,5,FALSE)","v":"WF-1"},"WF",null,null,null,null,null,null,"F86664",null,8456,39,36,37,38,38,2,24,21,20,20,20,20,25,23,20,18,20,19]
["2021-01-01",{"$f":"VLOOKUP(J854,'Control Panel'!$G$132:$K$171,5,FALSE)","v":"WF-5"},"WF",null,null,null,null,null,null,"F86666",null,14967,45,40,37,42,37,14,53,50,47,46,47,49,46,42,39,32,38,33]
["2021-01-01",{"$f":"VLOOKUP(J855,'Control Panel'!$G$132:$K$171,5,FALSE)","v":"WF-7"},"WF",null,null,null,null,null,null,"F86679",null,6012,28,27,27,27,24,14,27,24,21,20,20,21,27,27,26,22,27,21]
["2021-01-01",{"$f":"VLOOKUP(J856,'Control Panel'!$G$132:$K$171,5,FALSE)","v":"WF-1"},"WF",null,null,null,null,null,null,"F86689",null,4358,21,20,19,20,18,5,22,19,20,19,19,19,25,24,24,23,24,23]
["2021-01-01",{"$f":"VLOOKUP(J857,'Control Panel'!$G$132:$K$171,5,FALSE)","v":"WF-4"},"WF",null,null,null,null,null,null,"F86696",null,6438,26,24,24,25,25,2,14,10,9,9,9,9,15,12,14,11,14,12]
["2021-01-01",{"$f":"VLOOKUP(J858,'Control Panel'!$G$132:$K$171,5,FALSE)","v":"WF-1"},"WF",null,null,null,null,null,null,"F86700",null,3883,11,9,9,10,9,4,9,8,5,6,6,6,12,11,11,11,11,11]
["2021-01-01",{"$f":"VLOOKUP(J859,'Control Panel'!$G$132:$K$171,5,FALSE)","v":"WF-5"},"WF",null,null,null,null,null,null,"F86701",null,3671,14,12,12,12,12,3,13,12,11,11,11,11,9,8,9,7,9,7]
["2021-01-01",{"$f":"VLOOKUP(J860,'Control Panel'!$G$132:$K$171,5,FALSE)","v":"WF-5"},"WF",null,null,null,null,null,null,"F86705",null,3495,7,7,7,7,7,1,6,4,4,4,4,4,3,3,3,3,3,3]
["2021-01-01",{"$f":"VLOOKUP(J861,'Control Panel'!$G$132:$K$171,5,FALSE)","v":"WF-6"},"WF",null,null,null,null,null,null,"F86708",null,2771,7,5,5,6,5,3,7,6,6,6,6,6,7,7,5,2,5,2]
["2021-01-01",{"$f":"VLOOKUP(J862,'Control Panel'!$G$132:$K$171,5,FALSE)","v":"WF-4"},"WF",null,null,null,null,null,null,"F86712",null,3366,10,9,8,9,9,2,9,8,8,8,8,8,12,11,12,8,10,9]
["2021-01-01",{"$f":"VLOOKUP(J863,'Control Panel'!$G$132:$K$171,5,FALSE)","v":"WF-2"},"WF",null,null,null,null,null,null,"Y01291",null,8875,30,26,26,26,25,16,38,35,35,35,34,35,38,37,34,32,36,31]
["2021-01-01",{"$f":"VLOOKUP(J864,'Control Panel'!$G$132:$K$171,5,FALSE)","v":"WF-1"},"WF",null,null,null,null,null,null,"Y01839",null,6395,22,19,19,22,21,11,28,28,25,25,25,25,20,19,17,13,17,13]
["2021-01-01",{"$f":"VLOOKUP(J865,'Control Panel'!$G$132:$K$171,5,FALSE)","v":{"$error":"#N/A"}},null,null,null,null,null,null,null,"total",null,266991,861,743,742,776,729,258,844,768,686,685,683,686,836,771,745,618,743,636]
["2021-02-01",{"$f":"VLOOKUP(J866,'Control Panel'!$G$132:$K$171,5,FALSE)","v":{"$error":"#N/A"}},"Childhood Immunisations Q4",null,"Last Run:",null,"Population Count",280038,null,null,"Search","All Patients","(01) 12 MONTH COHORT","(01.01) DTaP/IPV/Hib 6in1","(01.02) Men B (1st and 2nd)","(01.03) PCV","(01.04) Rotavirus","(01.05) BCG","(02) 24 MONTH COHORT","(02.01) DTaP/IPV/Hib Combined","(02.02) MMR","(02.03) HiB/Men C","(02.04) PCV (Booster)","(02.05) Men B (Booster)","(03) 5 YEAR COHORT","(03.01) DTaP/IPV/Hib Combined","(03.02) MMR (Primary)","(03.03) DTaP/IPV (Booster)","(03.04) HiB/Men C","(03.05) MMR (Booster)"]
["2021-02-01",{"$f":"VLOOKUP(J867,'Control Panel'!$G$132:$K$171,5,FALSE)","v":{"$error":"#N/A"}},null,null,"2021-03-02T11:47:00",null,"Males",143605,null,"Organisation Code"]
["2021-02-01",{"$f":"VLOOKUP(J868,'Control Panel'!$G$132:$K$171,5,FALSE)","v":"WF-6"},"WF",null,"Relative Date:",null,"Females",136433,null,"F86001",null,7821,23,19,19,21,17,6,18,16,12,12,12,13,24,22,21,15,21,17]
["2021-02-01",{"$f":"VLOOKUP(J869,'Control Panel'!$G$132:$K$171,5,FALSE)","v":"WF-1"},"WF",null,"2021-03-01",null,null,null,null,"F86005",null,9094,53,49,47,48,47,2,53,49,46,46,47,47,33,29,29,27,28,27]
["2021-02-01",{"$f":"VLOOKUP(J870,'Control Panel'!$G$132:$K$171,5,FALSE)","v":"WF-7"},"WF",null,null,null,null,null,null,"F86006",null,6606,17,13,13,14,12,1,13,11,9,10,9,10,14,12,12,11,12,11]
["2021-02-01",{"$f":"VLOOKUP(J871,'Control Panel'!$G$132:$K$171,5,FALSE)","v":"WF-3"},"WF",null,null,null,null,null,null,"F86011",null,9715,24,22,22,22,22,10,20,19,13,13,13,13,22,21,22,15,22,16]
["2021-02-01",{"$f":"VLOOKUP(J872,'Control Panel'!$G$132:$K$171,5,FALSE)","v":"WF-7"},"WF",null,null,null,null,null,null,"F86030",null,8151,30,28,28,29,26,19,33,31,30,30,29,30,25,24,25,24,25,25]
["2021-02-01",{"$f":"VLOOKUP(J873,'Control Panel'!$G$132:$K$171,5,FALSE)","v":"WF-4"},"WF",null,null,null,null,null,null,"F86036",null,15745,38,36,36,37,37,10,51,48,45,45,45,44,48,43,43,41,42,40]
["2021-02-01",{"$f":"VLOOKUP(J874,'Control Panel'!$G$132:$K$171,5,FALSE)","v":"WF-3"},"WF",null,null,null,null,null,null,"F86038",null,11695,31,28,28,30,30,4,43,41,38,37,38,37,45,38,40,38,39,40]
["2021-02-01",{"$f":"VLOOKUP(J875,'Control Panel'!$G$132:$K$171,5,FALSE)","v":"WF-4"},"WF",null,null,null,null,null,null,"F86044",null,10388,44,38,38,38,35,13,44,40,35,36,36,35,25,19,16,10,17,10]
["2021-02-01",{"$f":"VLOOKUP(J876,'Control Panel'!$G$132:$K$171,5,FALSE)","v":"WF-5"},"WF",null,null,null,null,null,null,"F86045",null,1997,5,5,5,5,5,3,3,3,3,3,3,3,2,2,2,2,2,2]
["2021-02-01",{"$f":"VLOOKUP(J877,'Control Panel'!$G$132:$K$171,5,FALSE)","v":"WF-7"},"WF",null,null,null,null,null,null,"F86058",null,15976,69,50,48,53,49,20,61,57,41,42,42,42,64,59,57,34,57,35]
["2021-02-01",{"$f":"VLOOKUP(J878,'Control Panel'!$G$132:$K$171,5,FALSE)","v":"WF-7"},"WF",null,null,null,null,null,null,"F86062",null,7321,12,9,10,11,10,7,19,18,9,10,10,10,23,21,19,20,19,20]
["2021-02-01",{"$f":"VLOOKUP(J879,'Control Panel'!$G$132:$K$171,5,FALSE)","v":"WF-2"},"WF",null,null,null,null,null,null,"F86078",null,6981,12,12,12,12,10,5,7,5,4,4,4,4,22,22,22,20,22,18]
["2021-02-01",{"$f":"VLOOKUP(J880,'Control Panel'!$G$132:$K$171,5,FALSE)","v":"WF-6"},"WF",null,null,null,null,null,null,"F86086",null,6243,29,24,24,25,22,13,17,16,17,16,15,16,22,20,19,14,19,14]
["2021-02-01",{"$f":"VLOOKUP(J881,'Control Panel'!$G$132:$K$171,5,FALSE)","v":"WF-4"},"WF",null,null,null,null,null,null,"F86088",null,4813,8,6,5,6,6,5,9,8,5,5,5,5,6,6,6,4,6,4]
["2021-02-01",{"$f":"VLOOKUP(J882,'Control Panel'!$G$132:$K$171,5,FALSE)","v":"WF-6"},"WF",null,null,null,null,null,null,"F86607",null,14388,51,39,48,48,47,28,49,46,42,41,40,41,55,53,51,46,50,51]
["2021-02-01",{"$f":"VLOOKUP(J883,'Control Panel'!$G$132:$K$171,5,FALSE)","v":"WF-2"},"WF",null,null,null,null,null,null,"F86616",null,7473,27,25,25,25,25,3,29,27,26,26,27,26,30,27,23,21,25,22]
["2021-02-01",{"$f":"VLOOKUP(J884,'Control Panel'!$G$132:$K$171,5,FALSE)","v":"WF-5"},"WF",null,null,null,null,null,null,"F86621",null,6143,21,19,19,21,19,13,17,14,13,14,14,13,16,15,15,13,15,12]
["2021-02-01",{"$f":"VLOOKUP(J885,'Control Panel'!$G$132:$K$171,5,FALSE)","v":"WF-5"},"WF",null,null,null,null,null,null,"F86625",null,5992,13,9,9,10,10,3,11,9,9,9,9,9,12,12,12,7,11,7]
["2021-02-01",{"$f":"VLOOKUP(J886,'Control Panel'!$G$132:$K$171,5,FALSE)","v":"WF-1"},"WF",null,null,null,null,null,null,"F86626",null,6470,22,15,14,17,14,1,20,18,15,15,15,15,14,13,13,9,13,9]
["2021-02-01",{"$f":"VLOOKUP(J887,'Control Panel'!$G$132:$K$171,5,FALSE)","v":"WF-2"},"WF",null,null,null,null,null,null,"F86627",null,13491,28,25,25,25,23,1,23,19,18,17,16,16,34,31,30,25,30,25]
["2021-02-01",{"$f":"VLOOKUP(J888,'Control Panel'!$G$132:$K$171,5,FALSE)","v":"WF-6"},"WF",null,null,null,null,null,null,"F86644",null,9988,26,25,24,25,23,11,25,24,25,25,25,24,36,34,30,26,30,31]
["2021-02-01",{"$f":"VLOOKUP(J889,'Control Panel'!$G$132:$K$171,5,FALSE)","v":"WF-4"},"WF",null,null,null,null,null,null,"F86650",null,8062,18,14,14,14,12,4,26,25,24,24,24,24,20,19,18,13,18,13]
["2021-02-01",{"$f":"VLOOKUP(J890,'Control Panel'!$G$132:$K$171,5,FALSE)","v":"WF-1"},"WF",null,null,null,null,null,null,"F86664",null,8491,39,36,37,38,38,2,25,22,21,21,21,21,25,23,20,18,20,19]
["2021-02-01",{"$f":"VLOOKUP(J891,'Control Panel'!$G$132:$K$171,5,FALSE)","v":"WF-5"},"WF",null,null,null,null,null,null,"F86666",null,14919,44,39,36,41,36,14,52,48,46,44,45,47,46,41,38,31,37,32]
["2021-02-01",{"$f":"VLOOKUP(J892,'Control Panel'!$G$132:$K$171,5,FALSE)","v":"WF-7"},"WF",null,null,null,null,null,null,"F86679",null,5986,28,27,27,27,24,14,27,24,21,20,20,21,27,27,26,22,27,21]
["2021-02-01",{"$f":"VLOOKUP(J893,'Control Panel'!$G$132:$K$171,5,FALSE)","v":"WF-1"},"WF",null,null,null,null,null,null,"F86689",null,4368,22,21,20,21,19,5,22,19,20,19,19,19,25,24,24,23,24,23]
["2021-02-01",{"$f":"VLOOKUP(J894,'Control Panel'!$G$132:$K$171,5,FALSE)","v":"WF-4"},"WF",null,null,null,null,null,null,"F86696",null,6488,25,24,24,24,24,2,14,10,9,9,9,9,14,11,13,10,13,11]
["2021-02-01",{"$f":"VLOOKUP(J895,'Control Panel'!$G$132:$K$171,5,FALSE)","v":"WF-1"},"WF",null,null,null,null,null,null,"F86700",null,3884,11,9,9,10,9,4,10,8,5,6,6,6,12,11,11,11,11,11]
["2021-02-01",{"$f":"VLOOKUP(J896,'Control Panel'!$G$132:$K$171,5,FALSE)","v":"WF-5"},"WF",null,null,null,null,null,null,"F86701",null,3702,14,12,12,12,12,3,13,12,11,11,11,11,9,8,9,7,9,7]
["2021-02-01",{"$f":"VLOOKUP(J897,'Control Panel'!$G$132:$K$171,5,FALSE)","v":"WF-5"},"WF",null,null,null,null,null,null,"F86705",null,3475,6,6,6,6,6,1,5,4,4,4,4,4,3,3,3,3,3,3]
["2021-02-01",{"$f":"VLOOKUP(J898,'Control Panel'!$G$132:$K$171,5,FALSE)","v":"WF-6"},"WF",null,null,null,null,null,null,"F86708",null,2759,7,5,5,6,5,3,7,6,6,6,6,6,7,7,5,2,5,2]
["2021-02-01",{"$f":"VLOOKUP(J899,'Control Panel'!$G$132:$K$171,5,FALSE)","v":"WF-4"},"WF",null,null,null,null,null,null,"F86712",null,3343,10,9,8,9,9,2,9,8,8,8,8,8,12,11,12,8,10,9]
["2021-02-01",{"$f":"VLOOKUP(J900,'Control Panel'!$G$132:$K$171,5,FALSE)","v":"WF-2"},"WF",null,null,null,null,null,null,"Y01291",null,8884,29,26,26,26,25,16,40,36,36,35,35,35,39,38,35,33,37,32]
["2021-02-01",{"$f":"VLOOKUP(J901,'Control Panel'!$G$132:$K$171,5,FALSE)","v":"WF-1"},"WF",null,null,null,null,null,null,"Y01839",null,6398,22,19,19,22,21,11,28,28,25,25,25,25,19,18,16,12,16,12]
["2021-02-01",{"$f":"VLOOKUP(J902,'Control Panel'!$G$132:$K$171,5,FALSE)","v":{"$error":"#N/A"}},null,null,null,null,null,null,null,"total",null,267250,858,743,742,778,729,259,843,769,691,688,687,689,830,764,737,615,735,631]
["2021-03-01",{"$f":"VLOOKUP(J903,'Control Panel'!$G$132:$K$171,5,FALSE)","v":{"$error":"#N/A"}},"Childhood Immunisations Q4",null,"Last Run:",null,"Population Count",280010,null,null,"Search","All Patients","(01) 12 MONTH COHORT","(01.01) DTaP/IPV/Hib 6in1","(01.02) Men B (1st and 2nd)","(01.03) PCV","(01.04) Rotavirus","(01.05) BCG","(02) 24 MONTH COHORT","(02.01) DTaP/IPV/Hib Combined","(02.02) MMR","(02.03) HiB/Men C","(02.04) PCV (Booster)","(02.05) Men B (Booster)","(03) 5 YEAR COHORT","(03.01) DTaP/IPV/Hib Combined","(03.02) MMR (Primary)","(03.03) DTaP/IPV (Booster)","(03.04) HiB/Men C","(03.05) MMR (Booster)"]
["2021-03-01",{"$f":"VLOOKUP(J904,'Control Panel'!$G$132:$K$171,5,FALSE)","v":{"$error":"#N/A"}},null,null,"2021-04-07T09:25:00",null,"Males",143660,null,"Organisation Code"]
["2021-03-01",{"$f":"VLOOKUP(J905,'Control Panel'!$G$132:$K$171,5,FALSE)","v":"WF-6"},"WF",null,"Relative Date:",null,"Females",136350,null,"F86001",null,7811,22,18,18,20,16,6,18,16,12,12,12,13,23,21,20,15,20,16]
["2021-03-01",{"$f":"VLOOKUP(J906,'Control Panel'!$G$132:$K$171,5,FALSE)","v":"WF-1"},"WF",null,"2021-04-01",null,null,null,null,"F86005",null,9130,53,49,47,49,48,2,53,49,46,46,47,47,33,29,29,27,28,27]
["2021-03-01",{"$f":"VLOOKUP(J907,'Control Panel'!$G$132:$K$171,5,FALSE)","v":"WF-7"},"WF",null,null,null,null,null,null,"F86006",null,6638,16,12,12,13,11,1,13,11,9,10,9,10,14,12,12,11,12,11]
["2021-03-01",{"$f":"VLOOKUP(J908,'Control Panel'!$G$132:$K$171,5,FALSE)","v":"WF-3"},"WF",null,null,null,null,null,null,"F86011",null,9660,22,21,21,21,21,9,20,19,13,13,13,13,22,21,22,15,22,16]
["2021-03-01",{"$f":"VLOOKUP(J909,'Control Panel'!$G$132:$K$171,5,FALSE)","v":"WF-7"},"WF",null,null,null,null,null,null,"F86030",null,8131,30,28,28,29,25,19,33,31,30,30,29,30,26,25,26,24,26,25]
["2021-03-01",{"$f":"VLOOKUP(J910,'Control Panel'!$G$132:$K$171,5,FALSE)","v":"WF-4"},"WF",null,null,null,null,null,null,"F86036",null,15781,39,36,36,37,37,10,51,48,45,46,46,45,47,42,42,41,41,40]
["2021-03-01",{"$f":"VLOOKUP(J911,'Control Panel'!$G$132:$K$171,5,FALSE)","v":"WF-3"},"WF",null,null,null,null,null,null,"F86038",null,11597,31,29,29,30,30,4,43,41,38,37,38,37,45,38,40,38,39,40]
["2021-03-01",{"$f":"VLOOKUP(J912,'Control Panel'!$G$132:$K$171,5,FALSE)","v":"WF-4"},"WF",null,null,null,null,null,null,"F86044",null,9921,38,35,35,35,32,10,42,38,33,34,34,33,25,19,16,10,17,10]
["2021-03-01",{"$f":"VLOOKUP(J913,'Control Panel'!$G$132:$K$171,5,FALSE)","v":"WF-5"},"WF",null,null,null,null,null,null,"F86045",null,1989,5,5,5,5,5,3,3,3,3,3,3,3,2,2,2,2,2,2]
["2021-03-01",{"$f":"VLOOKUP(J914,'Control Panel'!$G$132:$K$171,5,FALSE)","v":"WF-7"},"WF",null,null,null,null,null,null,"F86058",null,16124,69,50,48,53,49,20,60,56,40,41,41,41,64,59,57,34,57,35]
["2021-03-01",{"$f":"VLOOKUP(J915,'Control Panel'!$G$132:$K$171,5,FALSE)","v":"WF-7"},"WF",null,null,null,null,null,null,"F86062",null,7326,12,9,10,11,10,7,19,18,9,10,10,10,23,21,19,20,19,20]
["2021-03-01",{"$f":"VLOOKUP(J916,'Control Panel'!$G$132:$K$171,5,FALSE)","v":"WF-2"},"WF",null,null,null,null,null,null,"F86078",null,6976,12,12,12,12,10,5,7,5,4,4,4,4,22,22,22,20,22,18]
["2021-03-01",{"$f":"VLOOKUP(J917,'Control Panel'!$G$132:$K$171,5,FALSE)","v":"WF-6"},"WF",null,null,null,null,null,null,"F86086",null,6250,29,25,25,26,23,12,17,16,17,16,15,16,22,20,19,14,19,14]
["2021-03-01",{"$f":"VLOOKUP(J918,'Control Panel'!$G$132:$K$171,5,FALSE)","v":"WF-4"},"WF",null,null,null,null,null,null,"F86088",null,4845,10,8,7,8,8,6,9,8,5,5,5,5,6,6,6,4,6,4]
["2021-03-01",{"$f":"VLOOKUP(J919,'Control Panel'!$G$132:$K$171,5,FALSE)","v":"WF-6"},"WF",null,null,null,null,null,null,"F86607",null,14530,51,39,48,48,47,28,50,46,42,41,40,41,54,52,50,45,49,50]
["2021-03-01",{"$f":"VLOOKUP(J920,'Control Panel'!$G$132:$K$171,5,FALSE)","v":"WF-2"},"WF",null,null,null,null,null,null,"F86616",null,7549,27,25,25,25,25,3,31,28,28,28,29,27,30,27,23,21,25,22]
["2021-03-01",{"$f":"VLOOKUP(J921,'Control Panel'!$G$132:$K$171,5,FALSE)","v":"WF-5"},"WF",null,null,null,null,null,null,"F86621",null,6195,21,19,19,21,19,13,15,12,11,12,12,11,16,15,15,13,15,12]
["2021-03-01",{"$f":"VLOOKUP(J922,'Control Panel'!$G$132:$K$171,5,FALSE)","v":"WF-5"},"WF",null,null,null,null,null,null,"F86625",null,5969,13,9,9,10,10,3,11,9,9,9,9,9,11,11,11,6,10,6]
["2021-03-01",{"$f":"VLOOKUP(J923,'Control Panel'!$G$132:$K$171,5,FALSE)","v":"WF-1"},"WF",null,null,null,null,null,null,"F86626",null,6518,22,15,14,17,14,2,20,18,15,15,15,15,15,14,14,10,14,10]
["2021-03-01",{"$f":"VLOOKUP(J924,'Control Panel'!$G$132:$K$171,5,FALSE)","v":"WF-2"},"WF",null,null,null,null,null,null,"F86627",null,13528,28,25,25,25,23,1,23,19,18,17,16,16,35,31,30,25,30,25]
["2021-03-01",{"$f":"VLOOKUP(J925,'Control Panel'!$G$132:$K$171,5,FALSE)","v":"WF-6"},"WF",null,null,null,null,null,null,"F86644",null,9860,24,23,23,24,22,11,25,24,25,25,25,24,38,36,32,27,32,32]
["2021-03-01",{"$f":"VLOOKUP(J926,'Control Panel'!$G$132:$K$171,5,FALSE)","v":"WF-4"},"WF",null,null,null,null,null,null,"F86650",null,8073,18,14,14,14,12,4,26,25,24,24,24,24,20,19,18,13,18,13]
["2021-03-01",{"$f":"VLOOKUP(J927,'Control Panel'!$G$132:$K$171,5,FALSE)","v":"WF-1"},"WF",null,null,null,null,null,null,"F86664",null,8468,39,36,37,38,38,2,25,22,21,21,21,21,25,23,20,18,20,19]
["2021-03-01",{"$f":"VLOOKUP(J928,'Control Panel'!$G$132:$K$171,5,FALSE)","v":"WF-5"},"WF",null,null,null,null,null,null,"F86666",null,14898,44,39,36,41,36,14,50,46,44,42,43,45,47,41,38,31,37,32]
["2021-03-01",{"$f":"VLOOKUP(J929,'Control Panel'!$G$132:$K$171,5,FALSE)","v":"WF-7"},"WF",null,null,null,null,null,null,"F86679",null,5991,28,27,27,27,24,14,27,24,21,20,20,21,27,27,26,22,27,21]
["2021-03-01",{"$f":"VLOOKUP(J930,'Control Panel'!$G$132:$K$171,5,FALSE)","v":"WF-1"},"WF",null,null,null,null,null,null,"F86689",null,4366,23,21,20,21,19,5,21,18,19,18,18,18,25,24,24,23,24,23]
["2021-03-01",{"$f":"VLOOKUP(J931,'Control Panel'!$G$132:$K$171,5,FALSE)","v":"WF-4"},"WF",null,null,null,null,null,null,"F86696",null,6577,24,23,23,23,23,2,15,11,10,9,9,9,14,11,13,10,13,11]
["2021-03-01",{"$f":"VLOOKUP(J932,'Control Panel'!$G$132:$K$171,5,FALSE)","v":"WF-1"},"WF",null,null,null,null,null,null,"F86700",null,3898,11,9,9,10,9,4,10,9,5,6,6,6,12,11,11,11,11,11]
["2021-03-01",{"$f":"VLOOKUP(J933,'Control Panel'!$G$132:$K$171,5,FALSE)","v":"WF-5"},"WF",null,null,null,null,null,null,"F86701",null,3717,13,11,11,11,11,3,13,12,11,11,11,11,9,8,9,7,9,7]
["2021-03-01",{"$f":"VLOOKUP(J934,'Control Panel'!$G$132:$K$171,5,FALSE)","v":"WF-5"},"WF",null,null,null,null,null,null,"F86705",null,3531,6,6,6,6,6,2,5,4,4,4,4,4,3,3,3,3,3,3]
["2021-03-01",{"$f":"VLOOKUP(J935,'Control Panel'!$G$132:$K$171,5,FALSE)","v":"WF-6"},"WF",null,null,null,null,null,null,"F86708",null,2768,7,5,5,6,5,3,7,6,6,6,6,6,7,7,5,2,5,2]
["2021-03-01",{"$f":"VLOOKUP(J936,'Control Panel'!$G$132:$K$171,5,FALSE)","v":"WF-4"},"WF",null,null,null,null,null,null,"F86712",null,3330,10,9,8,9,9,2,9,9,9,9,9,8,12,11,12,8,10,9]
["2021-03-01",{"$f":"VLOOKUP(J937,'Control Panel'!$G$132:$K$171,5,FALSE)","v":"WF-2"},"WF",null,null,null,null,null,null,"Y01291",null,8929,29,26,26,26,25,16,40,36,36,35,35,35,40,39,36,34,38,33]
["2021-03-01",{"$f":"VLOOKUP(J938,'Control Panel'!$G$132:$K$171,5,FALSE)","v":"WF-1"},"WF",null,null,null,null,null,null,"Y01839",null,6401,22,19,19,22,21,11,28,28,25,25,25,25,19,18,16,12,16,12]
["2021-03-01",{"$f":"VLOOKUP(J939,'Control Panel'!$G$132:$K$171,5,FALSE)","v":{"$error":"#N/A"}},null,null,null,null,null,null,null,"total",null,267275,848,737,737,773,723,257,839,765,687,684,683,833,765,738,616,736,631,683]
["2021-04-01",{"$f":"VLOOKUP(J940,'Control Panel'!$G$132:$K$171,5,FALSE)","v":{"$error":"#N/A"}},"Childhood Immunisations Q1",null,"Last Run:",null,"Population Count",280136,null,null,"Search","All Patients","(01) 12 MONTH COHORT","(01.01) DTaP/IPV/Hib/HepB","(01.02) Men B (1st and 2nd)","(01.03) PCV","(01.04) Rotavirus","(01.05) BCG","(02) 24 MONTH COHORT","(02.01) DTaP/IPV/Hib or DTaP/IPV/Hib/HepB","(02.02) MMR","(02.03) HiB/Men C","(02.04) PCV (Booster)","(02.05) Men B (Booster)","(03) 5 YEAR COHORT","(03.01) DTaP/IPV/Hib or DTaP/IPV/Hib/HepB","(03.02) MMR (Primary)","(03.03) DTaP/IPV (Booster)","(03.04) HiB/Men C","(03.05) MMR (Booster)"]
["2021-04-01",{"$f":"VLOOKUP(J941,'Control Panel'!$G$132:$K$171,5,FALSE)","v":{"$error":"#N/A"}},null,null,"2021-05-10T16:30:00",null,"Males",143724,null,"Organisation Code"]
["2021-04-01",{"$f":"VLOOKUP(J942,'Control Panel'!$G$132:$K$171,5,FALSE)","v":"WF-6"},"WF",null,"Relative Date:",null,"Females",136412,null,"F86001",null,7787,12,6,6,10,10,8,19,15,15,16,15,16,28,24,26,18,27,18]
["2021-04-01",{"$f":"VLOOKUP(J943,'Control Panel'!$G$132:$K$171,5,FALSE)","v":"WF-1"},"WF",null,"2021-05-01",null,null,null,null,"F86005",null,9212,47,38,38,42,42,7,38,36,32,32,32,31,43,40,40,36,40,36]
["2021-04-01",{"$f":"VLOOKUP(J944,'Control Panel'!$G$132:$K$171,5,FALSE)","v":"WF-7"},"WF",null,null,null,null,null,null,"F86006",null,6668,18,14,14,16,14,3,23,22,20,19,21,21,21,19,18,17,20,18]
["2021-04-01",{"$f":"VLOOKUP(J945,'Control Panel'!$G$132:$K$171,5,FALSE)","v":"WF-3"},"WF",null,null,null,null,null,null,"F86011",null,9644,18,15,16,16,16,0,28,22,23,23,23,21,24,23,23,16,22,20]
["2021-04-01",{"$f":"VLOOKUP(J946,'Control Panel'!$G$132:$K$171,5,FALSE)","v":"WF-7"},"WF",null,null,null,null,null,null,"F86030",null,8124,39,36,37,37,30,27,34,33,31,31,31,31,22,21,21,20,21,20]
["2021-04-01",{"$f":"VLOOKUP(J947,'Control Panel'!$G$132:$K$171,5,FALSE)","v":"WF-4"},"WF",null,null,null,null,null,null,"F86036",null,15692,52,45,45,46,46,16,43,39,36,36,37,35,57,54,50,41,49,42]
["2021-04-01",{"$f":"VLOOKUP(J948,'Control Panel'!$G$132:$K$171,5,FALSE)","v":"WF-3"},"WF",null,null,null,null,null,null,"F86038",null,11563,29,27,27,27,26,1,46,40,36,36,36,36,42,35,36,37,37,38]
["2021-04-01",{"$f":"VLOOKUP(J949,'Control Panel'!$G$132:$K$171,5,FALSE)","v":"WF-4"},"WF",null,null,null,null,null,null,"F86044",null,9863,42,32,32,33,31,4,45,42,34,36,36,36,33,27,26,20,27,21]
["2021-04-01",{"$f":"VLOOKUP(J950,'Control Panel'!$G$132:$K$171,5,FALSE)","v":"WF-5"},"WF",null,null,null,null,null,null,"F86045",null,2017,5,5,5,5,4,2,5,5,4,5,4,4,3,3,3,3,3,3]
["2021-04-01",{"$f":"VLOOKUP(J951,'Control Panel'!$G$132:$K$171,5,FALSE)","v":"WF-7"},"WF",null,null,null,null,null,null,"F86058",null,16045,61,46,43,49,46,23,48,40,31,31,30,31,59,49,47,25,48,26]
["2021-04-01",{"$f":"VLOOKUP(J952,'Control Panel'!$G$132:$K$171,5,FALSE)","v":"WF-7"},"WF",null,null,null,null,null,null,"F86062",null,7313,20,17,16,17,18,5,22,22,14,14,14,15,24,20,20,11,20,12]
["2021-04-01",{"$f":"VLOOKUP(J953,'Control Panel'!$G$132:$K$171,5,FALSE)","v":"WF-2"},"WF",null,null,null,null,null,null,"F86078",null,6945,16,13,13,13,12,3,11,8,8,8,8,8,10,9,9,9,9,9]
["2021-04-01",{"$f":"VLOOKUP(J954,'Control Panel'!$G$132:$K$171,5,FALSE)","v":"WF-6"},"WF",null,null,null,null,null,null,"F86086",null,6207,16,12,12,12,12,6,27,24,25,25,25,24,22,18,20,13,20,16]
["2021-04-01",{"$f":"VLOOKUP(J955,'Control Panel'!$G$132:$K$171,5,FALSE)","v":"WF-4"},"WF",null,null,null,null,null,null,"F86088",null,4832,10,7,7,8,8,6,14,13,11,11,11,11,15,9,8,6,7,6]
["2021-04-01",{"$f":"VLOOKUP(J956,'Control Panel'!$G$132:$K$171,5,FALSE)","v":"WF-6"},"WF",null,null,null,null,null,null,"F86607",null,14672,43,41,41,41,40,16,42,37,32,32,32,32,53,51,50,50,51,50]
["2021-04-01",{"$f":"VLOOKUP(J957,'Control Panel'!$G$132:$K$171,5,FALSE)","v":"WF-2"},"WF",null,null,null,null,null,null,"F86616",null,7584,29,28,28,28,27,5,46,42,39,40,40,41,23,22,22,16,21,17]
["2021-04-01",{"$f":"VLOOKUP(J958,'Control Panel'!$G$132:$K$171,5,FALSE)","v":"WF-5"},"WF",null,null,null,null,null,null,"F86621",null,6200,24,24,24,24,24,17,22,22,21,21,21,21,19,19,19,17,19,17]
["2021-04-01",{"$f":"VLOOKUP(J959,'Control Panel'!$G$132:$K$171,5,FALSE)","v":"WF-5"},"WF",null,null,null,null,null,null,"F86625",null,5947,20,14,14,14,14,4,19,16,15,15,15,15,16,14,13,5,13,5]
["2021-04-01",{"$f":"VLOOKUP(J960,'Control Panel'!$G$132:$K$171,5,FALSE)","v":"WF-1"},"WF",null,null,null,null,null,null,"F86626",null,6520,29,25,25,26,26,9,19,17,15,15,14,15,16,13,14,10,14,10]
["2021-04-01",{"$f":"VLOOKUP(J961,'Control Panel'!$G$132:$K$171,5,FALSE)","v":"WF-2"},"WF",null,null,null,null,null,null,"F86627",null,13430,30,24,24,25,23,6,39,35,32,33,32,33,35,34,31,29,32,29]
["2021-04-01",{"$f":"VLOOKUP(J962,'Control Panel'!$G$132:$K$171,5,FALSE)","v":"WF-6"},"WF",null,null,null,null,null,null,"F86644",null,9915,21,18,18,20,20,8,34,31,30,30,30,31,33,29,26,18,27,29]
["2021-04-01",{"$f":"VLOOKUP(J963,'Control Panel'!$G$132:$K$171,5,FALSE)","v":"WF-4"},"WF",null,null,null,null,null,null,"F86650",null,8079,23,17,17,18,15,9,26,21,18,19,19,19,24,21,20,15,20,14]
["2021-04-01",{"$f":"VLOOKUP(J964,'Control Panel'!$G$132:$K$171,5,FALSE)","v":"WF-1"},"WF",null,null,null,null,null,null,"F86664",null,8440,28,26,26,26,26,11,28,24,23,23,24,23,25,23,23,18,22,19]
["2021-04-01",{"$f":"VLOOKUP(J965,'Control Panel'!$G$132:$K$171,5,FALSE)","v":"WF-5"},"WF",null,null,null,null,null,null,"F86666",null,14833,44,39,38,37,37,15,55,52,48,49,49,52,42,37,37,31,36,32]
["2021-04-01",{"$f":"VLOOKUP(J966,'Control Panel'!$G$132:$K$171,5,FALSE)","v":"WF-7"},"WF",null,null,null,null,null,null,"F86679",null,6006,23,15,15,18,17,13,35,33,29,29,28,29,33,29,27,26,28,24]
["2021-04-01",{"$f":"VLOOKUP(J967,'Control Panel'!$G$132:$K$171,5,FALSE)","v":"WF-1"},"WF",null,null,null,null,null,null,"F86689",null,4356,22,21,21,20,21,9,32,29,28,28,28,28,16,15,16,15,15,15]
["2021-04-01",{"$f":"VLOOKUP(J968,'Control Panel'!$G$132:$K$171,5,FALSE)","v":"WF-4"},"WF",null,null,null,null,null,null,"F86696",null,6626,26,20,20,23,23,4,20,19,19,18,18,18,19,14,14,11,14,10]
["2021-04-01",{"$f":"VLOOKUP(J969,'Control Panel'!$G$132:$K$171,5,FALSE)","v":"WF-1"},"WF",null,null,null,null,null,null,"F86700",null,3868,13,11,12,12,11,2,15,12,11,11,11,12,13,11,11,10,12,10]
["2021-04-01",{"$f":"VLOOKUP(J970,'Control Panel'!$G$132:$K$171,5,FALSE)","v":"WF-5"},"WF",null,null,null,null,null,null,"F86701",null,3730,11,8,8,9,9,1,5,4,4,4,4,4,9,8,6,5,7,5]
["2021-04-01",{"$f":"VLOOKUP(J971,'Control Panel'!$G$132:$K$171,5,FALSE)","v":"WF-5"},"WF",null,null,null,null,null,null,"F86705",null,3569,9,9,9,9,9,7,7,7,6,7,7,7,10,9,9,6,9,7]
["2021-04-01",{"$f":"VLOOKUP(J972,'Control Panel'!$G$132:$K$171,5,FALSE)","v":"WF-6"},"WF",null,null,null,null,null,null,"F86708",null,2777,4,1,1,2,1,0,5,4,4,4,4,4,5,5,5,4,5,4]
["2021-04-01",{"$f":"VLOOKUP(J973,'Control Panel'!$G$132:$K$171,5,FALSE)","v":"WF-4"},"WF",null,null,null,null,null,null,"F86712",null,3273,5,5,5,5,5,2,7,7,7,7,7,7,11,11,11,10,11,10]
["2021-04-01",{"$f":"VLOOKUP(J974,'Control Panel'!$G$132:$K$171,5,FALSE)","v":"WF-2"},"WF",null,null,null,null,null,null,"Y01291",null,8948,34,31,31,32,31,23,28,28,26,27,27,27,29,27,25,24,25,24]
["2021-04-01",{"$f":"VLOOKUP(J975,'Control Panel'!$G$132:$K$171,5,FALSE)","v":"WF-1"},"WF",null,null,null,null,null,null,"Y01839",null,6361,24,20,21,21,20,8,22,22,19,19,19,19,20,20,18,14,20,14]
["2021-04-01",{"$f":"VLOOKUP(J976,'Control Panel'!$G$132:$K$171,5,FALSE)","v":{"$error":"#N/A"}},null,null,null,null,null,null,null,"Total",null,267046,847,710,709,741,714,280,909,823,746,754,752,757,854,763,744,606,751,630]
["2021-05-01",{"$f":"VLOOKUP(J977,'Control Panel'!$G$132:$K$171,5,FALSE)","v":{"$error":"#N/A"}},"Childhood Immunisations Q1",null,"Last Run:",null,"Population Count",280855,null,null,"Search","All Patients","(01) 12 MONTH COHORT","(01.01) DTaP/IPV/Hib/HepB","(01.02) Men B (1st and 2nd)","(01.03) PCV","(01.04) Rotavirus","(01.05) BCG","(02) 24 MONTH COHORT","(02.01) DTaP/IPV/Hib or DTaP/IPV/Hib/HepB","(02.02) MMR","(02.03) HiB/Men C","(02.04) PCV (Booster)","(02.05) Men B (Booster)","(03) 5 YEAR COHORT","(03.01) DTaP/IPV/Hib or DTaP/IPV/Hib/HepB","(03.02) MMR (Primary)","(03.03) DTaP/IPV (Booster)","(03.04) HiB/Men C","(03.05) MMR (Booster)"]
["2021-05-01",{"$f":"VLOOKUP(J978,'Control Panel'!$G$132:$K$171,5,FALSE)","v":{"$error":"#N/A"}},null,null,"2021-06-02T09:37:00",null,"Males",144109,null,"Organisation Code"]
["2021-05-01",{"$f":"VLOOKUP(J979,'Control Panel'!$G$132:$K$171,5,FALSE)","v":"WF-6"},"WF",null,"Relative Date:",null,"Females",136746,null,"F86001",null,7765,11,6,6,9,9,7,19,15,15,16,15,16,28,24,26,18,27,18]
["2021-05-01",{"$f":"VLOOKUP(J980,'Control Panel'!$G$132:$K$171,5,FALSE)","v":"WF-1"},"WF",null,"2021-06-01",null,null,null,null,"F86005",null,9280,47,38,38,42,42,7,38,36,32,32,32,31,42,39,39,35,39,35]
["2021-05-01",{"$f":"VLOOKUP(J981,'Control Panel'!$G$132:$K$171,5,FALSE)","v":"WF-7"},"WF",null,null,null,null,null,null,"F86006",null,6710,18,14,15,17,15,3,23,22,20,19,21,21,22,19,18,18,21,18]
["2021-05-01",{"$f":"VLOOKUP(J982,'Control Panel'!$G$132:$K$171,5,FALSE)","v":"WF-3"},"WF",null,null,null,null,null,null,"F86011",null,9607,18,15,16,16,16,0,29,22,24,24,24,21,24,23,23,16,22,20]
["2021-05-01",{"$f":"VLOOKUP(J983,'Control Panel'!$G$132:$K$171,5,FALSE)","v":"WF-7"},"WF",null,null,null,null,null,null,"F86030",null,8094,39,37,37,37,30,27,33,33,31,31,31,31,20,19,19,18,19,18]
["2021-05-01",{"$f":"VLOOKUP(J984,'Control Panel'!$G$132:$K$171,5,FALSE)","v":"WF-4"},"WF",null,null,null,null,null,null,"F86036",null,15630,51,45,44,46,46,17,43,39,36,36,37,35,57,54,50,41,49,42]
["2021-05-01",{"$f":"VLOOKUP(J985,'Control Panel'!$G$132:$K$171,5,FALSE)","v":"WF-3"},"WF",null,null,null,null,null,null,"F86038",null,11588,29,27,27,27,26,1,46,40,37,37,37,37,41,34,35,36,36,37]
["2021-05-01",{"$f":"VLOOKUP(J986,'Control Panel'!$G$132:$K$171,5,FALSE)","v":"WF-4"},"WF",null,null,null,null,null,null,"F86044",null,9934,41,31,31,32,30,4,46,42,34,36,36,36,33,27,26,20,27,21]
["2021-05-01",{"$f":"VLOOKUP(J987,'Control Panel'!$G$132:$K$171,5,FALSE)","v":"WF-5"},"WF",null,null,null,null,null,null,"F86045",null,2005,5,5,5,5,4,2,3,3,2,3,3,2,3,3,3,3,3,3]
["2021-05-01",{"$f":"VLOOKUP(J988,'Control Panel'!$G$132:$K$171,5,FALSE)","v":"WF-7"},"WF",null,null,null,null,null,null,"F86058",null,16118,61,47,44,49,46,23,48,40,31,31,30,31,59,49,47,25,48,26]
["2021-05-01",{"$f":"VLOOKUP(J989,'Control Panel'!$G$132:$K$171,5,FALSE)","v":"WF-7"},"WF",null,null,null,null,null,null,"F86062",null,7341,21,18,17,18,19,6,21,21,13,13,13,14,24,20,20,11,20,12]
["2021-05-01",{"$f":"VLOOKUP(J990,'Control Panel'!$G$132:$K$171,5,FALSE)","v":"WF-2"},"WF",null,null,null,null,null,null,"F86078",null,6966,16,13,13,13,12,3,11,8,8,8,8,8,10,9,9,9,9,9]
["2021-05-01",{"$f":"VLOOKUP(J991,'Control Panel'!$G$132:$K$171,5,FALSE)","v":"WF-6"},"WF",null,null,null,null,null,null,"F86086",null,6180,16,12,12,12,12,6,27,24,25,25,25,24,22,18,20,13,20,16]
["2021-05-01",{"$f":"VLOOKUP(J992,'Control Panel'!$G$132:$K$171,5,FALSE)","v":"WF-4"},"WF",null,null,null,null,null,null,"F86088",null,4848,10,7,7,8,8,6,14,13,11,11,11,11,14,8,7,5,6,5]
["2021-05-01",{"$f":"VLOOKUP(J993,'Control Panel'!$G$132:$K$171,5,FALSE)","v":"WF-6"},"WF",null,null,null,null,null,null,"F86607",null,14803,44,41,42,42,41,16,44,37,32,32,32,32,54,52,51,51,52,51]
["2021-05-01",{"$f":"VLOOKUP(J994,'Control Panel'!$G$132:$K$171,5,FALSE)","v":"WF-2"},"WF",null,null,null,null,null,null,"F86616",null,7642,30,29,29,29,28,5,45,41,38,39,39,40,23,22,22,17,21,18]
["2021-05-01",{"$f":"VLOOKUP(J995,'Control Panel'!$G$132:$K$171,5,FALSE)","v":"WF-5"},"WF",null,null,null,null,null,null,"F86621",null,6237,24,24,24,24,24,17,23,23,21,22,22,22,19,19,19,17,19,17]
["2021-05-01",{"$f":"VLOOKUP(J996,'Control Panel'!$G$132:$K$171,5,FALSE)","v":"WF-5"},"WF",null,null,null,null,null,null,"F86625",null,5935,19,13,13,13,13,4,19,16,15,16,16,15,16,14,13,5,13,5]
["2021-05-01",{"$f":"VLOOKUP(J997,'Control Panel'!$G$132:$K$171,5,FALSE)","v":"WF-1"},"WF",null,null,null,null,null,null,"F86626",null,6577,29,25,25,26,26,9,21,18,16,16,15,16,16,13,14,10,14,10]
["2021-05-01",{"$f":"VLOOKUP(J998,'Control Panel'!$G$132:$K$171,5,FALSE)","v":"WF-2"},"WF",null,null,null,null,null,null,"F86627",null,13405,30,23,23,24,22,6,39,35,32,33,32,33,36,35,32,29,33,29]
["2021-05-01",{"$f":"VLOOKUP(J999,'Control Panel'!$G$132:$K$171,5,FALSE)","v":"WF-6"},"WF",null,null,null,null,null,null,"F86644",null,9921,21,18,18,20,20,8,34,31,30,30,30,31,33,29,26,18,27,29]
["2021-05-01",{"$f":"VLOOKUP(J1000,'Control Panel'!$G$132:$K$171,5,FALSE)","v":"WF-4"},"WF",null,null,null,null,null,null,"F86650",null,8062,23,17,17,18,15,9,26,21,18,19,19,19,24,21,20,15,20,14]
["2021-05-01",{"$f":"VLOOKUP(J1001,'Control Panel'!$G$132:$K$171,5,FALSE)","v":"WF-1"},"WF",null,null,null,null,null,null,"F86664",null,8453,28,26,26,26,26,11,28,24,23,23,24,23,25,23,23,18,22,19]
["2021-05-01",{"$f":"VLOOKUP(J1002,'Control Panel'!$G$132:$K$171,5,FALSE)","v":"WF-5"},"WF",null,null,null,null,null,null,"F86666",null,14830,44,39,38,37,37,15,55,51,48,49,49,51,41,36,36,30,35,31]
["2021-05-01",{"$f":"VLOOKUP(J1003,'Control Panel'!$G$132:$K$171,5,FALSE)","v":"WF-7"},"WF",null,null,null,null,null,null,"F86679",null,6045,23,15,15,18,17,13,34,32,28,28,27,28,33,29,27,26,28,24]
["2021-05-01",{"$f":"VLOOKUP(J1004,'Control Panel'!$G$132:$K$171,5,FALSE)","v":"WF-1"},"WF",null,null,null,null,null,null,"F86689",null,4357,22,21,21,20,21,9,32,30,29,29,29,29,16,15,16,15,15,15]
["2021-05-01",{"$f":"VLOOKUP(J1005,'Control Panel'!$G$132:$K$171,5,FALSE)","v":"WF-4"},"WF",null,null,null,null,null,null,"F86696",null,6751,26,20,20,23,23,4,21,20,19,18,18,19,19,14,14,11,14,10]
["2021-05-01",{"$f":"VLOOKUP(J1006,'Control Panel'!$G$132:$K$171,5,FALSE)","v":"WF-1"},"WF",null,null,null,null,null,null,"F86700",null,3865,13,11,12,12,11,2,14,11,10,10,10,11,13,11,11,10,12,10]
["2021-05-01",{"$f":"VLOOKUP(J1007,'Control Panel'!$G$132:$K$171,5,FALSE)","v":"WF-5"},"WF",null,null,null,null,null,null,"F86701",null,3727,11,8,8,9,9,1,5,4,4,4,4,4,9,8,6,5,7,5]
["2021-05-01",{"$f":"VLOOKUP(J1008,'Control Panel'!$G$132:$K$171,5,FALSE)","v":"WF-5"},"WF",null,null,null,null,null,null,"F86705",null,3594,9,9,9,9,9,9,7,7,6,7,7,7,10,9,9,6,9,7]
["2021-05-01",{"$f":"VLOOKUP(J1009,'Control Panel'!$G$132:$K$171,5,FALSE)","v":"WF-6"},"WF",null,null,null,null,null,null,"F86708",null,2794,4,1,2,2,1,0,5,4,4,4,4,4,5,5,5,5,5,5]
["2021-05-01",{"$f":"VLOOKUP(J1010,'Control Panel'!$G$132:$K$171,5,FALSE)","v":"WF-4"},"WF",null,null,null,null,null,null,"F86712",null,3310,5,5,5,5,5,2,7,7,7,7,7,7,11,11,11,10,11,10]
["2021-05-01",{"$f":"VLOOKUP(J1011,'Control Panel'!$G$132:$K$171,5,FALSE)","v":"WF-2"},"WF",null,null,null,null,null,null,"Y01291",null,9029,34,30,30,32,31,24,28,28,26,27,27,27,29,27,25,24,25,24]
["2021-05-01",{"$f":"VLOOKUP(J1012,'Control Panel'!$G$132:$K$171,5,FALSE)","v":"WF-1"},"WF",null,null,null,null,null,null,"Y01839",null,6382,24,20,21,21,20,8,22,22,19,19,19,19,20,20,18,14,20,14]
["2021-05-01",{"$f":"VLOOKUP(J1013,'Control Panel'!$G$132:$K$171,5,FALSE)","v":{"$error":"#N/A"}},null,null,null,null,null,null,null,"Total",null,267785,846,710,710,741,714,284,910,820,744,754,753,755,851,759,740,604,748,627]
["2021-06-01",{"$f":"VLOOKUP(J1014,'Control Panel'!$G$132:$K$171,5,FALSE)","v":{"$error":"#N/A"}},"Childhood Immunisations Q1",null,"Last Run:",null,"Population Count",281199,null,null,"Search","All Patients","(01) 12 MONTH COHORT","(01.01) DTaP/IPV/Hib/HepB","(01.02) Men B (1st and 2nd)","(01.03) PCV","(01.04) Rotavirus","(01.05) BCG","(02) 24 MONTH COHORT","(02.01) DTaP/IPV/Hib or DTaP/IPV/Hib/HepB","(02.02) MMR","(02.03) HiB/Men C","(02.04) PCV (Booster)","(02.05) Men B (Booster)","(03) 5 YEAR COHORT","(03.01) DTaP/IPV/Hib or DTaP/IPV/Hib/HepB","(03.02) MMR (Primary)","(03.03) DTaP/IPV (Booster)","(03.04) HiB/Men C","(03.05) MMR (Booster)"]
["2021-06-01",{"$f":"VLOOKUP(J1015,'Control Panel'!$G$132:$K$171,5,FALSE)","v":{"$error":"#N/A"}},null,null,"2021-07-02T09:35:00",null,"Males",144411,null,"Organisation Code"]
["2021-06-01",{"$f":"VLOOKUP(J1016,'Control Panel'!$G$132:$K$171,5,FALSE)","v":"WF-6"},"WF",null,"Relative Date:",null,"Females",136788,null,"F86001",null,7756,12,6,6,10,10,7,19,15,15,16,15,16,28,24,26,18,27,18]
["2021-06-01",{"$f":"VLOOKUP(J1017,'Control Panel'!$G$132:$K$171,5,FALSE)","v":"WF-1"},"WF",null,"2021-07-01",null,null,null,null,"F86005",null,9320,46,38,38,42,41,7,37,35,32,31,32,30,41,38,38,34,38,34]
["2021-06-01",{"$f":"VLOOKUP(J1018,'Control Panel'!$G$132:$K$171,5,FALSE)","v":"WF-7"},"WF",null,null,null,null,null,null,"F86006",null,6689,17,13,14,16,14,3,23,22,20,19,21,21,22,19,18,18,21,18]
["2021-06-01",{"$f":"VLOOKUP(J1019,'Control Panel'!$G$132:$K$171,5,FALSE)","v":"WF-3"},"WF",null,null,null,null,null,null,"F86011",null,9612,18,15,16,16,16,0,30,23,24,24,24,21,24,23,23,16,22,20]
["2021-06-01",{"$f":"VLOOKUP(J1020,'Control Panel'!$G$132:$K$171,5,FALSE)","v":"WF-7"},"WF",null,null,null,null,null,null,"F86030",null,8111,39,37,37,37,30,27,33,33,31,31,31,31,20,19,19,18,19,18]
["2021-06-01",{"$f":"VLOOKUP(J1021,'Control Panel'!$G$132:$K$171,5,FALSE)","v":"WF-4"},"WF",null,null,null,null,null,null,"F86036",null,15454,50,44,43,45,45,17,43,39,36,36,37,35,57,54,50,41,49,42]
["2021-06-01",{"$f":"VLOOKUP(J1022,'Control Panel'!$G$132:$K$171,5,FALSE)","v":"WF-3"},"WF",null,null,null,null,null,null,"F86038",null,11571,29,27,27,27,26,1,46,40,37,37,37,37,41,35,36,36,36,37]
["2021-06-01",{"$f":"VLOOKUP(J1023,'Control Panel'!$G$132:$K$171,5,FALSE)","v":"WF-4"},"WF",null,null,null,null,null,null,"F86044",null,9921,41,31,31,32,30,4,45,41,33,35,35,35,33,27,26,20,27,22]
["2021-06-01",{"$f":"VLOOKUP(J1024,'Control Panel'!$G$132:$K$171,5,FALSE)","v":"WF-5"},"WF",null,null,null,null,null,null,"F86045",null,2017,5,5,5,5,4,2,3,3,2,3,3,2,3,3,3,3,3,3]
["2021-06-01",{"$f":"VLOOKUP(J1025,'Control Panel'!$G$132:$K$171,5,FALSE)","v":"WF-7"},"WF",null,null,null,null,null,null,"F86058",null,16369,61,47,44,49,46,23,49,41,32,32,31,32,59,49,47,25,48,26]
["2021-06-01",{"$f":"VLOOKUP(J1026,'Control Panel'!$G$132:$K$171,5,FALSE)","v":"WF-7"},"WF",null,null,null,null,null,null,"F86062",null,7329,21,18,17,18,19,6,21,21,13,13,13,14,24,20,20,11,20,12]
["2021-06-01",{"$f":"VLOOKUP(J1027,'Control Panel'!$G$132:$K$171,5,FALSE)","v":"WF-2"},"WF",null,null,null,null,null,null,"F86078",null,6911,16,13,13,13,12,3,11,8,8,8,8,8,9,9,9,9,9,9]
["2021-06-01",{"$f":"VLOOKUP(J1028,'Control Panel'!$G$132:$K$171,5,FALSE)","v":"WF-6"},"WF",null,null,null,null,null,null,"F86086",null,6163,16,12,12,12,12,6,24,21,22,22,22,21,22,18,20,13,20,16]
["2021-06-01",{"$f":"VLOOKUP(J1029,'Control Panel'!$G$132:$K$171,5,FALSE)","v":"WF-4"},"WF",null,null,null,null,null,null,"F86088",null,4871,10,7,7,8,8,6,14,13,11,11,11,11,14,8,7,5,6,5]
["2021-06-01",{"$f":"VLOOKUP(J1030,'Control Panel'!$G$132:$K$171,5,FALSE)","v":"WF-6"},"WF",null,null,null,null,null,null,"F86607",null,14915,45,42,43,43,42,16,45,38,33,33,33,33,54,52,51,51,52,51]
["2021-06-01",{"$f":"VLOOKUP(J1031,'Control Panel'!$G$132:$K$171,5,FALSE)","v":"WF-2"},"WF",null,null,null,null,null,null,"F86616",null,7699,30,29,29,29,28,5,45,41,38,39,39,40,24,22,22,17,21,18]
["2021-06-01",{"$f":"VLOOKUP(J1032,'Control Panel'!$G$132:$K$171,5,FALSE)","v":"WF-5"},"WF",null,null,null,null,null,null,"F86621",null,6282,26,25,26,26,26,18,22,22,20,21,21,21,19,19,19,17,19,17]
["2021-06-01",{"$f":"VLOOKUP(J1033,'Control Panel'!$G$132:$K$171,5,FALSE)","v":"WF-5"},"WF",null,null,null,null,null,null,"F86625",null,5921,19,13,13,13,13,4,19,16,15,16,16,15,16,14,13,5,13,5]
["2021-06-01",{"$f":"VLOOKUP(J1034,'Control Panel'!$G$132:$K$171,5,FALSE)","v":"WF-1"},"WF",null,null,null,null,null,null,"F86626",null,6678,29,25,25,26,26,9,21,17,15,15,15,15,16,13,14,10,14,10]
["2021-06-01",{"$f":"VLOOKUP(J1035,'Control Panel'!$G$132:$K$171,5,FALSE)","v":"WF-2"},"WF",null,null,null,null,null,null,"F86627",null,13427,29,22,22,23,21,6,40,36,33,34,34,34,36,35,32,29,33,29]
["2021-06-01",{"$f":"VLOOKUP(J1036,'Control Panel'!$G$132:$K$171,5,FALSE)","v":"WF-6"},"WF",null,null,null,null,null,null,"F86644",null,9973,21,18,18,20,20,8,34,31,30,30,30,31,33,29,26,18,27,29]
["2021-06-01",{"$f":"VLOOKUP(J1037,'Control Panel'!$G$132:$K$171,5,FALSE)","v":"WF-4"},"WF",null,null,null,null,null,null,"F86650",null,8053,24,18,18,19,16,10,23,19,17,17,17,17,25,21,20,15,20,14]
["2021-06-01",{"$f":"VLOOKUP(J1038,'Control Panel'!$G$132:$K$171,5,FALSE)","v":"WF-1"},"WF",null,null,null,null,null,null,"F86664",null,8445,28,27,27,27,27,11,28,24,23,23,24,23,26,23,23,18,22,19]
["2021-06-01",{"$f":"VLOOKUP(J1039,'Control Panel'!$G$132:$K$171,5,FALSE)","v":"WF-5"},"WF",null,null,null,null,null,null,"F86666",null,14831,44,39,38,37,37,15,55,51,48,49,49,51,40,35,35,29,34,30]
["2021-06-01",{"$f":"VLOOKUP(J1040,'Control Panel'!$G$132:$K$171,5,FALSE)","v":"WF-7"},"WF",null,null,null,null,null,null,"F86679",null,6047,23,15,15,19,18,13,34,32,28,28,27,28,33,29,27,26,28,24]
["2021-06-01",{"$f":"VLOOKUP(J1041,'Control Panel'!$G$132:$K$171,5,FALSE)","v":"WF-1"},"WF",null,null,null,null,null,null,"F86689",null,4365,24,23,23,22,23,9,31,29,28,28,28,28,15,14,15,14,14,14]
["2021-06-01",{"$f":"VLOOKUP(J1042,'Control Panel'!$G$132:$K$171,5,FALSE)","v":"WF-4"},"WF",null,null,null,null,null,null,"F86696",null,6746,26,20,20,23,23,4,21,20,19,18,18,19,19,14,14,11,14,10]
["2021-06-01",{"$f":"VLOOKUP(J1043,'Control Panel'!$G$132:$K$171,5,FALSE)","v":"WF-1"},"WF",null,null,null,null,null,null,"F86700",null,3863,13,11,12,12,11,2,14,11,10,10,10,11,14,12,11,10,13,10]
["2021-06-01",{"$f":"VLOOKUP(J1044,'Control Panel'!$G$132:$K$171,5,FALSE)","v":"WF-5"},"WF",null,null,null,null,null,null,"F86701",null,3724,11,8,8,9,9,1,5,4,4,4,4,4,9,8,6,5,7,5]
["2021-06-01",{"$f":"VLOOKUP(J1045,'Control Panel'!$G$132:$K$171,5,FALSE)","v":"WF-5"},"WF",null,null,null,null,null,null,"F86705",null,3563,9,9,9,9,9,9,7,7,6,7,7,7,9,8,8,5,8,6]
["2021-06-01",{"$f":"VLOOKUP(J1046,'Control Panel'!$G$132:$K$171,5,FALSE)","v":"WF-6"},"WF",null,null,null,null,null,null,"F86708",null,2824,4,1,2,2,1,0,5,4,4,4,4,4,5,5,5,5,5,5]
["2021-06-01",{"$f":"VLOOKUP(J1047,'Control Panel'!$G$132:$K$171,5,FALSE)","v":"WF-4"},"WF",null,null,null,null,null,null,"F86712",null,3295,5,5,5,5,5,2,7,7,7,7,7,7,11,11,11,10,11,10]
["2021-06-01",{"$f":"VLOOKUP(J1048,'Control Panel'!$G$132:$K$171,5,FALSE)","v":"WF-2"},"WF",null,null,null,null,null,null,"Y01291",null,9024,35,32,32,33,32,26,28,28,26,27,27,27,28,26,24,23,24,23]
["2021-06-01",{"$f":"VLOOKUP(J1049,'Control Panel'!$G$132:$K$171,5,FALSE)","v":"WF-1"},"WF",null,null,null,null,null,null,"Y01839",null,6385,24,20,21,21,20,8,22,22,19,19,19,19,20,20,18,14,20,14]
["2021-06-01",{"$f":"VLOOKUP(J1050,'Control Panel'!$G$132:$K$171,5,FALSE)","v":"WF-2"},"WF",null,null,null,null,null,null,"F86004",null,16088,54,49,49,45,1,27,44,42,40,40,42,42,56,36,40,49,41,1]
["2021-06-01",{"$f":"VLOOKUP(J1051,'Control Panel'!$G$132:$K$171,5,FALSE)","v":"WF-4"},"WF",null,null,null,null,null,null,"F86018",null,9996,22,19,18,17,1,7,26,24,21,21,24,24,30,17,19,22,19,22]
["2021-06-01",{"$f":"VLOOKUP(J1052,'Control Panel'!$G$132:$K$171,5,FALSE)","v":"WF-1"},"WF",null,null,null,null,null,null,"F86026",null,7251,17,16,16,14,13,0,18,16,14,14,16,15,42,31,30,22,29,17]
["2021-06-01",{"$f":"VLOOKUP(J1053,'Control Panel'!$G$132:$K$171,5,FALSE)","v":"WF-3"},"WF",null,null,null,null,null,null,"F86074",null,15187,64,54,54,53,0,26,52,37,37,37,42,42,41,26,27,23,26,11]
["2021-06-01",{"$f":"VLOOKUP(J1054,'Control Panel'!$G$132:$K$171,5,FALSE)","v":"WF-1"},"WF",null,null,null,null,null,null,"F86638",null,5259,19,18,17,18,2,1,16,15,14,14,16,15,18,13,11,11,11,11]
["2021-06-01",{"$f":"VLOOKUP(J1055,'Control Panel'!$G$132:$K$171,5,FALSE)","v":{"$error":"#N/A"}},null,null,null,null,null,null,null,"Total",null,{"$f":"SUM(L1016:L1054)","v":321935},{"$f":"SUM(M1016:M1054)","v":1026},871,870,895,737,349,1060,948,865,873,889,886,1036,879,863,726,870,685]
["2021-07-01",{"$f":"VLOOKUP(J1056,'Control Panel'!$G$132:$K$171,5,FALSE)","v":{"$error":"#N/A"}},"Childhood Immunisations Q2",null,"Last Run:",null,"Population Count",281705,null,null,"Search","All Patients","(01) 12 MONTH COHORT","(01.01) DTaP/IPV/Hib 6in1","(01.02) Men B (1st and 2nd)","(01.03) PCV","(01.04) Rotavirus","(01.05) BCG","(02) 24 MONTH COHORT","(02.01) DTaP/IPV/Hib Combined","(02.02) MMR","(02.03) HiB/Men C","(02.04) PCV (Booster)","(02.05) Men B (Booster)","(03) 5 YEAR COHORT","(03.01) DTaP/IPV/Hib Combined","(03.02) MMR (Primary)","(03.03) DTaP/IPV (Booster)","(03.04) HiB/Men C","(03.05) MMR (Booster)"]
["2021-07-01",{"$f":"VLOOKUP(J1057,'Control Panel'!$G$132:$K$171,5,FALSE)","v":{"$error":"#N/A"}},null,null,"2021-08-02T09:44:00",null,"Males",144821,null,"Organisation Code"]
["2021-07-01",{"$f":"VLOOKUP(J1058,'Control Panel'!$G$132:$K$171,5,FALSE)","v":"WF-6"},"WF",null,"Relative Date:",null,"Females",136884,null,"F86001",null,7750,18,15,14,17,15,8,27,21,22,22,22,22,20,14,14,8,16,11]
["2021-07-01",{"$f":"VLOOKUP(J1059,'Control Panel'!$G$132:$K$171,5,FALSE)","v":"WF-1"},"WF",null,"2021-08-01",null,null,null,null,"F86005",null,9378,36,30,30,30,32,8,44,40,37,38,37,38,39,38,38,35,38,34]
["2021-07-01",{"$f":"VLOOKUP(J1060,'Control Panel'!$G$132:$K$171,5,FALSE)","v":"WF-7"},"WF",null,null,null,null,null,null,"F86006",null,6663,22,19,19,19,19,6,13,9,8,8,8,8,15,12,12,9,11,9]
["2021-07-01",{"$f":"VLOOKUP(J1061,'Control Panel'!$G$132:$K$171,5,FALSE)","v":"WF-3"},"WF",null,null,null,null,null,null,"F86011",null,9604,17,14,14,16,14,9,22,21,15,15,15,15,28,26,27,23,26,24]
["2021-07-01",{"$f":"VLOOKUP(J1062,'Control Panel'!$G$132:$K$171,5,FALSE)","v":"WF-7"},"WF",null,null,null,null,null,null,"F86030",null,8119,27,25,24,25,24,9,38,32,31,32,32,32,36,32,30,29,31,29]
["2021-07-01",{"$f":"VLOOKUP(J1063,'Control Panel'!$G$132:$K$171,5,FALSE)","v":"WF-4"},"WF",null,null,null,null,null,null,"F86036",null,15311,55,50,50,50,50,22,67,62,59,60,61,61,58,57,53,47,54,47]
["2021-07-01",{"$f":"VLOOKUP(J1064,'Control Panel'!$G$132:$K$171,5,FALSE)","v":"WF-3"},"WF",null,null,null,null,null,null,"F86038",null,11548,37,32,31,32,31,2,33,26,25,24,24,24,47,45,42,35,42,35]
["2021-07-01",{"$f":"VLOOKUP(J1065,'Control Panel'!$G$132:$K$171,5,FALSE)","v":"WF-4"},"WF",null,null,null,null,null,null,"F86044",null,10024,48,41,40,40,37,16,46,43,41,41,41,41,35,29,29,21,28,24]
["2021-07-01",{"$f":"VLOOKUP(J1066,'Control Panel'!$G$132:$K$171,5,FALSE)","v":"WF-5"},"WF",null,null,null,null,null,null,"F86045",null,2010,3,2,2,2,2,0,3,2,2,2,2,2,4,3,3,3,3,3]
["2021-07-01",{"$f":"VLOOKUP(J1067,'Control Panel'!$G$132:$K$171,5,FALSE)","v":"WF-7"},"WF",null,null,null,null,null,null,"F86058",null,16489,64,54,53,55,47,17,60,51,40,40,40,41,68,58,56,41,56,42]
["2021-07-01",{"$f":"VLOOKUP(J1068,'Control Panel'!$G$132:$K$171,5,FALSE)","v":"WF-7"},"WF",null,null,null,null,null,null,"F86062",null,7322,25,21,20,23,23,8,18,15,13,13,13,13,16,13,12,8,12,9]
["2021-07-01",{"$f":"VLOOKUP(J1069,'Control Panel'!$G$132:$K$171,5,FALSE)","v":"WF-2"},"WF",null,null,null,null,null,null,"F86078",null,6961,7,6,6,6,7,0,10,10,10,10,10,10,16,16,16,16,16,16]
["2021-07-01",{"$f":"VLOOKUP(J1070,'Control Panel'!$G$132:$K$171,5,FALSE)","v":"WF-6"},"WF",null,null,null,null,null,null,"F86086",null,6158,26,19,19,22,22,11,27,24,21,21,21,21,30,28,27,15,27,20]
["2021-07-01",{"$f":"VLOOKUP(J1071,'Control Panel'!$G$132:$K$171,5,FALSE)","v":"WF-4"},"WF",null,null,null,null,null,null,"F86088",null,4899,13,11,10,11,10,7,10,9,6,7,7,7,8,7,7,4,7,4]
["2021-07-01",{"$f":"VLOOKUP(J1072,'Control Panel'!$G$132:$K$171,5,FALSE)","v":"WF-6"},"WF",null,null,null,null,null,null,"F86607",null,15005,75,68,68,69,67,19,43,39,33,36,36,36,60,55,54,52,54,53]
["2021-07-01",{"$f":"VLOOKUP(J1073,'Control Panel'!$G$132:$K$171,5,FALSE)","v":"WF-2"},"WF",null,null,null,null,null,null,"F86616",null,7761,36,31,30,32,31,8,47,43,41,41,40,39,28,26,26,25,25,25]
["2021-07-01",{"$f":"VLOOKUP(J1074,'Control Panel'!$G$132:$K$171,5,FALSE)","v":"WF-5"},"WF",null,null,null,null,null,null,"F86621",null,6324,21,20,20,20,20,10,19,18,15,15,15,15,11,9,6,6,8,6]
["2021-07-01",{"$f":"VLOOKUP(J1075,'Control Panel'!$G$132:$K$171,5,FALSE)","v":"WF-5"},"WF",null,null,null,null,null,null,"F86625",null,5927,15,13,13,14,13,4,14,12,11,11,11,11,16,11,11,11,11,10]
["2021-07-01",{"$f":"VLOOKUP(J1076,'Control Panel'!$G$132:$K$171,5,FALSE)","v":"WF-1"},"WF",null,null,null,null,null,null,"F86626",null,6750,29,26,26,29,25,9,22,19,16,16,16,16,24,22,23,15,23,16]
["2021-07-01",{"$f":"VLOOKUP(J1077,'Control Panel'!$G$132:$K$171,5,FALSE)","v":"WF-2"},"WF",null,null,null,null,null,null,"F86627",null,13402,36,33,33,33,33,9,26,22,21,21,21,21,34,33,32,27,32,26]
["2021-07-01",{"$f":"VLOOKUP(J1078,'Control Panel'!$G$132:$K$171,5,FALSE)","v":"WF-6"},"WF",null,null,null,null,null,null,"F86644",null,9770,22,18,18,18,17,8,36,34,32,32,32,31,16,15,15,5,14,15]
["2021-07-01",{"$f":"VLOOKUP(J1079,'Control Panel'!$G$132:$K$171,5,FALSE)","v":"WF-4"},"WF",null,null,null,null,null,null,"F86650",null,8065,26,22,21,22,20,7,26,23,20,20,20,20,27,24,22,14,21,14]
["2021-07-01",{"$f":"VLOOKUP(J1080,'Control Panel'!$G$132:$K$171,5,FALSE)","v":"WF-1"},"WF",null,null,null,null,null,null,"F86664",null,8440,17,15,15,16,16,1,28,27,21,21,21,21,28,27,27,24,27,24]
["2021-07-01",{"$f":"VLOOKUP(J1081,'Control Panel'!$G$132:$K$171,5,FALSE)","v":"WF-5"},"WF",null,null,null,null,null,null,"F86666",null,14805,34,30,28,32,32,8,49,45,36,37,35,41,51,47,45,33,44,36]
["2021-07-01",{"$f":"VLOOKUP(J1082,'Control Panel'!$G$132:$K$171,5,FALSE)","v":"WF-7"},"WF",null,null,null,null,null,null,"F86679",null,6071,29,24,24,26,25,17,28,27,23,23,23,23,33,29,28,22,28,23]
["2021-07-01",{"$f":"VLOOKUP(J1083,'Control Panel'!$G$132:$K$171,5,FALSE)","v":"WF-1"},"WF",null,null,null,null,null,null,"F86689",null,4363,18,16,16,16,16,4,20,18,18,18,18,17,22,20,21,19,20,19]
["2021-07-01",{"$f":"VLOOKUP(J1084,'Control Panel'!$G$132:$K$171,5,FALSE)","v":"WF-4"},"WF",null,null,null,null,null,null,"F86696",null,6837,30,23,23,25,25,2,28,26,24,24,24,24,22,18,19,17,18,19]
["2021-07-01",{"$f":"VLOOKUP(J1085,'Control Panel'!$G$132:$K$171,5,FALSE)","v":"WF-1"},"WF",null,null,null,null,null,null,"F86700",null,3859,11,11,10,11,10,3,11,10,7,6,7,7,9,9,8,9,8,9]
["2021-07-01",{"$f":"VLOOKUP(J1086,'Control Panel'!$G$132:$K$171,5,FALSE)","v":"WF-5"},"WF",null,null,null,null,null,null,"F86701",null,3744,10,8,8,8,8,4,16,13,10,11,11,11,8,8,8,7,8,7]
["2021-07-01",{"$f":"VLOOKUP(J1087,'Control Panel'!$G$132:$K$171,5,FALSE)","v":"WF-5"},"WF",null,null,null,null,null,null,"F86705",null,3549,6,6,6,6,6,1,7,7,7,7,7,7,9,9,9,7,9,8]
["2021-07-01",{"$f":"VLOOKUP(J1088,'Control Panel'!$G$132:$K$171,5,FALSE)","v":"WF-6"},"WF",null,null,null,null,null,null,"F86708",null,2833,5,5,5,5,5,0,10,10,9,9,9,9,10,10,10,9,10,9]
["2021-07-01",{"$f":"VLOOKUP(J1089,'Control Panel'!$G$132:$K$171,5,FALSE)","v":"WF-4"},"WF",null,null,null,null,null,null,"F86712",null,3308,10,10,10,10,10,4,7,6,4,4,4,4,6,5,6,5,6,5]
["2021-07-01",{"$f":"VLOOKUP(J1090,'Control Panel'!$G$132:$K$171,5,FALSE)","v":"WF-2"},"WF",null,null,null,null,null,null,"Y01291",null,9021,25,23,23,24,24,15,27,25,25,26,26,25,31,29,29,25,29,25]
["2021-07-01",{"$f":"VLOOKUP(J1091,'Control Panel'!$G$132:$K$171,5,FALSE)","v":"WF-1"},"WF",null,null,null,null,null,null,"Y01839",null,6355,17,13,13,13,13,0,9,9,6,7,7,7,22,22,20,18,22,18]
["2021-07-01",{"$f":"VLOOKUP(J1092,'Control Panel'!$G$132:$K$171,5,FALSE)","v":{"$error":"#N/A"}},null,null,null,null,null,null,null,"Total",null,268425,870,754,742,777,749,256,891,798,709,718,716,720,887,806,785,644,784,674]
["2021-07-01",{"$f":"VLOOKUP(J1093,'Control Panel'!$G$132:$K$171,5,FALSE)","v":"WF-2"},"WF",null,null,null,null,null,null,"F86004",null,16104,54,49,49,45,1,27,43,41,39,39,41,41,56,36,40,49,41,1]
["2021-07-01",{"$f":"VLOOKUP(J1094,'Control Panel'!$G$132:$K$171,5,FALSE)","v":"WF-4"},"WF",null,null,null,null,null,null,"F86018",null,10006,22,19,18,17,1,7,26,24,23,23,24,24,31,17,19,22,19,22]
["2021-07-01",{"$f":"VLOOKUP(J1095,'Control Panel'!$G$132:$K$171,5,FALSE)","v":"WF-1"},"WF",null,null,null,null,null,null,"F86026",null,7236,15,14,14,12,11,0,17,15,13,13,15,14,41,31,30,22,29,17]
["2021-07-01",{"$f":"VLOOKUP(J1096,'Control Panel'!$G$132:$K$171,5,FALSE)","v":"WF-3"},"WF",null,null,null,null,null,null,"F86074",null,15236,64,54,54,53,0,26,52,37,37,37,42,42,40,25,26,23,25,11]
["2021-07-01",{"$f":"VLOOKUP(J1097,'Control Panel'!$G$132:$K$171,5,FALSE)","v":"WF-1"},"WF",null,null,null,null,null,null,"F86638",null,5310,19,18,17,18,2,1,16,15,14,14,16,15,18,13,11,11,11,11]
["2021-08-01",{"$f":"VLOOKUP(J1098,'Control Panel'!$G$132:$K$171,5,FALSE)","v":{"$error":"#N/A"}},"Childhood Immunisations Q2",null,"Last Run:",null,"Population Count",281975,null,null,"Search","All Patients","(01) 12 MONTH COHORT","(01.01) DTaP/IPV/Hib 6in1","(01.02) Men B (1st and 2nd)","(01.03) PCV","(01.04) Rotavirus","(01.05) BCG","(02) 24 MONTH COHORT","(02.01) DTaP/IPV/Hib Combined","(02.02) MMR","(02.03) HiB/Men C","(02.04) PCV (Booster)","(02.05) Men B (Booster)","(03) 5 YEAR COHORT","(03.01) DTaP/IPV/Hib Combined","(03.02) MMR (Primary)","(03.03) DTaP/IPV (Booster)","(03.04) HiB/Men C","(03.05) MMR (Booster)"]
["2021-08-01",{"$f":"VLOOKUP(J1099,'Control Panel'!$G$132:$K$171,5,FALSE)","v":{"$error":"#N/A"}},null,null,"2021-09-02T10:43:00",null,"Males",145036,null,"Organisation Code"]
["2021-08-01",{"$f":"VLOOKUP(J1100,'Control Panel'!$G$132:$K$171,5,FALSE)","v":"WF-6"},"WF",null,"Relative Date:",null,"Females",136939,null,"F86001",null,7741,18,15,14,17,15,8,27,21,22,22,22,22,20,14,14,8,16,11]
["2021-08-01",{"$f":"VLOOKUP(J1101,'Control Panel'!$G$132:$K$171,5,FALSE)","v":"WF-1"},"WF",null,"2021-09-01",null,null,null,null,"F86005",null,9409,36,31,32,30,32,8,44,40,36,37,36,37,39,37,37,34,37,33]
["2021-08-01",{"$f":"VLOOKUP(J1102,'Control Panel'!$G$132:$K$171,5,FALSE)","v":"WF-7"},"WF",null,null,null,null,null,null,"F86006",null,6690,22,19,19,19,19,6,14,10,9,9,9,9,15,12,12,9,11,9]
["2021-08-01",{"$f":"VLOOKUP(J1103,'Control Panel'!$G$132:$K$171,5,FALSE)","v":"WF-3"},"WF",null,null,null,null,null,null,"F86011",null,9612,17,15,15,16,14,9,23,21,15,15,15,15,28,26,27,23,26,24]
["2021-08-01",{"$f":"VLOOKUP(J1104,'Control Panel'!$G$132:$K$171,5,FALSE)","v":"WF-7"},"WF",null,null,null,null,null,null,"F86030",null,8105,27,25,24,25,24,9,37,32,31,32,32,32,36,32,30,29,31,29]
["2021-08-01",{"$f":"VLOOKUP(J1105,'Control Panel'!$G$132:$K$171,5,FALSE)","v":"WF-4"},"WF",null,null,null,null,null,null,"F86036",null,15227,55,50,50,50,50,22,62,58,55,56,57,57,56,55,51,46,52,46]
["2021-08-01",{"$f":"VLOOKUP(J1106,'Control Panel'!$G$132:$K$171,5,FALSE)","v":"WF-3"},"WF",null,null,null,null,null,null,"F86038",null,11466,37,32,31,32,31,2,33,26,25,24,24,24,46,44,42,36,42,36]
["2021-08-01",{"$f":"VLOOKUP(J1107,'Control Panel'!$G$132:$K$171,5,FALSE)","v":"WF-4"},"WF",null,null,null,null,null,null,"F86044",null,10141,46,40,40,40,37,14,48,43,42,41,41,42,36,30,30,21,29,24]
["2021-08-01",{"$f":"VLOOKUP(J1108,'Control Panel'!$G$132:$K$171,5,FALSE)","v":"WF-5"},"WF",null,null,null,null,null,null,"F86045",null,2011,3,2,2,2,2,0,3,2,2,2,2,2,4,3,3,3,3,3]
["2021-08-01",{"$f":"VLOOKUP(J1109,'Control Panel'!$G$132:$K$171,5,FALSE)","v":"WF-7"},"WF",null,null,null,null,null,null,"F86058",null,16570,64,53,52,54,46,17,59,50,40,40,40,41,68,58,56,41,56,42]
["2021-08-01",{"$f":"VLOOKUP(J1110,'Control Panel'!$G$132:$K$171,5,FALSE)","v":"WF-7"},"WF",null,null,null,null,null,null,"F86062",null,7300,25,21,20,23,23,8,18,15,13,13,13,13,15,13,12,8,12,9]
["2021-08-01",{"$f":"VLOOKUP(J1111,'Control Panel'!$G$132:$K$171,5,FALSE)","v":"WF-2"},"WF",null,null,null,null,null,null,"F86078",null,6966,7,6,6,6,7,0,10,10,10,10,10,10,16,16,16,16,16,16]
["2021-08-01",{"$f":"VLOOKUP(J1112,'Control Panel'!$G$132:$K$171,5,FALSE)","v":"WF-6"},"WF",null,null,null,null,null,null,"F86086",null,6151,27,20,20,23,23,12,25,22,19,19,19,19,30,28,27,15,27,20]
["2021-08-01",{"$f":"VLOOKUP(J1113,'Control Panel'!$G$132:$K$171,5,FALSE)","v":"WF-4"},"WF",null,null,null,null,null,null,"F86088",null,4910,13,11,10,11,10,7,10,9,6,7,7,7,8,7,7,4,7,4]
["2021-08-01",{"$f":"VLOOKUP(J1114,'Control Panel'!$G$132:$K$171,5,FALSE)","v":"WF-6"},"WF",null,null,null,null,null,null,"F86607",null,15091,75,68,68,69,67,19,42,38,33,36,36,36,59,54,53,51,53,52]
["2021-08-01",{"$f":"VLOOKUP(J1115,'Control Panel'!$G$132:$K$171,5,FALSE)","v":"WF-2"},"WF",null,null,null,null,null,null,"F86616",null,7790,36,31,30,32,31,8,47,43,41,41,40,39,28,26,26,25,25,25]
["2021-08-01",{"$f":"VLOOKUP(J1116,'Control Panel'!$G$132:$K$171,5,FALSE)","v":"WF-5"},"WF",null,null,null,null,null,null,"F86621",null,6382,21,21,20,20,20,10,19,18,15,15,15,15,11,9,6,6,8,6]
["2021-08-01",{"$f":"VLOOKUP(J1117,'Control Panel'!$G$132:$K$171,5,FALSE)","v":"WF-5"},"WF",null,null,null,null,null,null,"F86625",null,5905,15,13,13,14,13,4,14,12,11,11,11,11,16,11,11,11,11,10]
["2021-08-01",{"$f":"VLOOKUP(J1118,'Control Panel'!$G$132:$K$171,5,FALSE)","v":"WF-1"},"WF",null,null,null,null,null,null,"F86626",null,6825,29,25,25,28,24,10,22,19,16,16,16,16,25,22,23,15,23,16]
["2021-08-01",{"$f":"VLOOKUP(J1119,'Control Panel'!$G$132:$K$171,5,FALSE)","v":"WF-2"},"WF",null,null,null,null,null,null,"F86627",null,13368,36,33,33,33,33,9,26,22,21,21,21,21,34,33,32,27,32,26]
["2021-08-01",{"$f":"VLOOKUP(J1120,'Control Panel'!$G$132:$K$171,5,FALSE)","v":"WF-6"},"WF",null,null,null,null,null,null,"F86644",null,9677,22,18,18,18,17,8,36,34,32,32,32,31,16,15,15,5,14,15]
["2021-08-01",{"$f":"VLOOKUP(J1121,'Control Panel'!$G$132:$K$171,5,FALSE)","v":"WF-4"},"WF",null,null,null,null,null,null,"F86650",null,8051,26,22,22,22,20,7,26,23,20,20,20,20,27,24,22,15,21,15]
["2021-08-01",{"$f":"VLOOKUP(J1122,'Control Panel'!$G$132:$K$171,5,FALSE)","v":"WF-1"},"WF",null,null,null,null,null,null,"F86664",null,8432,17,15,15,16,16,1,29,28,22,22,22,22,28,27,27,23,27,24]
["2021-08-01",{"$f":"VLOOKUP(J1123,'Control Panel'!$G$132:$K$171,5,FALSE)","v":"WF-5"},"WF",null,null,null,null,null,null,"F86666",null,14779,34,30,29,32,32,8,49,45,36,37,35,41,52,47,45,34,44,37]
["2021-08-01",{"$f":"VLOOKUP(J1124,'Control Panel'!$G$132:$K$171,5,FALSE)","v":"WF-7"},"WF",null,null,null,null,null,null,"F86679",null,6079,29,24,24,26,25,17,27,26,23,23,23,23,32,30,28,22,27,23]
["2021-08-01",{"$f":"VLOOKUP(J1125,'Control Panel'!$G$132:$K$171,5,FALSE)","v":"WF-1"},"WF",null,null,null,null,null,null,"F86689",null,4358,17,15,15,15,15,4,20,18,18,18,18,17,22,20,21,19,20,19]
["2021-08-01",{"$f":"VLOOKUP(J1126,'Control Panel'!$G$132:$K$171,5,FALSE)","v":"WF-4"},"WF",null,null,null,null,null,null,"F86696",null,6916,30,23,23,25,25,2,28,26,25,25,25,25,22,18,19,17,18,19]
["2021-08-01",{"$f":"VLOOKUP(J1127,'Control Panel'!$G$132:$K$171,5,FALSE)","v":"WF-1"},"WF",null,null,null,null,null,null,"F86700",null,3858,11,11,10,11,10,3,10,9,6,5,6,6,9,9,8,9,8,9]
["2021-08-01",{"$f":"VLOOKUP(J1128,'Control Panel'!$G$132:$K$171,5,FALSE)","v":"WF-5"},"WF",null,null,null,null,null,null,"F86701",null,3757,10,8,8,8,8,4,17,13,10,11,11,11,8,8,8,7,8,7]
["2021-08-01",{"$f":"VLOOKUP(J1129,'Control Panel'!$G$132:$K$171,5,FALSE)","v":"WF-5"},"WF",null,null,null,null,null,null,"F86705",null,3551,7,7,7,7,7,2,7,7,7,7,7,7,10,9,9,7,9,8]
["2021-08-01",{"$f":"VLOOKUP(J1130,'Control Panel'!$G$132:$K$171,5,FALSE)","v":"WF-6"},"WF",null,null,null,null,null,null,"F86708",null,2846,5,5,5,5,5,1,10,10,9,9,9,9,10,10,10,9,10,9]
["2021-08-01",{"$f":"VLOOKUP(J1131,'Control Panel'!$G$132:$K$171,5,FALSE)","v":"WF-4"},"WF",null,null,null,null,null,null,"F86712",null,3313,10,10,10,10,10,4,7,6,4,4,4,4,6,5,6,5,6,5]
["2021-08-01",{"$f":"VLOOKUP(J1132,'Control Panel'!$G$132:$K$171,5,FALSE)","v":"WF-2"},"WF",null,null,null,null,null,null,"Y01291",null,9071,25,23,23,24,24,15,27,25,25,26,26,25,31,29,29,25,29,25]
["2021-08-01",{"$f":"VLOOKUP(J1133,'Control Panel'!$G$132:$K$171,5,FALSE)","v":"WF-1"},"WF",null,null,null,null,null,null,"Y01839",null,6382,17,13,13,13,13,0,10,10,7,8,8,8,22,22,20,18,22,18]
["2021-08-01",{"$f":"VLOOKUP(J1134,'Control Panel'!$G$132:$K$171,5,FALSE)","v":{"$error":"#N/A"}},null,null,null,null,null,null,null,"Total",null,268730,869,755,746,776,748,258,886,791,706,714,712,717,885,803,782,643,780,674]
["2021-08-01",{"$f":"VLOOKUP(J1135,'Control Panel'!$G$132:$K$171,5,FALSE)","v":"WF-2"},"WF",null,null,null,null,null,null,"F86004",null,16080,55,52,48,42,37,13,59,56,45,48,50,49,58,42,44,50,46,1]
["2021-08-01",{"$f":"VLOOKUP(J1136,'Control Panel'!$G$132:$K$171,5,FALSE)","v":"WF-4"},"WF",null,null,null,null,null,null,"F86018",null,10012,26,26,25,24,1,12,30,24,18,18,25,20,32,24,22,21,22,21]
["2021-08-01",{"$f":"VLOOKUP(J1137,'Control Panel'!$G$132:$K$171,5,FALSE)","v":"WF-1"},"WF",null,null,null,null,null,null,"F86026",null,7216,20,17,17,16,14,0,17,15,10,10,15,15,22,10,14,8,12,4]
["2021-08-01",{"$f":"VLOOKUP(J1138,'Control Panel'!$G$132:$K$171,5,FALSE)","v":"WF-3"},"WF",null,null,null,null,null,null,"F86074",null,15261,63,57,57,55,0,28,51,43,43,43,48,47,55,33,30,30,25,7]
["2021-08-01",{"$f":"VLOOKUP(J1139,'Control Panel'!$G$132:$K$171,5,FALSE)","v":"WF-1"},"WF",null,null,null,null,null,null,"F86638",null,5296,24,24,23,21,0,3,16,15,13,13,15,14,31,22,24,17,24,15]
["2021-09-01",{"$f":"VLOOKUP(J1140,'Control Panel'!$G$132:$K$171,5,FALSE)","v":{"$error":"#N/A"}},"Childhood Immunisations Q2",null,"Last Run:",null,"Population Count",281870,null,null,"Search","All Patients","(01) 12 MONTH COHORT","(01.01) DTaP/IPV/Hib 6in1","(01.02) Men B (1st and 2nd)","(01.03) PCV","(01.04) Rotavirus","(01.05) BCG","(02) 24 MONTH COHORT","(02.01) DTaP/IPV/Hib Combined","(02.02) MMR","(02.03) HiB/Men C","(02.04) PCV (Booster)","(02.05) Men B (Booster)","(03) 5 YEAR COHORT","(03.01) DTaP/IPV/Hib Combined","(03.02) MMR (Primary)","(03.03) DTaP/IPV (Booster)","(03.04) HiB/Men C","(03.05) MMR (Booster)"]
["2021-09-01",{"$f":"VLOOKUP(J1141,'Control Panel'!$G$132:$K$171,5,FALSE)","v":{"$error":"#N/A"}},null,null,"2021-10-04T12:42:00",null,"Males",145105,null,"Organisation Code"]
["2021-09-01",{"$f":"VLOOKUP(J1142,'Control Panel'!$G$132:$K$171,5,FALSE)","v":"WF-6"},"WF",null,"Relative Date:",null,"Females",136765,null,"F86001",null,7744,17,15,14,17,15,8,27,21,22,23,22,22,20,14,14,8,16,11]
["2021-09-01",{"$f":"VLOOKUP(J1143,'Control Panel'!$G$132:$K$171,5,FALSE)","v":"WF-1"},"WF",null,"2021-10-01",null,null,null,null,"F86005",null,9384,34,29,30,28,30,8,44,40,36,37,36,37,39,36,36,33,36,32]
["2021-09-01",{"$f":"VLOOKUP(J1144,'Control Panel'!$G$132:$K$171,5,FALSE)","v":"WF-7"},"WF",null,null,null,null,null,null,"F86006",null,6696,22,19,19,19,19,6,14,10,9,9,9,9,15,12,12,9,11,9]
["2021-09-01",{"$f":"VLOOKUP(J1145,'Control Panel'!$G$132:$K$171,5,FALSE)","v":"WF-3"},"WF",null,null,null,null,null,null,"F86011",null,9593,17,15,15,16,14,9,22,20,14,14,14,14,27,25,26,22,25,23]
["2021-09-01",{"$f":"VLOOKUP(J1146,'Control Panel'!$G$132:$K$171,5,FALSE)","v":"WF-7"},"WF",null,null,null,null,null,null,"F86030",null,8137,27,25,24,25,24,9,38,33,32,33,33,33,36,32,30,29,31,29]
["2021-09-01",{"$f":"VLOOKUP(J1147,'Control Panel'!$G$132:$K$171,5,FALSE)","v":"WF-4"},"WF",null,null,null,null,null,null,"F86036",null,15175,55,50,50,50,50,22,61,57,54,55,56,56,56,55,51,46,52,46]
["2021-09-01",{"$f":"VLOOKUP(J1148,'Control Panel'!$G$132:$K$171,5,FALSE)","v":"WF-3"},"WF",null,null,null,null,null,null,"F86038",null,11379,40,33,33,33,32,3,31,25,23,22,22,22,45,44,42,35,42,35]
["2021-09-01",{"$f":"VLOOKUP(J1149,'Control Panel'!$G$132:$K$171,5,FALSE)","v":"WF-4"},"WF",null,null,null,null,null,null,"F86044",null,10125,46,40,40,40,37,13,49,43,42,41,41,42,36,30,30,21,29,24]
["2021-09-01",{"$f":"VLOOKUP(J1150,'Control Panel'!$G$132:$K$171,5,FALSE)","v":"WF-5"},"WF",null,null,null,null,null,null,"F86045",null,2019,3,2,2,2,2,0,3,2,2,2,2,2,4,3,3,3,3,3]
["2021-09-01",{"$f":"VLOOKUP(J1151,'Control Panel'!$G$132:$K$171,5,FALSE)","v":"WF-7"},"WF",null,null,null,null,null,null,"F86058",null,16559,64,54,53,55,47,17,59,50,40,40,40,41,69,59,57,43,57,44]
["2021-09-01",{"$f":"VLOOKUP(J1152,'Control Panel'!$G$132:$K$171,5,FALSE)","v":"WF-7"},"WF",null,null,null,null,null,null,"F86062",null,7321,26,21,20,23,23,8,18,15,13,13,13,13,16,13,12,8,12,9]
["2021-09-01",{"$f":"VLOOKUP(J1153,'Control Panel'!$G$132:$K$171,5,FALSE)","v":"WF-2"},"WF",null,null,null,null,null,null,"F86078",null,6905,8,7,7,7,8,1,11,10,10,10,10,10,15,15,15,15,15,15]
["2021-09-01",{"$f":"VLOOKUP(J1154,'Control Panel'!$G$132:$K$171,5,FALSE)","v":"WF-6"},"WF",null,null,null,null,null,null,"F86086",null,6180,28,21,21,24,24,13,26,23,20,20,20,20,30,28,27,15,27,20]
["2021-09-01",{"$f":"VLOOKUP(J1155,'Control Panel'!$G$132:$K$171,5,FALSE)","v":"WF-4"},"WF",null,null,null,null,null,null,"F86088",null,4904,13,11,10,11,10,7,10,9,6,7,7,7,8,7,7,4,7,4]
["2021-09-01",{"$f":"VLOOKUP(J1156,'Control Panel'!$G$132:$K$171,5,FALSE)","v":"WF-6"},"WF",null,null,null,null,null,null,"F86607",null,15127,75,68,68,69,67,19,42,39,34,37,37,37,63,57,55,53,55,54]
["2021-09-01",{"$f":"VLOOKUP(J1157,'Control Panel'!$G$132:$K$171,5,FALSE)","v":"WF-2"},"WF",null,null,null,null,null,null,"F86616",null,7799,36,31,30,32,31,8,47,43,41,41,40,39,28,26,26,25,25,25]
["2021-09-01",{"$f":"VLOOKUP(J1158,'Control Panel'!$G$132:$K$171,5,FALSE)","v":"WF-5"},"WF",null,null,null,null,null,null,"F86621",null,6421,21,21,20,20,20,10,20,18,16,16,16,15,12,10,7,6,9,7]
["2021-09-01",{"$f":"VLOOKUP(J1159,'Control Panel'!$G$132:$K$171,5,FALSE)","v":"WF-5"},"WF",null,null,null,null,null,null,"F86625",null,5888,15,13,13,14,13,4,14,12,11,11,11,11,16,11,11,11,11,10]
["2021-09-01",{"$f":"VLOOKUP(J1160,'Control Panel'!$G$132:$K$171,5,FALSE)","v":"WF-1"},"WF",null,null,null,null,null,null,"F86626",null,6852,29,25,25,29,24,10,22,19,16,16,16,16,24,21,22,14,22,15]
["2021-09-01",{"$f":"VLOOKUP(J1161,'Control Panel'!$G$132:$K$171,5,FALSE)","v":"WF-2"},"WF",null,null,null,null,null,null,"F86627",null,13359,35,32,32,32,32,9,26,22,21,21,21,21,35,33,33,27,33,26]
["2021-09-01",{"$f":"VLOOKUP(J1162,'Control Panel'!$G$132:$K$171,5,FALSE)","v":"WF-6"},"WF",null,null,null,null,null,null,"F86644",null,9590,21,18,18,18,17,8,36,34,32,32,32,31,15,14,14,5,13,14]
["2021-09-01",{"$f":"VLOOKUP(J1163,'Control Panel'!$G$132:$K$171,5,FALSE)","v":"WF-4"},"WF",null,null,null,null,null,null,"F86650",null,8069,25,21,21,21,19,8,26,23,20,20,20,20,27,24,22,15,21,15]
["2021-09-01",{"$f":"VLOOKUP(J1164,'Control Panel'!$G$132:$K$171,5,FALSE)","v":"WF-1"},"WF",null,null,null,null,null,null,"F86664",null,8430,17,14,14,15,15,1,29,28,22,22,22,22,28,27,27,23,27,24]
["2021-09-01",{"$f":"VLOOKUP(J1165,'Control Panel'!$G$132:$K$171,5,FALSE)","v":"WF-5"},"WF",null,null,null,null,null,null,"F86666",null,14764,35,31,29,33,32,9,48,44,35,36,34,40,52,47,45,34,44,37]
["2021-09-01",{"$f":"VLOOKUP(J1166,'Control Panel'!$G$132:$K$171,5,FALSE)","v":"WF-7"},"WF",null,null,null,null,null,null,"F86679",null,6115,29,25,25,26,26,17,28,26,24,24,24,23,32,30,28,22,27,23]
["2021-09-01",{"$f":"VLOOKUP(J1167,'Control Panel'!$G$132:$K$171,5,FALSE)","v":"WF-1"},"WF",null,null,null,null,null,null,"F86689",null,4368,18,16,16,16,16,5,20,18,18,18,18,17,22,20,21,19,20,19]
["2021-09-01",{"$f":"VLOOKUP(J1168,'Control Panel'!$G$132:$K$171,5,FALSE)","v":"WF-4"},"WF",null,null,null,null,null,null,"F86696",null,6932,31,23,23,25,25,2,29,26,25,25,25,25,22,18,19,17,18,19]
["2021-09-01",{"$f":"VLOOKUP(J1169,'Control Panel'!$G$132:$K$171,5,FALSE)","v":"WF-1"},"WF",null,null,null,null,null,null,"F86700",null,3876,11,11,10,11,10,3,11,10,7,6,6,7,9,9,8,9,8,9]
["2021-09-01",{"$f":"VLOOKUP(J1170,'Control Panel'!$G$132:$K$171,5,FALSE)","v":"WF-5"},"WF",null,null,null,null,null,null,"F86701",null,3769,10,8,8,8,8,4,16,12,9,10,10,10,8,8,8,7,8,7]
["2021-09-01",{"$f":"VLOOKUP(J1171,'Control Panel'!$G$132:$K$171,5,FALSE)","v":"WF-5"},"WF",null,null,null,null,null,null,"F86705",null,3551,7,7,7,7,7,3,7,7,7,7,7,7,10,10,10,8,10,9]
["2021-09-01",{"$f":"VLOOKUP(J1172,'Control Panel'!$G$132:$K$171,5,FALSE)","v":"WF-6"},"WF",null,null,null,null,null,null,"F86708",null,2856,5,5,5,5,5,2,10,10,9,9,9,9,10,10,10,9,10,9]
["2021-09-01",{"$f":"VLOOKUP(J1173,'Control Panel'!$G$132:$K$171,5,FALSE)","v":"WF-4"},"WF",null,null,null,null,null,null,"F86712",null,3329,10,10,10,10,10,4,7,6,4,4,4,4,7,5,6,5,6,5]
["2021-09-01",{"$f":"VLOOKUP(J1174,'Control Panel'!$G$132:$K$171,5,FALSE)","v":"WF-2"},"WF",null,null,null,null,null,null,"Y01291",null,9040,24,22,22,23,23,14,28,26,26,27,27,26,32,30,30,26,30,26]
["2021-09-01",{"$f":"VLOOKUP(J1175,'Control Panel'!$G$132:$K$171,5,FALSE)","v":"WF-1"},"WF",null,null,null,null,null,null,"Y01839",null,6340,17,13,13,13,13,0,10,10,7,8,8,8,22,22,20,18,22,18]
["2021-09-01",{"$f":"VLOOKUP(J1176,'Control Panel'!$G$132:$K$171,5,FALSE)","v":{"$error":"#N/A"}},null,null,null,null,null,null,null,"Total",null,268596,871,756,747,777,748,264,889,791,707,716,712,716,890,805,784,644,782,675]
["2021-09-01",{"$f":"VLOOKUP(J1177,'Control Panel'!$G$132:$K$171,5,FALSE)","v":"WF-2"},"WF",null,null,null,null,null,null,"F86004",null,16030,55,52,48,42,37,13,58,55,44,47,49,48,58,42,44,50,46,1]
["2021-09-01",{"$f":"VLOOKUP(J1178,'Control Panel'!$G$132:$K$171,5,FALSE)","v":"WF-4"},"WF",null,null,null,null,null,null,"F86018",null,9986,26,26,25,24,1,12,30,26,21,21,27,23,32,24,22,21,22,21]
["2021-09-01",{"$f":"VLOOKUP(J1179,'Control Panel'!$G$132:$K$171,5,FALSE)","v":"WF-1"},"WF",null,null,null,null,null,null,"F86026",null,7270,20,17,17,16,14,0,17,15,10,10,15,15,22,10,14,8,12,4]
["2021-09-01",{"$f":"VLOOKUP(J1180,'Control Panel'!$G$132:$K$171,5,FALSE)","v":"WF-3"},"WF",null,null,null,null,null,null,"F86074",null,15288,62,59,57,56,1,29,49,41,44,43,46,45,54,32,29,30,25,7]
["2021-09-01",{"$f":"VLOOKUP(J1181,'Control Panel'!$G$132:$K$171,5,FALSE)","v":"WF-1"},"WF",null,null,null,null,null,null,"F86638",null,5314,24,24,23,21,0,3,16,15,13,13,15,14,31,22,24,17,24,15]
["2021-10-01",{"$f":"VLOOKUP(J1182,'Control Panel'!$G$132:$K$171,5,FALSE)","v":{"$error":"#N/A"}},"Childhood Immunisations Q3",null,"Last Run:",null,"Population Count",282187,null,null,"Search","All Patients","(01) 12 MONTH COHORT","(01.01) DTaP/IPV/Hib 6in1","(01.02) Men B (1st and 2nd)","(01.03) PCV","(01.04) Rotavirus","(01.05) BCG","(02) 24 MONTH COHORT","(02.01) DTaP/IPV/Hib Combined","(02.02) MMR","(02.03) HiB/Men C","(02.04) PCV (Booster)","(02.05) Men B (Booster)","(03) 5 YEAR COHORT","(03.01) DTaP/IPV/Hib Combined","(03.02) MMR (Primary)","(03.03) DTaP/IPV (Booster)","(03.04) HiB/Men C","(03.05) MMR (Booster)"]
["2021-10-01",{"$f":"VLOOKUP(J1183,'Control Panel'!$G$132:$K$171,5,FALSE)","v":{"$error":"#N/A"}},null,null,"2021-11-02T13:33:00",null,"Males",145345,null,"Organisation Code"]
["2021-10-01",{"$f":"VLOOKUP(J1184,'Control Panel'!$G$132:$K$171,5,FALSE)","v":"WF-6"},"WF",null,"Relative Date:",null,"Females",136842,null,"F86001",null,7740,26,23,24,25,24,1,21,17,15,15,15,15,22,16,17,11,16,13]
["2021-10-01",{"$f":"VLOOKUP(J1185,'Control Panel'!$G$132:$K$171,5,FALSE)","v":"WF-1"},"WF",null,"2021-11-01",null,null,null,null,"F86005",null,9415,41,39,39,39,40,3,45,44,42,42,42,43,24,21,22,17,22,18]
["2021-10-01",{"$f":"VLOOKUP(J1186,'Control Panel'!$G$132:$K$171,5,FALSE)","v":"WF-7"},"WF",null,null,null,null,null,null,"F86006",null,6732,21,20,20,21,20,6,19,16,15,15,15,16,13,13,13,12,13,12]
["2021-10-01",{"$f":"VLOOKUP(J1187,'Control Panel'!$G$132:$K$171,5,FALSE)","v":"WF-3"},"WF",null,null,null,null,null,null,"F86011",null,9633,19,17,17,18,14,4,20,17,17,16,16,17,33,32,32,26,32,27]
["2021-10-01",{"$f":"VLOOKUP(J1188,'Control Panel'!$G$132:$K$171,5,FALSE)","v":"WF-7"},"WF",null,null,null,null,null,null,"F86030",null,8120,22,20,20,20,20,1,33,32,32,32,31,32,23,21,21,20,21,20]
["2021-10-01",{"$f":"VLOOKUP(J1189,'Control Panel'!$G$132:$K$171,5,FALSE)","v":"WF-4"},"WF",null,null,null,null,null,null,"F86036",null,15128,39,36,36,36,36,5,49,42,40,39,41,40,42,40,38,36,38,35]
["2021-10-01",{"$f":"VLOOKUP(J1190,'Control Panel'!$G$132:$K$171,5,FALSE)","v":"WF-3"},"WF",null,null,null,null,null,null,"F86038",null,11395,37,33,32,32,32,5,43,38,35,36,35,37,36,33,30,30,32,32]
["2021-10-01",{"$f":"VLOOKUP(J1191,'Control Panel'!$G$132:$K$171,5,FALSE)","v":"WF-4"},"WF",null,null,null,null,null,null,"F86044",null,10279,42,37,35,36,36,10,41,33,34,35,35,34,37,26,24,18,25,19]
["2021-10-01",{"$f":"VLOOKUP(J1192,'Control Panel'!$G$132:$K$171,5,FALSE)","v":"WF-5"},"WF",null,null,null,null,null,null,"F86045",null,2033,3,3,3,3,3,1,1,1,1,1,1,1,3,1,1,0,1,0]
["2021-10-01",{"$f":"VLOOKUP(J1193,'Control Panel'!$G$132:$K$171,5,FALSE)","v":"WF-7"},"WF",null,null,null,null,null,null,"F86058",null,16782,48,43,43,44,41,9,70,58,58,58,58,59,54,46,43,22,41,23]
["2021-10-01",{"$f":"VLOOKUP(J1194,'Control Panel'!$G$132:$K$171,5,FALSE)","v":"WF-7"},"WF",null,null,null,null,null,null,"F86062",null,7293,24,18,17,21,20,0,25,16,16,16,17,17,26,25,24,19,24,19]
["2021-10-01",{"$f":"VLOOKUP(J1195,'Control Panel'!$G$132:$K$171,5,FALSE)","v":"WF-2"},"WF",null,null,null,null,null,null,"F86078",null,6965,10,9,9,10,9,1,10,8,7,7,7,7,22,18,18,15,18,15]
["2021-10-01",{"$f":"VLOOKUP(J1196,'Control Panel'!$G$132:$K$171,5,FALSE)","v":"WF-6"},"WF",null,null,null,null,null,null,"F86086",null,6190,20,17,17,17,17,1,31,27,23,23,23,24,19,16,15,9,15,12]
["2021-10-01",{"$f":"VLOOKUP(J1197,'Control Panel'!$G$132:$K$171,5,FALSE)","v":"WF-4"},"WF",null,null,null,null,null,null,"F86088",null,4923,16,14,13,13,12,5,9,8,6,7,8,7,15,13,11,8,11,8]
["2021-10-01",{"$f":"VLOOKUP(J1198,'Control Panel'!$G$132:$K$171,5,FALSE)","v":"WF-6"},"WF",null,null,null,null,null,null,"F86607",null,15209,45,41,41,42,41,1,60,51,44,45,43,47,56,52,51,45,50,47]
["2021-10-01",{"$f":"VLOOKUP(J1199,'Control Panel'!$G$132:$K$171,5,FALSE)","v":"WF-2"},"WF",null,null,null,null,null,null,"F86616",null,7845,31,28,27,28,27,5,32,26,25,25,25,26,36,29,31,28,31,28]
["2021-10-01",{"$f":"VLOOKUP(J1200,'Control Panel'!$G$132:$K$171,5,FALSE)","v":"WF-5"},"WF",null,null,null,null,null,null,"F86621",null,6444,26,24,24,24,24,8,19,16,16,16,15,15,16,15,14,13,14,14]
["2021-10-01",{"$f":"VLOOKUP(J1201,'Control Panel'!$G$132:$K$171,5,FALSE)","v":"WF-5"},"WF",null,null,null,null,null,null,"F86625",null,5886,12,10,10,10,10,3,17,14,9,9,9,9,18,16,16,9,14,10]
["2021-10-01",{"$f":"VLOOKUP(J1202,'Control Panel'!$G$132:$K$171,5,FALSE)","v":"WF-1"},"WF",null,null,null,null,null,null,"F86626",null,6900,29,27,27,27,27,3,34,30,26,26,26,26,20,17,17,13,16,13]
["2021-10-01",{"$f":"VLOOKUP(J1203,'Control Panel'!$G$132:$K$171,5,FALSE)","v":"WF-2"},"WF",null,null,null,null,null,null,"F86627",null,13370,36,33,32,34,32,5,31,29,24,25,24,24,40,39,35,29,36,29]
["2021-10-01",{"$f":"VLOOKUP(J1204,'Control Panel'!$G$132:$K$171,5,FALSE)","v":"WF-6"},"WF",null,null,null,null,null,null,"F86644",null,9528,17,17,17,17,16,3,12,11,9,8,9,8,30,29,28,26,30,28]
["2021-10-01",{"$f":"VLOOKUP(J1205,'Control Panel'!$G$132:$K$171,5,FALSE)","v":"WF-4"},"WF",null,null,null,null,null,null,"F86650",null,8078,39,33,33,34,33,5,28,24,22,21,22,19,25,23,23,14,23,14]
["2021-10-01",{"$f":"VLOOKUP(J1206,'Control Panel'!$G$132:$K$171,5,FALSE)","v":"WF-1"},"WF",null,null,null,null,null,null,"F86664",null,8442,26,24,24,25,24,3,27,25,25,25,25,25,26,22,24,17,24,17]
["2021-10-01",{"$f":"VLOOKUP(J1207,'Control Panel'!$G$132:$K$171,5,FALSE)","v":"WF-5"},"WF",null,null,null,null,null,null,"F86666",null,14787,38,37,34,35,36,3,44,33,33,34,32,34,34,31,27,23,29,28]
["2021-10-01",{"$f":"VLOOKUP(J1208,'Control Panel'!$G$132:$K$171,5,FALSE)","v":"WF-7"},"WF",null,null,null,null,null,null,"F86679",null,6183,23,20,20,22,22,5,35,32,29,29,29,29,21,20,19,14,20,14]
["2021-10-01",{"$f":"VLOOKUP(J1209,'Control Panel'!$G$132:$K$171,5,FALSE)","v":"WF-1"},"WF",null,null,null,null,null,null,"F86689",null,4383,20,20,19,20,20,1,18,16,17,17,17,17,27,27,27,24,27,24]
["2021-10-01",{"$f":"VLOOKUP(J1210,'Control Panel'!$G$132:$K$171,5,FALSE)","v":"WF-4"},"WF",null,null,null,null,null,null,"F86696",null,6921,24,19,19,22,22,2,26,24,22,22,22,22,23,18,20,18,20,18]
["2021-10-01",{"$f":"VLOOKUP(J1211,'Control Panel'!$G$132:$K$171,5,FALSE)","v":"WF-1"},"WF",null,null,null,null,null,null,"F86700",null,3883,0,0,0,0,0,0,9,8,7,7,7,7,16,14,13,14,13,14]
["2021-10-01",{"$f":"VLOOKUP(J1212,'Control Panel'!$G$132:$K$171,5,FALSE)","v":"WF-5"},"WF",null,null,null,null,null,null,"F86701",null,3777,17,15,15,15,15,4,13,12,9,9,8,9,13,12,11,10,12,11]
["2021-10-01",{"$f":"VLOOKUP(J1213,'Control Panel'!$G$132:$K$171,5,FALSE)","v":"WF-5"},"WF",null,null,null,null,null,null,"F86705",null,3535,6,6,6,6,6,1,10,10,9,9,9,9,7,7,5,5,5,5]
["2021-10-01",{"$f":"VLOOKUP(J1214,'Control Panel'!$G$132:$K$171,5,FALSE)","v":"WF-6"},"WF",null,null,null,null,null,null,"F86708",null,2860,5,5,5,5,5,0,5,5,5,5,5,5,8,7,7,5,7,5]
["2021-10-01",{"$f":"VLOOKUP(J1215,'Control Panel'!$G$132:$K$171,5,FALSE)","v":"WF-4"},"WF",null,null,null,null,null,null,"F86712",null,3352,12,11,11,12,12,3,7,7,6,6,6,6,10,10,10,10,10,10]
["2021-10-01",{"$f":"VLOOKUP(J1216,'Control Panel'!$G$132:$K$171,5,FALSE)","v":"WF-2"},"WF",null,null,null,null,null,null,"Y01291",null,9062,26,24,23,25,24,7,37,35,33,34,34,33,16,16,16,15,16,16]
["2021-10-01",{"$f":"VLOOKUP(J1217,'Control Panel'!$G$132:$K$171,5,FALSE)","v":"WF-1"},"WF",null,null,null,null,null,null,"Y01839",null,6320,22,21,20,22,22,3,25,21,20,20,20,20,24,24,23,19,23,19]
["2021-10-01",{"$f":"VLOOKUP(J1218,'Control Panel'!$G$132:$K$171,5,FALSE)","v":{"$error":"#N/A"}},null,null,null,null,null,null,null,"Total",null,269393,822,744,732,760,742,117,906,786,731,734,731,739,835,749,726,594,729,617]
["2021-10-01",{"$f":"VLOOKUP(J1219,'Control Panel'!$G$132:$K$171,5,FALSE)","v":"WF-2"},"WF",null,null,null,null,null,null,"F86004",null,16020,44,42,40,40,40,6,52,51,46,47,49,49,73,49,53,57,53,11]
["2021-10-01",{"$f":"VLOOKUP(J1220,'Control Panel'!$G$132:$K$171,5,FALSE)","v":"WF-4"},"WF",null,null,null,null,null,null,"F86018",null,9998,23,21,19,19,0,5,30,27,22,23,25,24,23,19,20,19,20,18]
["2021-10-01",{"$f":"VLOOKUP(J1221,'Control Panel'!$G$132:$K$171,5,FALSE)","v":"WF-1"},"WF",null,null,null,null,null,null,"F86026",null,7248,16,13,13,12,10,0,22,20,18,18,21,19,23,11,14,16,11,11]
["2021-10-01",{"$f":"VLOOKUP(J1222,'Control Panel'!$G$132:$K$171,5,FALSE)","v":"WF-3"},"WF",null,null,null,null,null,null,"F86074",null,15301,47,43,43,41,1,16,56,46,42,44,46,45,51,31,31,34,31,7]
["2021-10-01",{"$f":"VLOOKUP(J1223,'Control Panel'!$G$132:$K$171,5,FALSE)","v":"WF-1"},"WF",null,null,null,null,null,null,"F86638",null,5281,15,12,12,12,0,0,19,17,13,13,16,15,15,10,12,10,12,9]
["2021-11-01",{"$f":"VLOOKUP(J1224,'Control Panel'!$G$132:$K$171,5,FALSE)","v":{"$error":"#N/A"}},"Childhood Immunisations Q3",null,"Last Run:",null,"Population Count",281769,null,null,"Search","All Patients","(01) 12 MONTH COHORT","(01.01) DTaP/IPV/Hib 6in1","(01.02) Men B (1st and 2nd)","(01.03) PCV","(01.04) Rotavirus","(01.05) BCG","(02) 24 MONTH COHORT","(02.01) DTaP/IPV/Hib Combined","(02.02) MMR","(02.03) HiB/Men C","(02.04) PCV (Booster)","(02.05) Men B (Booster)","(03) 5 YEAR COHORT","(03.01) DTaP/IPV/Hib Combined","(03.02) MMR (Primary)","(03.03) DTaP/IPV (Booster)","(03.04) HiB/Men C","(03.05) MMR (Booster)"]
["2021-11-01",{"$f":"VLOOKUP(J1225,'Control Panel'!$G$132:$K$171,5,FALSE)","v":{"$error":"#N/A"}},null,null,"2021-12-03T14:53:00",null,"Males",145247,null,"Organisation Code"]
["2021-11-01",{"$f":"VLOOKUP(J1226,'Control Panel'!$G$132:$K$171,5,FALSE)","v":"WF-6"},"WF",null,"Relative Date:",null,"Females",136522,null,"F86001",null,7746,26,23,24,25,24,1,20,16,15,15,15,15,21,15,16,11,15,13]
["2021-11-01",{"$f":"VLOOKUP(J1227,'Control Panel'!$G$132:$K$171,5,FALSE)","v":"WF-1"},"WF",null,"2021-12-01",null,null,null,null,"F86005",null,9513,41,39,39,39,40,3,46,44,43,43,43,44,24,21,22,18,22,19]
["2021-11-01",{"$f":"VLOOKUP(J1228,'Control Panel'!$G$132:$K$171,5,FALSE)","v":"WF-7"},"WF",null,null,null,null,null,null,"F86006",null,6750,22,21,21,22,21,6,18,15,14,14,14,15,13,13,13,12,13,12]
["2021-11-01",{"$f":"VLOOKUP(J1229,'Control Panel'!$G$132:$K$171,5,FALSE)","v":"WF-3"},"WF",null,null,null,null,null,null,"F86011",null,9624,19,17,17,18,14,4,19,16,16,15,15,16,33,32,32,26,32,27]
["2021-11-01",{"$f":"VLOOKUP(J1230,'Control Panel'!$G$132:$K$171,5,FALSE)","v":"WF-7"},"WF",null,null,null,null,null,null,"F86030",null,8099,22,20,20,20,20,1,30,29,29,29,28,29,22,21,21,20,21,20]
["2021-11-01",{"$f":"VLOOKUP(J1231,'Control Panel'!$G$132:$K$171,5,FALSE)","v":"WF-4"},"WF",null,null,null,null,null,null,"F86036",null,14979,40,36,36,36,36,5,50,42,42,41,44,42,42,40,39,36,39,36]
["2021-11-01",{"$f":"VLOOKUP(J1232,'Control Panel'!$G$132:$K$171,5,FALSE)","v":"WF-3"},"WF",null,null,null,null,null,null,"F86038",null,11360,39,35,34,34,34,5,41,37,34,35,34,36,36,33,30,30,32,32]
["2021-11-01",{"$f":"VLOOKUP(J1233,'Control Panel'!$G$132:$K$171,5,FALSE)","v":"WF-4"},"WF",null,null,null,null,null,null,"F86044",null,10250,44,38,36,37,37,11,41,33,34,35,35,34,36,26,24,18,25,19]
["2021-11-01",{"$f":"VLOOKUP(J1234,'Control Panel'!$G$132:$K$171,5,FALSE)","v":"WF-5"},"WF",null,null,null,null,null,null,"F86045",null,2021,2,2,2,2,2,1,1,1,1,1,1,1,3,1,1,1,1,1]
["2021-11-01",{"$f":"VLOOKUP(J1235,'Control Panel'!$G$132:$K$171,5,FALSE)","v":"WF-7"},"WF",null,null,null,null,null,null,"F86058",null,16622,47,41,41,42,39,11,66,56,55,55,55,56,54,47,44,24,42,26]
["2021-11-01",{"$f":"VLOOKUP(J1236,'Control Panel'!$G$132:$K$171,5,FALSE)","v":"WF-7"},"WF",null,null,null,null,null,null,"F86062",null,7280,22,16,16,19,19,0,25,16,17,17,18,18,26,25,24,19,24,19]
["2021-11-01",{"$f":"VLOOKUP(J1237,'Control Panel'!$G$132:$K$171,5,FALSE)","v":"WF-2"},"WF",null,null,null,null,null,null,"F86078",null,6916,11,10,9,11,9,1,10,8,7,7,8,8,23,19,19,15,19,15]
["2021-11-01",{"$f":"VLOOKUP(J1238,'Control Panel'!$G$132:$K$171,5,FALSE)","v":"WF-6"},"WF",null,null,null,null,null,null,"F86086",null,6193,20,17,17,17,17,1,31,27,23,23,23,24,19,16,15,9,15,12]
["2021-11-01",{"$f":"VLOOKUP(J1239,'Control Panel'!$G$132:$K$171,5,FALSE)","v":"WF-4"},"WF",null,null,null,null,null,null,"F86088",null,4948,16,14,13,13,12,5,9,8,6,7,8,7,15,13,11,8,11,8]
["2021-11-01",{"$f":"VLOOKUP(J1240,'Control Panel'!$G$132:$K$171,5,FALSE)","v":"WF-6"},"WF",null,null,null,null,null,null,"F86607",null,15284,45,42,42,42,41,1,61,53,47,48,46,50,56,52,51,45,50,47]
["2021-11-01",{"$f":"VLOOKUP(J1241,'Control Panel'!$G$132:$K$171,5,FALSE)","v":"WF-2"},"WF",null,null,null,null,null,null,"F86616",null,7861,30,27,27,28,27,5,32,26,25,25,25,26,36,29,31,28,31,28]
["2021-11-01",{"$f":"VLOOKUP(J1242,'Control Panel'!$G$132:$K$171,5,FALSE)","v":"WF-5"},"WF",null,null,null,null,null,null,"F86621",null,6433,25,23,23,24,23,8,19,16,16,16,15,15,16,16,15,14,15,15]
["2021-11-01",{"$f":"VLOOKUP(J1243,'Control Panel'!$G$132:$K$171,5,FALSE)","v":"WF-5"},"WF",null,null,null,null,null,null,"F86625",null,5903,12,10,10,10,10,3,17,14,9,9,9,9,18,16,16,9,14,10]
["2021-11-01",{"$f":"VLOOKUP(J1244,'Control Panel'!$G$132:$K$171,5,FALSE)","v":"WF-1"},"WF",null,null,null,null,null,null,"F86626",null,6913,29,27,27,27,27,3,35,31,26,26,26,26,20,17,17,13,16,13]
["2021-11-01",{"$f":"VLOOKUP(J1245,'Control Panel'!$G$132:$K$171,5,FALSE)","v":"WF-2"},"WF",null,null,null,null,null,null,"F86627",null,13317,35,33,32,34,32,5,32,29,24,25,24,24,40,39,35,30,36,30]
["2021-11-01",{"$f":"VLOOKUP(J1246,'Control Panel'!$G$132:$K$171,5,FALSE)","v":"WF-6"},"WF",null,null,null,null,null,null,"F86644",null,9492,16,16,16,16,15,3,12,11,9,8,9,8,30,29,28,26,30,28]
["2021-11-01",{"$f":"VLOOKUP(J1247,'Control Panel'!$G$132:$K$171,5,FALSE)","v":"WF-4"},"WF",null,null,null,null,null,null,"F86650",null,8073,39,33,33,34,33,5,28,24,22,21,22,19,24,22,22,14,22,14]
["2021-11-01",{"$f":"VLOOKUP(J1248,'Control Panel'!$G$132:$K$171,5,FALSE)","v":"WF-1"},"WF",null,null,null,null,null,null,"F86664",null,8427,25,23,23,24,23,3,27,26,26,26,25,25,26,22,24,17,24,17]
["2021-11-01",{"$f":"VLOOKUP(J1249,'Control Panel'!$G$132:$K$171,5,FALSE)","v":"WF-5"},"WF",null,null,null,null,null,null,"F86666",null,14845,38,37,34,35,36,3,44,33,33,34,32,34,34,31,27,23,29,28]
["2021-11-01",{"$f":"VLOOKUP(J1250,'Control Panel'!$G$132:$K$171,5,FALSE)","v":"WF-7"},"WF",null,null,null,null,null,null,"F86679",null,6211,23,20,20,22,22,5,35,33,30,30,30,29,21,20,19,14,20,14]
["2021-11-01",{"$f":"VLOOKUP(J1251,'Control Panel'!$G$132:$K$171,5,FALSE)","v":"WF-1"},"WF",null,null,null,null,null,null,"F86689",null,4381,19,19,19,19,19,1,19,17,19,19,19,19,27,26,27,24,27,24]
["2021-11-01",{"$f":"VLOOKUP(J1252,'Control Panel'!$G$132:$K$171,5,FALSE)","v":"WF-4"},"WF",null,null,null,null,null,null,"F86696",null,6767,21,16,16,19,19,2,25,24,22,22,22,22,21,16,18,16,18,16]
["2021-11-01",{"$f":"VLOOKUP(J1253,'Control Panel'!$G$132:$K$171,5,FALSE)","v":"WF-1"},"WF",null,null,null,null,null,null,"F86700",null,3892,0,0,0,0,0,0,9,8,7,7,7,7,16,14,13,14,13,14]
["2021-11-01",{"$f":"VLOOKUP(J1254,'Control Panel'!$G$132:$K$171,5,FALSE)","v":"WF-5"},"WF",null,null,null,null,null,null,"F86701",null,3777,16,14,14,14,14,4,12,11,8,8,7,8,12,11,10,9,11,10]
["2021-11-01",{"$f":"VLOOKUP(J1255,'Control Panel'!$G$132:$K$171,5,FALSE)","v":"WF-5"},"WF",null,null,null,null,null,null,"F86705",null,3530,6,6,6,6,6,2,10,10,9,9,9,9,7,7,5,5,5,5]
["2021-11-01",{"$f":"VLOOKUP(J1256,'Control Panel'!$G$132:$K$171,5,FALSE)","v":"WF-6"},"WF",null,null,null,null,null,null,"F86708",null,2881,5,5,5,5,5,0,5,5,5,5,5,5,8,7,7,5,7,5]
["2021-11-01",{"$f":"VLOOKUP(J1257,'Control Panel'!$G$132:$K$171,5,FALSE)","v":"WF-4"},"WF",null,null,null,null,null,null,"F86712",null,3372,12,11,11,12,12,3,6,6,5,5,5,5,10,10,10,10,10,10]
["2021-11-01",{"$f":"VLOOKUP(J1258,'Control Panel'!$G$132:$K$171,5,FALSE)","v":"WF-2"},"WF",null,null,null,null,null,null,"Y01291",null,9086,26,24,23,25,24,7,37,36,34,34,35,34,16,16,16,15,16,16]
["2021-11-01",{"$f":"VLOOKUP(J1259,'Control Panel'!$G$132:$K$171,5,FALSE)","v":"WF-1"},"WF",null,null,null,null,null,null,"Y01839",null,6291,21,20,19,21,21,3,23,19,18,18,18,18,24,24,23,19,23,19]
["2021-11-01",{"$f":"VLOOKUP(J1260,'Control Panel'!$G$132:$K$171,5,FALSE)","v":{"$error":"#N/A"}},null,null,null,null,null,null,null,"Total",null,269037,814,735,725,752,733,121,895,780,730,732,731,737,829,746,725,597,728,622]
["2021-11-01",{"$f":"VLOOKUP(J1261,'Control Panel'!$G$132:$K$171,5,FALSE)","v":"WF-2"},"WF",null,null,null,null,null,null,"F86004",null,16014,44,42,40,40,40,6,51,50,32,46,48,48,73,49,68,57,53,9]
["2021-11-01",{"$f":"VLOOKUP(J1262,'Control Panel'!$G$132:$K$171,5,FALSE)","v":"WF-4"},"WF",null,null,null,null,null,null,"F86018",null,9991,22,20,18,18,0,4,30,27,2,23,25,24,23,19,3,19,20,0]
["2021-11-01",{"$f":"VLOOKUP(J1263,'Control Panel'!$G$132:$K$171,5,FALSE)","v":"WF-1"},"WF",null,null,null,null,null,null,"F86026",null,7254,15,13,12,11,9,0,22,20,1,19,21,19,23,11,14,16,11,1]
["2021-11-01",{"$f":"VLOOKUP(J1264,'Control Panel'!$G$132:$K$171,5,FALSE)","v":"WF-3"},"WF",null,null,null,null,null,null,"F86074",null,15226,47,45,43,41,1,16,56,46,22,44,46,45,52,31,34,34,31,2]
["2021-11-01",{"$f":"VLOOKUP(J1265,'Control Panel'!$G$132:$K$171,5,FALSE)","v":"WF-1"},"WF",null,null,null,null,null,null,"F86638",null,5267,15,12,12,12,0,0,18,16,0,13,15,15,15,10,8,10,12,1]
["2021-12-01",{"$f":"VLOOKUP(J1266,'Control Panel'!$G$132:$K$171,5,FALSE)","v":{"$error":"#N/A"}},"Childhood Immunisations Q3",null,"Last Run:",null,"Population Count",282077,null,null,"Search","All Patients","(01) 12 MONTH COHORT","(01.01) DTaP/IPV/Hib 6in1","(01.02) Men B (1st and 2nd)","(01.03) PCV","(01.04) Rotavirus","(01.05) BCG","(02) 24 MONTH COHORT","(02.01) DTaP/IPV/Hib Combined","(02.02) MMR","(02.03) HiB/Men C","(02.04) PCV (Booster)","(02.05) Men B (Booster)","(03) 5 YEAR COHORT","(03.01) DTaP/IPV/Hib Combined","(03.02) MMR (Primary)","(03.03) DTaP/IPV (Booster)","(03.04) HiB/Men C","(03.05) MMR (Booster)"]
["2021-12-01",{"$f":"VLOOKUP(J1267,'Control Panel'!$G$132:$K$171,5,FALSE)","v":{"$error":"#N/A"}},null,null,"2022-01-04T18:23:00",null,"Males",145541,null,"Organisation Code"]
["2021-12-01",{"$f":"VLOOKUP(J1268,'Control Panel'!$G$132:$K$171,5,FALSE)","v":"WF-6"},"WF",null,"Relative Date:",null,"Females",136536,null,"F86001",null,7743,26,24,24,25,24,1,20,16,15,15,15,15,21,16,16,11,15,15]
["2021-12-01",{"$f":"VLOOKUP(J1269,'Control Panel'!$G$132:$K$171,5,FALSE)","v":"WF-1"},"WF",null,"2022-01-01",null,null,null,null,"F86005",null,9491,41,39,39,39,40,3,46,45,44,44,44,45,24,21,22,19,22,20]
["2021-12-01",{"$f":"VLOOKUP(J1270,'Control Panel'!$G$132:$K$171,5,FALSE)","v":"WF-7"},"WF",null,null,null,null,null,null,"F86006",null,6759,22,21,21,22,21,6,18,15,14,14,14,15,13,13,13,12,13,12]
["2021-12-01",{"$f":"VLOOKUP(J1271,'Control Panel'!$G$132:$K$171,5,FALSE)","v":"WF-3"},"WF",null,null,null,null,null,null,"F86011",null,9658,19,17,17,18,14,4,19,15,16,15,15,15,34,33,33,27,33,28]
["2021-12-01",{"$f":"VLOOKUP(J1272,'Control Panel'!$G$132:$K$171,5,FALSE)","v":"WF-7"},"WF",null,null,null,null,null,null,"F86030",null,8122,23,19,19,19,19,1,31,30,30,30,29,30,22,21,21,20,21,20]
["2021-12-01",{"$f":"VLOOKUP(J1273,'Control Panel'!$G$132:$K$171,5,FALSE)","v":"WF-4"},"WF",null,null,null,null,null,null,"F86036",null,14935,41,38,38,38,37,7,51,43,43,43,45,43,41,39,38,36,38,35]
["2021-12-01",{"$f":"VLOOKUP(J1274,'Control Panel'!$G$132:$K$171,5,FALSE)","v":"WF-3"},"WF",null,null,null,null,null,null,"F86038",null,11370,37,34,33,33,33,5,43,39,36,37,36,38,36,33,30,30,32,32]
["2021-12-01",{"$f":"VLOOKUP(J1275,'Control Panel'!$G$132:$K$171,5,FALSE)","v":"WF-4"},"WF",null,null,null,null,null,null,"F86044",null,10358,45,39,37,38,38,11,40,32,33,34,34,33,38,27,25,19,26,20]
["2021-12-01",{"$f":"VLOOKUP(J1276,'Control Panel'!$G$132:$K$171,5,FALSE)","v":"WF-5"},"WF",null,null,null,null,null,null,"F86045",null,2019,2,2,2,2,2,1,1,1,1,1,1,1,2,1,1,1,1,1]
["2021-12-01",{"$f":"VLOOKUP(J1277,'Control Panel'!$G$132:$K$171,5,FALSE)","v":"WF-7"},"WF",null,null,null,null,null,null,"F86058",null,16682,48,42,42,43,39,11,65,55,54,54,54,55,51,45,42,25,40,27]
["2021-12-01",{"$f":"VLOOKUP(J1278,'Control Panel'!$G$132:$K$171,5,FALSE)","v":"WF-7"},"WF",null,null,null,null,null,null,"F86062",null,7232,21,16,16,18,18,0,25,17,17,17,18,18,26,25,24,19,24,19]
["2021-12-01",{"$f":"VLOOKUP(J1279,'Control Panel'!$G$132:$K$171,5,FALSE)","v":"WF-2"},"WF",null,null,null,null,null,null,"F86078",null,6927,12,11,11,12,11,1,10,8,7,7,8,8,22,19,19,14,19,14]
["2021-12-01",{"$f":"VLOOKUP(J1280,'Control Panel'!$G$132:$K$171,5,FALSE)","v":"WF-6"},"WF",null,null,null,null,null,null,"F86086",null,6191,20,17,17,17,17,1,30,26,22,22,22,23,19,16,15,9,15,12]
["2021-12-01",{"$f":"VLOOKUP(J1281,'Control Panel'!$G$132:$K$171,5,FALSE)","v":"WF-4"},"WF",null,null,null,null,null,null,"F86088",null,4965,16,14,13,13,12,5,9,8,6,7,8,7,15,13,11,8,11,8]
["2021-12-01",{"$f":"VLOOKUP(J1282,'Control Panel'!$G$132:$K$171,5,FALSE)","v":"WF-6"},"WF",null,null,null,null,null,null,"F86607",null,15376,48,45,45,45,44,2,60,52,46,47,45,49,56,52,51,45,50,47]
["2021-12-01",{"$f":"VLOOKUP(J1283,'Control Panel'!$G$132:$K$171,5,FALSE)","v":"WF-2"},"WF",null,null,null,null,null,null,"F86616",null,7911,30,27,27,28,27,5,32,26,25,25,25,26,36,29,31,28,31,28]
["2021-12-01",{"$f":"VLOOKUP(J1284,'Control Panel'!$G$132:$K$171,5,FALSE)","v":"WF-5"},"WF",null,null,null,null,null,null,"F86621",null,6394,25,24,24,24,23,8,19,16,16,16,15,15,16,16,15,14,15,15]
["2021-12-01",{"$f":"VLOOKUP(J1285,'Control Panel'!$G$132:$K$171,5,FALSE)","v":"WF-5"},"WF",null,null,null,null,null,null,"F86625",null,5900,12,10,10,10,10,3,17,14,9,9,9,9,18,16,16,9,14,10]
["2021-12-01",{"$f":"VLOOKUP(J1286,'Control Panel'!$G$132:$K$171,5,FALSE)","v":"WF-1"},"WF",null,null,null,null,null,null,"F86626",null,6933,29,27,27,27,27,3,35,31,26,26,26,26,19,18,16,12,15,13]
["2021-12-01",{"$f":"VLOOKUP(J1287,'Control Panel'!$G$132:$K$171,5,FALSE)","v":"WF-2"},"WF",null,null,null,null,null,null,"F86627",null,13287,36,34,32,34,32,6,32,29,24,25,24,24,40,39,35,30,36,30]
["2021-12-01",{"$f":"VLOOKUP(J1288,'Control Panel'!$G$132:$K$171,5,FALSE)","v":"WF-6"},"WF",null,null,null,null,null,null,"F86644",null,9406,16,16,16,16,15,3,11,10,8,7,8,7,30,29,28,26,30,28]
["2021-12-01",{"$f":"VLOOKUP(J1289,'Control Panel'!$G$132:$K$171,5,FALSE)","v":"WF-4"},"WF",null,null,null,null,null,null,"F86650",null,8075,39,33,33,34,33,5,28,24,22,21,22,19,24,22,22,14,22,14]
["2021-12-01",{"$f":"VLOOKUP(J1290,'Control Panel'!$G$132:$K$171,5,FALSE)","v":"WF-1"},"WF",null,null,null,null,null,null,"F86664",null,8435,23,21,21,22,21,3,27,26,26,26,25,25,26,22,24,17,24,17]
["2021-12-01",{"$f":"VLOOKUP(J1291,'Control Panel'!$G$132:$K$171,5,FALSE)","v":"WF-5"},"WF",null,null,null,null,null,null,"F86666",null,14888,38,37,34,35,36,3,44,33,33,34,32,34,33,30,26,22,28,27]
["2021-12-01",{"$f":"VLOOKUP(J1292,'Control Panel'!$G$132:$K$171,5,FALSE)","v":"WF-7"},"WF",null,null,null,null,null,null,"F86679",null,6272,22,19,19,21,21,4,35,33,30,30,30,29,20,19,18,13,19,13]
["2021-12-01",{"$f":"VLOOKUP(J1293,'Control Panel'!$G$132:$K$171,5,FALSE)","v":"WF-1"},"WF",null,null,null,null,null,null,"F86689",null,4372,19,19,19,19,19,1,19,17,19,19,19,19,27,26,27,24,27,24]
["2021-12-01",{"$f":"VLOOKUP(J1294,'Control Panel'!$G$132:$K$171,5,FALSE)","v":"WF-4"},"WF",null,null,null,null,null,null,"F86696",null,6837,21,16,16,19,19,2,26,25,23,23,23,23,21,17,18,17,18,17]
["2021-12-01",{"$f":"VLOOKUP(J1295,'Control Panel'!$G$132:$K$171,5,FALSE)","v":"WF-1"},"WF",null,null,null,null,null,null,"F86700",null,3887,0,0,0,0,0,0,8,7,6,6,6,6,14,12,11,12,11,12]
["2021-12-01",{"$f":"VLOOKUP(J1296,'Control Panel'!$G$132:$K$171,5,FALSE)","v":"WF-5"},"WF",null,null,null,null,null,null,"F86701",null,3787,17,14,14,14,14,4,12,11,8,8,7,8,12,11,10,9,11,10]
["2021-12-01",{"$f":"VLOOKUP(J1297,'Control Panel'!$G$132:$K$171,5,FALSE)","v":"WF-5"},"WF",null,null,null,null,null,null,"F86705",null,3547,7,7,6,6,6,3,9,9,8,8,8,8,6,6,5,5,5,5]
["2021-12-01",{"$f":"VLOOKUP(J1298,'Control Panel'!$G$132:$K$171,5,FALSE)","v":"WF-6"},"WF",null,null,null,null,null,null,"F86708",null,2894,5,5,5,5,5,0,5,5,5,5,5,5,8,7,7,5,7,5]
["2021-12-01",{"$f":"VLOOKUP(J1299,'Control Panel'!$G$132:$K$171,5,FALSE)","v":"WF-4"},"WF",null,null,null,null,null,null,"F86712",null,3370,11,11,11,11,11,3,5,5,5,5,5,5,10,10,10,10,10,10]
["2021-12-01",{"$f":"VLOOKUP(J1300,'Control Panel'!$G$132:$K$171,5,FALSE)","v":"WF-2"},"WF",null,null,null,null,null,null,"Y01291",null,9074,26,24,24,25,24,7,36,35,33,33,34,33,16,16,16,15,16,16]
["2021-12-01",{"$f":"VLOOKUP(J1301,'Control Panel'!$G$132:$K$171,5,FALSE)","v":"WF-1"},"WF",null,null,null,null,null,null,"Y01839",null,6271,21,20,19,21,21,3,22,18,17,17,17,17,24,24,23,19,23,19]
["2021-12-01",{"$f":"VLOOKUP(J1302,'Control Panel'!$G$132:$K$171,5,FALSE)","v":{"$error":"#N/A"}},null,null,null,null,null,null,null,"Total",null,269368,818,742,731,753,733,125,890,776,727,730,728,733,820,743,719,596,722,623]
["2021-12-01",{"$f":"VLOOKUP(J1303,'Control Panel'!$G$132:$K$171,5,FALSE)","v":"WF-2"},"WF",null,null,null,null,null,null,"F86004",null,15965,44,42,40,40,40,6,50,49,31,45,47,47,73,49,68,57,53,9]
["2021-12-01",{"$f":"VLOOKUP(J1304,'Control Panel'!$G$132:$K$171,5,FALSE)","v":"WF-4"},"WF",null,null,null,null,null,null,"F86018",null,9972,22,21,18,19,0,4,30,27,2,23,25,24,23,19,3,19,20,0]
["2021-12-01",{"$f":"VLOOKUP(J1305,'Control Panel'!$G$132:$K$171,5,FALSE)","v":"WF-1"},"WF",null,null,null,null,null,null,"F86026",null,7276,16,14,13,12,10,0,22,20,1,19,21,19,23,11,14,16,11,1]
["2021-12-01",{"$f":"VLOOKUP(J1306,'Control Panel'!$G$132:$K$171,5,FALSE)","v":"WF-3"},"WF",null,null,null,null,null,null,"F86074",null,15221,47,45,43,41,1,16,56,46,22,44,46,45,53,31,34,34,31,2]
["2021-12-01",{"$f":"VLOOKUP(J1307,'Control Panel'!$G$132:$K$171,5,FALSE)","v":"WF-1"},"WF",null,null,null,null,null,null,"F86638",null,5270,15,12,12,12,0,0,17,15,0,13,14,15,15,10,8,10,12,1]
["2022-01-01",{"$f":"VLOOKUP(J1308,'Control Panel'!$G$132:$K$171,5,FALSE)","v":{"$error":"#N/A"}}]
["2022-01-01",{"$f":"VLOOKUP(J1309,'Control Panel'!$G$132:$K$171,5,FALSE)","v":{"$error":"#N/A"}},"Childhood Immunisations Q3",null,"Last Run:",null,"Population Count",281962,null,null,"Search","All Patients","(01) 12 MONTH COHORT","(01.01) DTaP/IPV/Hib 6in1","(01.02) Men B (1st and 2nd)","(01.03) PCV","(01.04) Rotavirus","(01.05) BCG","(02) 24 MONTH COHORT","(02.01) DTaP/IPV/Hib Combined","(02.02) MMR","(02.03) HiB/Men C","(02.04) PCV (Booster)","(02.05) Men B (Booster)","(03) 5 YEAR COHORT","(03.01) DTaP/IPV/Hib Combined","(03.02) MMR (Primary)","(03.03) DTaP/IPV (Booster)","(03.04) HiB/Men C","(03.05) MMR (Booster)"]
["2022-01-01",{"$f":"VLOOKUP(J1310,'Control Panel'!$G$132:$K$171,5,FALSE)","v":{"$error":"#N/A"}},null,null,"2022-02-22T16:10:00",null,"Males",145606,null,"Organisation Code"]
["2022-01-01",{"$f":"VLOOKUP(J1311,'Control Panel'!$G$132:$K$171,5,FALSE)","v":"WF-6"},"WF",null,"Relative Date:",null,"Females",136356,null,"F86001",null,7719,24,22,22,23,22,1,20,16,15,15,15,15,21,16,16,11,15,15]
["2022-01-01",{"$f":"VLOOKUP(J1312,'Control Panel'!$G$132:$K$171,5,FALSE)","v":"WF-1"},"WF",null,"2022-02-01",null,null,null,null,"F86005",null,9497,42,40,40,40,41,3,44,44,43,42,43,43,24,21,22,19,22,20]
["2022-01-01",{"$f":"VLOOKUP(J1313,'Control Panel'!$G$132:$K$171,5,FALSE)","v":"WF-7"},"WF",null,null,null,null,null,null,"F86006",null,6779,22,21,21,22,21,6,18,15,14,14,14,15,13,13,13,12,13,12]
["2022-01-01",{"$f":"VLOOKUP(J1314,'Control Panel'!$G$132:$K$171,5,FALSE)","v":"WF-3"},"WF",null,null,null,null,null,null,"F86011",null,9690,19,17,17,18,14,4,20,16,16,15,15,16,34,33,33,27,33,28]
["2022-01-01",{"$f":"VLOOKUP(J1315,'Control Panel'!$G$132:$K$171,5,FALSE)","v":"WF-7"},"WF",null,null,null,null,null,null,"F86030",null,8090,23,19,19,20,19,1,31,30,30,30,29,30,21,20,20,19,20,19]
["2022-01-01",{"$f":"VLOOKUP(J1316,'Control Panel'!$G$132:$K$171,5,FALSE)","v":"WF-4"},"WF",null,null,null,null,null,null,"F86036",null,14823,39,37,37,37,36,7,50,42,42,42,44,42,43,41,41,38,40,37]
["2022-01-01",{"$f":"VLOOKUP(J1317,'Control Panel'!$G$132:$K$171,5,FALSE)","v":"WF-3"},"WF",null,null,null,null,null,null,"F86038",null,11266,36,33,32,32,32,5,42,39,36,36,36,38,35,32,29,30,31,32]
["2022-01-01",{"$f":"VLOOKUP(J1318,'Control Panel'!$G$132:$K$171,5,FALSE)","v":"WF-4"},"WF",null,null,null,null,null,null,"F86044",null,10506,45,39,37,38,38,11,41,32,34,35,35,33,38,28,26,20,27,21]
["2022-01-01",{"$f":"VLOOKUP(J1319,'Control Panel'!$G$132:$K$171,5,FALSE)","v":"WF-5"},"WF",null,null,null,null,null,null,"F86045",null,2025,2,2,2,2,2,1,1,1,1,1,1,1,2,1,1,1,1,1]
["2022-01-01",{"$f":"VLOOKUP(J1320,'Control Panel'!$G$132:$K$171,5,FALSE)","v":"WF-7"},"WF",null,null,null,null,null,null,"F86058",null,16746,48,42,42,43,39,11,65,54,53,53,53,54,51,45,42,25,40,27]
["2022-01-01",{"$f":"VLOOKUP(J1321,'Control Panel'!$G$132:$K$171,5,FALSE)","v":"WF-7"},"WF",null,null,null,null,null,null,"F86062",null,7195,19,15,15,16,16,0,25,17,17,17,18,18,27,25,25,19,24,20]
["2022-01-01",{"$f":"VLOOKUP(J1322,'Control Panel'!$G$132:$K$171,5,FALSE)","v":"WF-2"},"WF",null,null,null,null,null,null,"F86078",null,6897,10,10,10,10,10,1,10,9,9,8,9,8,21,19,19,14,19,14]
["2022-01-01",{"$f":"VLOOKUP(J1323,'Control Panel'!$G$132:$K$171,5,FALSE)","v":"WF-6"},"WF",null,null,null,null,null,null,"F86086",null,6209,20,17,17,18,18,1,30,26,22,22,22,23,19,16,15,9,15,12]
["2022-01-01",{"$f":"VLOOKUP(J1324,'Control Panel'!$G$132:$K$171,5,FALSE)","v":"WF-4"},"WF",null,null,null,null,null,null,"F86088",null,4997,16,14,13,13,12,5,10,8,6,7,8,7,15,13,11,8,11,8]
["2022-01-01",{"$f":"VLOOKUP(J1325,'Control Panel'!$G$132:$K$171,5,FALSE)","v":"WF-6"},"WF",null,null,null,null,null,null,"F86607",null,15418,49,46,46,46,45,3,60,53,46,47,45,49,53,49,49,43,48,45]
["2022-01-01",{"$f":"VLOOKUP(J1326,'Control Panel'!$G$132:$K$171,5,FALSE)","v":"WF-2"},"WF",null,null,null,null,null,null,"F86616",null,7943,30,27,27,28,27,6,32,26,25,25,25,26,37,30,32,28,32,28]
["2022-01-01",{"$f":"VLOOKUP(J1327,'Control Panel'!$G$132:$K$171,5,FALSE)","v":"WF-5"},"WF",null,null,null,null,null,null,"F86621",null,6381,24,23,23,23,22,7,19,16,16,16,15,15,16,16,15,14,15,15]
["2022-01-01",{"$f":"VLOOKUP(J1328,'Control Panel'!$G$132:$K$171,5,FALSE)","v":"WF-5"},"WF",null,null,null,null,null,null,"F86625",null,5898,12,10,10,10,10,3,17,14,9,9,9,9,17,16,16,9,14,10]
["2022-01-01",{"$f":"VLOOKUP(J1329,'Control Panel'!$G$132:$K$171,5,FALSE)","v":"WF-1"},"WF",null,null,null,null,null,null,"F86626",null,6973,30,28,28,28,28,3,36,32,29,29,28,28,18,17,15,13,15,14]
["2022-01-01",{"$f":"VLOOKUP(J1330,'Control Panel'!$G$132:$K$171,5,FALSE)","v":"WF-2"},"WF",null,null,null,null,null,null,"F86627",null,13269,36,34,32,34,33,6,32,29,25,26,25,25,40,39,35,30,36,30]
["2022-01-01",{"$f":"VLOOKUP(J1331,'Control Panel'!$G$132:$K$171,5,FALSE)","v":"WF-6"},"WF",null,null,null,null,null,null,"F86644",null,9337,15,15,15,15,14,3,10,9,8,7,8,7,31,30,29,27,31,29]
["2022-01-01",{"$f":"VLOOKUP(J1332,'Control Panel'!$G$132:$K$171,5,FALSE)","v":"WF-4"},"WF",null,null,null,null,null,null,"F86650",null,8046,38,32,32,33,32,5,27,24,23,22,23,20,24,22,22,14,22,14]
["2022-01-01",{"$f":"VLOOKUP(J1333,'Control Panel'!$G$132:$K$171,5,FALSE)","v":"WF-1"},"WF",null,null,null,null,null,null,"F86664",null,8450,23,21,21,22,21,3,28,26,27,27,26,25,26,22,24,17,24,17]
["2022-01-01",{"$f":"VLOOKUP(J1334,'Control Panel'!$G$132:$K$171,5,FALSE)","v":"WF-5"},"WF",null,null,null,null,null,null,"F86666",null,14904,38,37,34,35,36,3,44,33,33,34,32,34,33,30,26,22,28,27]
["2022-01-01",{"$f":"VLOOKUP(J1335,'Control Panel'!$G$132:$K$171,5,FALSE)","v":"WF-7"},"WF",null,null,null,null,null,null,"F86679",null,6303,24,21,21,23,23,4,35,33,30,30,30,29,20,19,18,13,19,13]
["2022-01-01",{"$f":"VLOOKUP(J1336,'Control Panel'!$G$132:$K$171,5,FALSE)","v":"WF-1"},"WF",null,null,null,null,null,null,"F86689",null,4368,18,18,18,18,18,1,19,17,19,19,19,19,27,26,27,24,27,24]
["2022-01-01",{"$f":"VLOOKUP(J1337,'Control Panel'!$G$132:$K$171,5,FALSE)","v":"WF-4"},"WF",null,null,null,null,null,null,"F86696",null,6806,20,15,15,18,18,2,26,25,23,23,23,23,20,16,17,16,17,16]
["2022-01-01",{"$f":"VLOOKUP(J1338,'Control Panel'!$G$132:$K$171,5,FALSE)","v":"WF-1"},"WF",null,null,null,null,null,null,"F86700",null,3856,0,0,0,0,0,0,8,7,6,6,6,6,14,12,11,12,11,12]
["2022-01-01",{"$f":"VLOOKUP(J1339,'Control Panel'!$G$132:$K$171,5,FALSE)","v":"WF-5"},"WF",null,null,null,null,null,null,"F86701",null,3822,16,13,13,13,13,4,12,11,8,8,7,8,11,11,10,9,11,10]
["2022-01-01",{"$f":"VLOOKUP(J1340,'Control Panel'!$G$132:$K$171,5,FALSE)","v":"WF-5"},"WF",null,null,null,null,null,null,"F86705",null,3540,7,7,6,6,6,3,8,8,7,7,7,7,6,6,5,5,5,5]
["2022-01-01",{"$f":"VLOOKUP(J1341,'Control Panel'!$G$132:$K$171,5,FALSE)","v":"WF-6"},"WF",null,null,null,null,null,null,"F86708",null,2789,5,5,5,5,5,0,5,5,5,5,5,5,9,8,8,6,8,6]
["2022-01-01",{"$f":"VLOOKUP(J1342,'Control Panel'!$G$132:$K$171,5,FALSE)","v":"WF-4"},"WF",null,null,null,null,null,null,"F86712",null,3370,10,10,10,10,10,3,5,5,5,5,5,5,10,10,10,10,10,10]
["2022-01-01",{"$f":"VLOOKUP(J1343,'Control Panel'!$G$132:$K$171,5,FALSE)","v":"WF-2"},"WF",null,null,null,null,null,null,"Y01291",null,9118,26,24,24,25,24,7,33,32,30,31,31,31,18,17,17,15,17,17]
["2022-01-01",{"$f":"VLOOKUP(J1344,'Control Panel'!$G$132:$K$171,5,FALSE)","v":"WF-1"},"WF",null,null,null,null,null,null,"Y01839",null,6264,21,20,19,21,21,3,22,18,17,17,17,17,24,24,23,19,23,19]
["2022-01-01",{"$f":"VLOOKUP(J1345,'Control Panel'!$G$132:$K$171,5,FALSE)","v":{"$error":"#N/A"}},null,null,null,null,null,null,null,"Total",null,269294,807,734,723,745,726,126,885,772,729,730,728,731,818,743,722,598,724,627]
["2022-01-01",{"$f":"VLOOKUP(J1346,'Control Panel'!$G$132:$K$171,5,FALSE)","v":{"$error":"#N/A"}},"WF"]
["2022-01-01",{"$f":"VLOOKUP(J1347,'Control Panel'!$G$132:$K$171,5,FALSE)","v":"WF-2"},"WF",null,null,null,null,null,null,"F86004",null,15955,43,41,39,39,39,6,50,48,32,45,47,47,75,49,69,57,54,9]
["2022-01-01",{"$f":"VLOOKUP(J1348,'Control Panel'!$G$132:$K$171,5,FALSE)","v":"WF-4"},"WF",null,null,null,null,null,null,"F86018",null,9940,22,20,17,18,0,4,29,27,3,22,25,24,24,19,4,20,21,0]
["2022-01-01",{"$f":"VLOOKUP(J1349,'Control Panel'!$G$132:$K$171,5,FALSE)","v":"WF-1"},"WF",null,null,null,null,null,null,"F86026",null,7232,16,14,13,12,10,0,22,19,2,18,20,18,22,11,13,15,10,1]
["2022-01-01",{"$f":"VLOOKUP(J1350,'Control Panel'!$G$132:$K$171,5,FALSE)","v":"WF-3"},"WF",null,null,null,null,null,null,"F86074",null,15137,44,42,40,38,1,15,56,46,22,44,46,45,53,31,34,34,31,2]
["2022-01-01",{"$f":"VLOOKUP(J1351,'Control Panel'!$G$132:$K$171,5,FALSE)","v":"WF-1"},null,null,null,null,null,null,null,"F86638",null,5227,16,12,12,12,0,0,17,14,0,13,13,14,15,10,7,10,11,1]
["2022-02-01",{"$f":"VLOOKUP(J1352,'Control Panel'!$G$132:$K$171,5,FALSE)","v":{"$error":"#N/A"}},"Childhood Immunisations Q4",null,"Last Run:",null,"Population Count",281711,null,null,"Search","All Patients","(01) 12 MONTH COHORT","(01.01) DTaP/IPV/Hib 6in1","(01.02) Men B (1st and 2nd)","(01.03) PCV","(01.04) Rotavirus","(01.05) BCG","(02) 24 MONTH COHORT","(02.01) DTaP/IPV/Hib Combined","(02.02) MMR","(02.03) HiB/Men C","(02.04) PCV (Booster)","(02.05) Men B (Booster)","(03) 5 YEAR COHORT","(03.01) DTaP/IPV/Hib Combined","(03.02) MMR (Primary)","(03.03) DTaP/IPV (Booster)","(03.04) HiB/Men C","(03.05) MMR (Booster)"]
["2022-02-01",{"$f":"VLOOKUP(J1353,'Control Panel'!$G$132:$K$171,5,FALSE)","v":{"$error":"#N/A"}},null,null,"2022-03-10T14:30:00",null,"Males",145475,null,"Organisation Code"]
["2022-02-01",{"$f":"VLOOKUP(J1354,'Control Panel'!$G$132:$K$171,5,FALSE)","v":"WF-6"},"WF",null,"Relative Date:",null,"Females",136236,null,"F86001",null,7737,15,10,9,11,12,5,19,17,15,15,15,16,29,29,27,26,28,26]
["2022-02-01",{"$f":"VLOOKUP(J1355,'Control Panel'!$G$132:$K$171,5,FALSE)","v":"WF-1"},"WF",null,"2022-03-01",null,null,null,null,"F86005",null,9521,43,41,40,42,39,2,51,49,49,49,48,48,31,28,28,22,28,23]
["2022-02-01",{"$f":"VLOOKUP(J1356,'Control Panel'!$G$132:$K$171,5,FALSE)","v":"WF-7"},"WF",null,null,null,null,null,null,"F86006",null,6809,19,15,15,15,15,4,19,16,17,17,17,17,22,17,19,14,18,15]
["2022-02-01",{"$f":"VLOOKUP(J1357,'Control Panel'!$G$132:$K$171,5,FALSE)","v":"WF-3"},"WF",null,null,null,null,null,null,"F86011",null,9692,22,19,19,20,19,3,22,21,18,18,18,18,18,16,15,11,15,12]
["2022-02-01",{"$f":"VLOOKUP(J1358,'Control Panel'!$G$132:$K$171,5,FALSE)","v":"WF-7"},"WF",null,null,null,null,null,null,"F86030",null,8104,23,21,21,23,22,1,23,22,22,22,22,22,27,24,23,20,22,20]
["2022-02-01",{"$f":"VLOOKUP(J1359,'Control Panel'!$G$132:$K$171,5,FALSE)","v":"WF-4"},"WF",null,null,null,null,null,null,"F86036",null,14783,42,40,40,40,40,6,33,31,31,31,31,31,40,40,39,36,38,36]
["2022-02-01",{"$f":"VLOOKUP(J1360,'Control Panel'!$G$132:$K$171,5,FALSE)","v":"WF-3"},"WF",null,null,null,null,null,null,"F86038",null,11105,28,23,23,25,24,5,28,25,25,25,26,24,23,22,22,20,21,21]
["2022-02-01",{"$f":"VLOOKUP(J1361,'Control Panel'!$G$132:$K$171,5,FALSE)","v":"WF-4"},"WF",null,null,null,null,null,null,"F86044",null,10688,35,29,29,32,30,7,39,33,33,33,33,32,30,24,22,16,22,17]
["2022-02-01",{"$f":"VLOOKUP(J1362,'Control Panel'!$G$132:$K$171,5,FALSE)","v":"WF-5"},"WF",null,null,null,null,null,null,"F86045",null,2027,4,4,4,4,4,1,6,6,5,5,5,5,5,4,4,4,4,4]
["2022-02-01",{"$f":"VLOOKUP(J1363,'Control Panel'!$G$132:$K$171,5,FALSE)","v":"WF-7"},"WF",null,null,null,null,null,null,"F86058",null,16716,61,51,50,52,50,6,69,56,53,53,54,53,43,40,37,30,37,31]
["2022-02-01",{"$f":"VLOOKUP(J1364,'Control Panel'!$G$132:$K$171,5,FALSE)","v":"WF-7"},"WF",null,null,null,null,null,null,"F86062",null,7170,25,21,18,21,22,1,8,7,6,6,6,6,21,19,17,10,16,10]
["2022-02-01",{"$f":"VLOOKUP(J1365,'Control Panel'!$G$132:$K$171,5,FALSE)","v":"WF-2"},"WF",null,null,null,null,null,null,"F86078",null,6868,12,11,12,12,11,1,10,10,9,9,9,9,13,13,13,11,12,11]
["2022-02-01",{"$f":"VLOOKUP(J1366,'Control Panel'!$G$132:$K$171,5,FALSE)","v":"WF-6"},"WF",null,null,null,null,null,null,"F86086",null,6250,22,19,19,22,19,3,28,24,21,21,21,21,28,26,25,21,26,22]
["2022-02-01",{"$f":"VLOOKUP(J1367,'Control Panel'!$G$132:$K$171,5,FALSE)","v":"WF-4"},"WF",null,null,null,null,null,null,"F86088",null,5002,16,15,15,15,14,2,10,8,9,9,9,9,14,14,14,12,13,12]
["2022-02-01",{"$f":"VLOOKUP(J1368,'Control Panel'!$G$132:$K$171,5,FALSE)","v":"WF-6"},"WF",null,null,null,null,null,null,"F86607",null,15450,53,51,52,53,50,7,48,44,41,41,41,41,45,42,43,42,42,42]
["2022-02-01",{"$f":"VLOOKUP(J1369,'Control Panel'!$G$132:$K$171,5,FALSE)","v":"WF-2"},"WF",null,null,null,null,null,null,"F86616",null,7970,36,36,36,36,33,5,35,30,26,27,27,27,28,25,23,23,22,22]
["2022-02-01",{"$f":"VLOOKUP(J1370,'Control Panel'!$G$132:$K$171,5,FALSE)","v":"WF-5"},"WF",null,null,null,null,null,null,"F86621",null,6416,12,9,8,10,10,2,24,22,21,21,21,20,14,12,13,12,13,13]
["2022-02-01",{"$f":"VLOOKUP(J1371,'Control Panel'!$G$132:$K$171,5,FALSE)","v":"WF-5"},"WF",null,null,null,null,null,null,"F86625",null,5880,6,5,5,5,4,1,10,8,8,8,8,8,17,16,15,15,15,14]
["2022-02-01",{"$f":"VLOOKUP(J1372,'Control Panel'!$G$132:$K$171,5,FALSE)","v":"WF-1"},"WF",null,null,null,null,null,null,"F86626",null,6995,24,21,22,23,21,3,23,19,21,19,19,20,14,13,13,12,13,12]
["2022-02-01",{"$f":"VLOOKUP(J1373,'Control Panel'!$G$132:$K$171,5,FALSE)","v":"WF-2"},"WF",null,null,null,null,null,null,"F86627",null,13277,24,23,23,24,21,5,31,30,26,26,25,26,30,30,30,27,30,27]
["2022-02-01",{"$f":"VLOOKUP(J1374,'Control Panel'!$G$132:$K$171,5,FALSE)","v":"WF-6"},"WF",null,null,null,null,null,null,"F86644",null,9302,19,19,19,19,18,2,21,20,18,20,20,20,28,26,27,19,26,24]
["2022-02-01",{"$f":"VLOOKUP(J1375,'Control Panel'!$G$132:$K$171,5,FALSE)","v":"WF-4"},"WF",null,null,null,null,null,null,"F86650",null,8066,23,17,17,18,15,3,20,17,16,16,16,16,19,17,16,13,17,13]
["2022-02-01",{"$f":"VLOOKUP(J1376,'Control Panel'!$G$132:$K$171,5,FALSE)","v":"WF-1"},"WF",null,null,null,null,null,null,"F86664",null,8449,16,16,16,16,16,0,35,33,32,32,32,32,23,23,22,20,22,20]
["2022-02-01",{"$f":"VLOOKUP(J1377,'Control Panel'!$G$132:$K$171,5,FALSE)","v":"WF-5"},"WF",null,null,null,null,null,null,"F86666",null,14944,41,39,39,40,37,5,46,41,39,39,40,40,48,41,37,18,38,35]
["2022-02-01",{"$f":"VLOOKUP(J1378,'Control Panel'!$G$132:$K$171,5,FALSE)","v":"WF-7"},"WF",null,null,null,null,null,null,"F86679",null,6359,31,28,28,28,28,8,27,25,22,22,22,22,28,24,24,16,23,16]
["2022-02-01",{"$f":"VLOOKUP(J1379,'Control Panel'!$G$132:$K$171,5,FALSE)","v":"WF-1"},"WF",null,null,null,null,null,null,"F86689",null,4373,33,28,28,28,27,2,24,22,24,24,24,23,18,18,18,18,18,18]
["2022-02-01",{"$f":"VLOOKUP(J1380,'Control Panel'!$G$132:$K$171,5,FALSE)","v":"WF-4"},"WF",null,null,null,null,null,null,"F86696",null,6841,32,23,22,26,23,4,22,20,17,17,17,17,16,15,15,11,15,11]
["2022-02-01",{"$f":"VLOOKUP(J1381,'Control Panel'!$G$132:$K$171,5,FALSE)","v":"WF-1"},"WF",null,null,null,null,null,null,"F86700",null,3846,7,5,5,6,5,0,12,10,9,9,9,9,13,12,10,9,11,9]
["2022-02-01",{"$f":"VLOOKUP(J1382,'Control Panel'!$G$132:$K$171,5,FALSE)","v":"WF-5"},"WF",null,null,null,null,null,null,"F86701",null,3826,9,7,7,7,7,4,11,9,8,8,9,9,7,6,5,3,5,2]
["2022-02-01",{"$f":"VLOOKUP(J1383,'Control Panel'!$G$132:$K$171,5,FALSE)","v":"WF-5"},"WF",null,null,null,null,null,null,"F86705",null,3533,14,13,13,14,14,5,5,5,3,3,3,3,9,8,7,7,7,8]
["2022-02-01",{"$f":"VLOOKUP(J1384,'Control Panel'!$G$132:$K$171,5,FALSE)","v":"WF-6"},"WF",null,null,null,null,null,null,"F86708",null,2788,6,5,5,5,5,2,6,5,5,5,5,5,9,7,7,5,7,5]
["2022-02-01",{"$f":"VLOOKUP(J1385,'Control Panel'!$G$132:$K$171,5,FALSE)","v":"WF-4"},"WF",null,null,null,null,null,null,"F86712",null,3368,10,10,9,10,10,2,7,6,5,5,5,5,6,6,6,6,6,6]
["2022-02-01",{"$f":"VLOOKUP(J1386,'Control Panel'!$G$132:$K$171,5,FALSE)","v":"WF-2"},"WF",null,null,null,null,null,null,"Y01291",null,9168,26,25,25,26,24,13,24,22,22,22,22,22,35,33,33,33,34,32]
["2022-02-01",{"$f":"VLOOKUP(J1387,'Control Panel'!$G$132:$K$171,5,FALSE)","v":"WF-1"},"WF",null,null,null,null,null,null,"Y01839",null,6238,19,17,17,18,17,3,17,15,16,16,16,16,23,20,19,12,18,11]
["2022-02-01",{"$f":"VLOOKUP(J1388,'Control Panel'!$G$132:$K$171,5,FALSE)","v":{"$error":"#N/A"}},null,null,null,null,null,null,null,"Total",null,269561,808,716,710,746,706,123,813,728,692,693,695,692,774,710,688,574,682,600]
["2022-02-01",{"$f":"VLOOKUP(J1389,'Control Panel'!$G$132:$K$171,5,FALSE)","v":"WF-2"},"WF",null,null,null,null,null,null,"F86004",null,15981,44,41,39,39,39,6,51,49,33,45,48,47,75,49,69,57,54,9]
["2022-02-01",{"$f":"VLOOKUP(J1390,'Control Panel'!$G$132:$K$171,5,FALSE)","v":"WF-4"},"WF",null,null,null,null,null,null,"F86018",null,9945,22,20,17,18,0,4,30,27,3,22,25,24,24,19,4,20,21,0]
["2022-02-01",{"$f":"VLOOKUP(J1391,'Control Panel'!$G$132:$K$171,5,FALSE)","v":"WF-1"},"WF",null,null,null,null,null,null,"F86026",null,7200,16,14,13,12,10,0,22,19,2,18,20,18,22,11,13,15,10,1]
["2022-02-01",{"$f":"VLOOKUP(J1392,'Control Panel'!$G$132:$K$171,5,FALSE)","v":"WF-3"},"WF",null,null,null,null,null,null,"F86074",null,15101,44,42,40,38,1,15,57,47,22,44,47,46,53,31,34,34,31,2]
["2022-02-01",{"$f":"VLOOKUP(J1393,'Control Panel'!$G$132:$K$171,5,FALSE)","v":"WF-1"},"WF",null,null,null,null,null,null,"F86638",null,5221,16,12,12,12,0,0,16,14,0,13,13,14,15,10,7,10,11,1]
["2022-03-01",{"$f":"VLOOKUP(J1394,'Control Panel'!$G$132:$K$171,5,FALSE)","v":{"$error":"#N/A"}},"Childhood Immunisations Q4",null,"Last Run:",null,"Population Count",282061,null,null,"Search","All Patients","(01) 12 MONTH COHORT","(01.01) DTaP/IPV/Hib 6in1","(01.02) Men B (1st and 2nd)","(01.03) PCV","(01.04) Rotavirus","(01.05) BCG","(02) 24 MONTH COHORT","(02.01) DTaP/IPV/Hib Combined","(02.02) MMR","(02.03) HiB/Men C","(02.04) PCV (Booster)","(02.05) Men B (Booster)","(03) 5 YEAR COHORT","(03.01) DTaP/IPV/Hib Combined","(03.02) MMR (Primary)","(03.03) DTaP/IPV (Booster)","(03.04) HiB/Men C","(03.05) MMR (Booster)"]
["2022-03-01",{"$f":"VLOOKUP(J1395,'Control Panel'!$G$132:$K$171,5,FALSE)","v":{"$error":"#N/A"}},null,null,"2022-04-04T11:33:00",null,"Males",145764,null,"Organisation Code"]
["2022-03-01",{"$f":"VLOOKUP(J1396,'Control Panel'!$G$132:$K$171,5,FALSE)","v":"WF-6"},"WF",null,"Relative Date:",null,"Females",136297,null,"F86001",null,7729,15,10,9,11,12,5,20,18,15,15,15,16,30,30,28,27,29,27]
["2022-03-01",{"$f":"VLOOKUP(J1397,'Control Panel'!$G$132:$K$171,5,FALSE)","v":"WF-1"},"WF",null,"2022-04-01",null,null,null,null,"F86005",null,9510,42,40,39,41,38,2,51,49,49,49,48,48,30,27,26,22,27,23]
["2022-03-01",{"$f":"VLOOKUP(J1398,'Control Panel'!$G$132:$K$171,5,FALSE)","v":"WF-7"},"WF",null,null,null,null,null,null,"F86006",null,6825,19,15,15,15,15,4,19,17,17,17,16,17,21,16,18,13,17,14]
["2022-03-01",{"$f":"VLOOKUP(J1399,'Control Panel'!$G$132:$K$171,5,FALSE)","v":"WF-3"},"WF",null,null,null,null,null,null,"F86011",null,9698,21,18,18,19,18,3,22,21,18,18,18,18,18,16,15,11,15,12]
["2022-03-01",{"$f":"VLOOKUP(J1400,'Control Panel'!$G$132:$K$171,5,FALSE)","v":"WF-7"},"WF",null,null,null,null,null,null,"F86030",null,8161,23,21,21,23,22,1,22,21,21,21,21,21,27,24,24,20,23,20]
["2022-03-01",{"$f":"VLOOKUP(J1401,'Control Panel'!$G$132:$K$171,5,FALSE)","v":"WF-4"},"WF",null,null,null,null,null,null,"F86036",null,14732,42,40,40,40,40,6,32,30,30,30,30,30,41,41,40,37,39,37]
["2022-03-01",{"$f":"VLOOKUP(J1402,'Control Panel'!$G$132:$K$171,5,FALSE)","v":"WF-3"},"WF",null,null,null,null,null,null,"F86038",null,11105,28,23,23,25,24,5,28,25,25,25,26,24,23,22,22,20,21,21]
["2022-03-01",{"$f":"VLOOKUP(J1403,'Control Panel'!$G$132:$K$171,5,FALSE)","v":"WF-4"},"WF",null,null,null,null,null,null,"F86044",null,10802,35,30,30,32,30,7,39,33,33,33,33,32,30,24,22,16,22,17]
["2022-03-01",{"$f":"VLOOKUP(J1404,'Control Panel'!$G$132:$K$171,5,FALSE)","v":"WF-5"},"WF",null,null,null,null,null,null,"F86045",null,2026,4,4,4,4,4,1,6,6,5,5,5,5,5,4,4,4,4,4]
["2022-03-01",{"$f":"VLOOKUP(J1405,'Control Panel'!$G$132:$K$171,5,FALSE)","v":"WF-7"},"WF",null,null,null,null,null,null,"F86058",null,16561,61,51,50,53,51,7,69,56,53,53,54,53,43,40,38,31,38,32]
["2022-03-01",{"$f":"VLOOKUP(J1406,'Control Panel'!$G$132:$K$171,5,FALSE)","v":"WF-7"},"WF",null,null,null,null,null,null,"F86062",null,7155,24,20,17,20,21,1,8,6,5,5,5,5,21,19,17,10,16,10]
["2022-03-01",{"$f":"VLOOKUP(J1407,'Control Panel'!$G$132:$K$171,5,FALSE)","v":"WF-2"},"WF",null,null,null,null,null,null,"F86078",null,6869,12,11,12,12,11,1,9,9,9,9,9,9,13,13,13,11,12,11]
["2022-03-01",{"$f":"VLOOKUP(J1408,'Control Panel'!$G$132:$K$171,5,FALSE)","v":"WF-6"},"WF",null,null,null,null,null,null,"F86086",null,6265,22,19,19,22,19,3,28,24,21,21,21,21,28,26,25,21,26,22]
["2022-03-01",{"$f":"VLOOKUP(J1409,'Control Panel'!$G$132:$K$171,5,FALSE)","v":"WF-4"},"WF",null,null,null,null,null,null,"F86088",null,5027,16,15,15,15,14,2,10,8,9,9,9,9,14,14,14,12,13,12]
["2022-03-01",{"$f":"VLOOKUP(J1410,'Control Panel'!$G$132:$K$171,5,FALSE)","v":"WF-6"},"WF",null,null,null,null,null,null,"F86607",null,15547,57,56,57,57,54,7,48,44,41,41,41,41,47,42,43,42,42,42]
["2022-03-01",{"$f":"VLOOKUP(J1411,'Control Panel'!$G$132:$K$171,5,FALSE)","v":"WF-2"},"WF",null,null,null,null,null,null,"F86616",null,7996,36,36,36,36,33,5,35,30,26,27,27,27,27,24,23,23,22,22]
["2022-03-01",{"$f":"VLOOKUP(J1412,'Control Panel'!$G$132:$K$171,5,FALSE)","v":"WF-5"},"WF",null,null,null,null,null,null,"F86621",null,6445,12,9,8,10,10,2,24,22,21,21,21,20,14,12,13,12,13,13]
["2022-03-01",{"$f":"VLOOKUP(J1413,'Control Panel'!$G$132:$K$171,5,FALSE)","v":"WF-5"},"WF",null,null,null,null,null,null,"F86625",null,5882,6,5,5,5,4,1,10,8,8,8,8,8,17,16,15,15,15,14]
["2022-03-01",{"$f":"VLOOKUP(J1414,'Control Panel'!$G$132:$K$171,5,FALSE)","v":"WF-1"},"WF",null,null,null,null,null,null,"F86626",null,7021,23,21,22,22,20,3,23,20,21,19,19,20,13,12,12,12,12,12]
["2022-03-01",{"$f":"VLOOKUP(J1415,'Control Panel'!$G$132:$K$171,5,FALSE)","v":"WF-2"},"WF",null,null,null,null,null,null,"F86627",null,13283,24,24,24,24,21,5,30,29,25,25,24,25,30,30,30,27,30,27]
["2022-03-01",{"$f":"VLOOKUP(J1416,'Control Panel'!$G$132:$K$171,5,FALSE)","v":"WF-6"},"WF",null,null,null,null,null,null,"F86644",null,9254,19,19,19,19,18,2,21,20,18,20,20,20,27,26,25,18,25,23]
["2022-03-01",{"$f":"VLOOKUP(J1417,'Control Panel'!$G$132:$K$171,5,FALSE)","v":"WF-4"},"WF",null,null,null,null,null,null,"F86650",null,8080,23,18,18,19,16,3,20,17,16,16,16,16,18,17,16,13,17,13]
["2022-03-01",{"$f":"VLOOKUP(J1418,'Control Panel'!$G$132:$K$171,5,FALSE)","v":"WF-1"},"WF",null,null,null,null,null,null,"F86664",null,8471,17,17,17,17,17,0,34,32,31,31,31,31,23,23,22,20,22,20]
["2022-03-01",{"$f":"VLOOKUP(J1419,'Control Panel'!$G$132:$K$171,5,FALSE)","v":"WF-5"},"WF",null,null,null,null,null,null,"F86666",null,14983,41,39,39,40,38,5,46,41,39,39,40,40,47,41,38,18,38,35]
["2022-03-01",{"$f":"VLOOKUP(J1420,'Control Panel'!$G$132:$K$171,5,FALSE)","v":"WF-7"},"WF",null,null,null,null,null,null,"F86679",null,6372,29,26,26,26,26,8,27,25,22,22,22,22,28,24,24,16,23,16]
["2022-03-01",{"$f":"VLOOKUP(J1421,'Control Panel'!$G$132:$K$171,5,FALSE)","v":"WF-1"},"WF",null,null,null,null,null,null,"F86689",null,4395,33,28,28,28,27,2,24,22,24,24,24,23,18,18,18,18,18,18]
["2022-03-01",{"$f":"VLOOKUP(J1422,'Control Panel'!$G$132:$K$171,5,FALSE)","v":"WF-4"},"WF",null,null,null,null,null,null,"F86696",null,6883,32,23,22,26,23,4,21,19,17,17,17,17,16,15,15,11,15,11]
["2022-03-01",{"$f":"VLOOKUP(J1423,'Control Panel'!$G$132:$K$171,5,FALSE)","v":"WF-1"},"WF",null,null,null,null,null,null,"F86700",null,3901,8,6,6,7,6,0,12,10,9,9,9,9,13,12,10,9,11,9]
["2022-03-01",{"$f":"VLOOKUP(J1424,'Control Panel'!$G$132:$K$171,5,FALSE)","v":"WF-5"},"WF",null,null,null,null,null,null,"F86701",null,3853,10,7,7,7,8,4,11,9,8,8,9,9,7,6,5,3,5,2]
["2022-03-01",{"$f":"VLOOKUP(J1425,'Control Panel'!$G$132:$K$171,5,FALSE)","v":"WF-5"},"WF",null,null,null,null,null,null,"F86705",null,3512,14,13,13,14,14,5,3,3,3,3,3,3,7,7,7,7,6,7]
["2022-03-01",{"$f":"VLOOKUP(J1426,'Control Panel'!$G$132:$K$171,5,FALSE)","v":"WF-6"},"WF",null,null,null,null,null,null,"F86708",null,2782,6,5,5,5,5,2,6,5,5,5,5,5,9,6,7,5,7,5]
["2022-03-01",{"$f":"VLOOKUP(J1427,'Control Panel'!$G$132:$K$171,5,FALSE)","v":"WF-4"},"WF",null,null,null,null,null,null,"F86712",null,3395,10,10,9,10,10,2,7,6,6,6,6,6,6,6,6,6,6,6]
["2022-03-01",{"$f":"VLOOKUP(J1428,'Control Panel'!$G$132:$K$171,5,FALSE)","v":"WF-2"},"WF",null,null,null,null,null,null,"Y01291",null,9173,26,26,26,26,24,13,25,23,22,22,22,22,35,33,33,33,34,32]
["2022-03-01",{"$f":"VLOOKUP(J1429,'Control Panel'!$G$132:$K$171,5,FALSE)","v":"WF-1"},"WF",null,null,null,null,null,null,"Y01839",null,6236,19,17,17,18,17,3,17,15,16,16,16,16,23,20,19,12,18,11]
["2022-03-01",{"$f":"VLOOKUP(J1430,'Control Panel'!$G$132:$K$171,5,FALSE)","v":{"$error":"#N/A"}},null,null,null,null,null,null,null,"Total",null,269929,809,722,716,748,710,124,807,723,688,689,690,688,769,706,687,575,681,600]
["2022-03-01",{"$f":"VLOOKUP(J1431,'Control Panel'!$G$132:$K$171,5,FALSE)","v":"WF-2"},"WF",null,null,null,null,null,null,"F86004",null,15970,51,47,46,46,46,9,53,50,27,53,53,52,58,37,36,47,41,2]
["2022-03-01",{"$f":"VLOOKUP(J1432,'Control Panel'!$G$132:$K$171,5,FALSE)","v":"WF-4"},"WF",null,null,null,null,null,null,"F86018",null,9966,17,17,16,16,0,3,30,27,2,25,26,26,28,18,8,15,21,2]
["2022-03-01",{"$f":"VLOOKUP(J1433,'Control Panel'!$G$132:$K$171,5,FALSE)","v":"WF-1"},"WF",null,null,null,null,null,null,"F86026",null,7223,11,9,9,9,8,0,21,17,1,17,18,17,22,8,8,14,10,0]
["2022-03-01",{"$f":"VLOOKUP(J1434,'Control Panel'!$G$132:$K$171,5,FALSE)","v":"WF-3"},"WF",null,null,null,null,null,null,"F86074",null,15092,39,37,34,34,25,7,52,42,17,32,43,43,53,29,30,33,31,0]
["2022-03-01",{"$f":"VLOOKUP(J1435,'Control Panel'!$G$132:$K$171,5,FALSE)","v":"WF-1"},"WF",null,null,null,null,null,null,"F86638",null,5199,17,12,12,12,1,2,18,13,1,12,13,14,20,14,2,9,16,1]

{"sheet":"01072021","index":9,"n_rows":72,"n_cols":20,"rows_kept":72,"cut":false,"hidden":true,"merged":[]}
["Registered practice ID","(01)_12_MONTH_COHORT_(WF_Dashboards_CEG___COVER_Audit_Child_Imms).csv","(01.01)_DTaP_IPV_Hib_HepB_(WF_Dashboards_CEG___COVER_Audit_Child_Imms).csv","(01.02)_Men_B_(1st_and_2nd)_(WF_Dashboards_CEG___COVER_Audit_Child_Imms).csv","(01.03)_PCV_(WF_Dashboards_CEG___COVER_Audit_Child_Imms).csv","(01.04)_Rotavirus_(WF_Dashboards_CEG___COVER_Audit_Child_Imms).csv","(01.05)_BCG_(WF_Dashboards_CEG___COVER_Audit_Child_Imms).csv","(02)_24_MONTH_COHORT_(WF_Dashboards_CEG___COVER_Audit_Child_Imms).csv","(02.01)_DTaP_IPV_Hib_or_DTaP_IPV_Hib_HepB_(WF_Dashboards_CEG___COVER_Audit_Child_Imms).csv","(02.02)_MMR_(WF_Dashboards_CEG___COVER_Audit_Child_Imms).csv","(02.03)_HiB_Men_C_(WF_Dashboards_CEG___COVER_Audit_Child_Imms).csv","(02.04)_PCV_(Booster)_(WF_Dashboards_CEG___COVER_Audit_Child_Imms).csv","(02.05)_Men_B_(Booster)_(WF_Dashboards_CEG___COVER_Audit_Child_Imms).csv","(03)_5_YEAR_COHORT_(WF_Dashboards_CEG___COVER_Audit_Child_Imms).csv","(03.01)_DTaP_IPV_Hib_or_DTaP_IPV_Hib_HepB_(WF_Dashboards_CEG___COVER_Audit_Child_Imms).csv","(03.02)_MMR_(Primary)_(WF_Dashboards_CEG___COVER_Audit_Child_Imms).csv","(03.03)_DTaP_IPV_(Booster)_(WF_Dashboards_CEG___COVER_Audit_Child_Imms).csv","(03.04)_HiB_Men_C_(WF_Dashboards_CEG___COVER_Audit_Child_Imms).csv","(03.05)_MMR_(Booster)_(WF_Dashboards_CEG___COVER_Audit_Child_Imms).csv","listsize_(WF_Dashboards_CEG___COVER_Audit_Child_Imms).csv"]
["A83635",null,null,null,null,null,null,null,null,null,null,null,null,null,null,null,null,null,null,1]
["B82012",null,null,null,null,null,null,null,null,null,null,null,null,null,null,null,null,null,null,2]
["E82068",null,null,null,null,null,null,null,null,null,null,null,null,null,null,null,null,null,null,1]
["E82638",null,null,null,null,null,null,null,null,null,null,null,null,null,null,null,null,null,null,1]
["E83017",null,null,null,null,null,null,null,null,null,null,null,null,null,null,null,null,null,null,1]
["E84066",null,null,null,null,null,null,null,null,null,null,null,null,null,null,null,null,null,null,1]
["E85030",null,null,null,null,null,null,null,null,null,null,null,null,null,null,null,null,null,null,1]
["E85107",null,null,null,null,null,null,null,null,null,null,null,null,null,null,null,null,null,null,1]
["E85657",null,null,null,null,null,null,null,null,null,null,null,null,null,null,null,null,null,null,1]
["E86014",null,null,null,null,null,null,null,null,null,null,null,null,null,null,null,null,null,null,1]
["E86028",null,null,null,null,null,null,null,null,null,null,null,null,null,null,null,null,null,null,1]
["E87024",null,null,null,null,null,null,null,null,null,null,null,null,null,null,null,null,null,null,2]
["E87754",null,null,null,null,null,null,null,null,null,null,null,null,null,null,null,null,null,null,1]
["F81078",null,null,null,null,null,null,null,null,null,null,null,null,null,null,null,null,null,null,2]
["F81114",null,null,null,null,null,null,null,null,null,null,null,null,null,null,null,null,null,null,2]
["F81115",null,null,null,null,null,null,null,null,null,null,null,null,null,null,null,null,null,null,1]
["F81122",null,null,null,null,null,null,null,null,null,null,null,null,1,1,1,1,1,null,1]
["F81153",null,null,null,null,null,null,null,null,null,null,null,null,null,null,null,null,null,null,3]
["F81165",null,null,null,null,null,null,null,null,null,null,null,null,null,null,null,null,null,null,1]
["F82011",null,null,null,null,null,null,null,null,null,null,null,null,null,null,null,null,null,null,1]
["F82013",null,null,null,null,null,null,null,null,null,null,null,null,null,null,null,null,null,null,1]
["F82680",null,null,null,null,null,null,null,null,null,null,null,null,null,null,null,null,null,null,108]
["F83017",null,null,null,null,null,null,null,null,null,null,null,null,null,null,null,null,null,null,1]
["F83673",null,null,null,null,null,null,null,null,null,null,null,null,null,null,null,null,null,null,1]
["F84036",null,null,null,null,null,null,null,null,null,null,null,null,null,null,null,null,null,null,1]
["F84053",null,null,null,null,null,null,null,null,null,null,null,null,null,null,null,null,null,null,1]
["F84072",null,null,null,null,null,null,null,null,null,null,null,null,null,null,null,null,null,null,1]
["F84086",null,null,null,null,null,null,null,null,null,null,null,null,null,null,null,null,null,null,1]
["F84111",null,null,null,null,null,null,null,null,null,null,null,null,null,null,null,null,null,null,1]
["F84730",null,null,null,null,null,null,null,null,null,null,null,null,null,null,null,null,null,null,1]
["F85039",null,null,null,null,null,null,null,null,null,null,null,null,null,null,null,null,null,null,1]
["F86004",51,47,46,46,46,9,53,50,27,53,53,52,58,37,36,47,41,2,15970]
["F86006",null,null,null,null,null,null,null,null,null,null,null,null,null,null,null,null,null,null,1]
["F86011",null,null,null,null,null,null,null,null,null,null,null,null,null,null,null,null,null,null,2]
["F86013",null,null,null,null,null,null,null,null,null,null,null,null,null,null,null,null,null,null,322]
["F86018",17,17,16,16,null,3,30,27,2,25,26,26,28,18,8,15,21,2,9966]
["F86025",null,null,null,null,null,null,null,null,null,null,null,null,1,null,null,null,null,null,215]
["F86026",11,9,9,9,8,null,21,17,1,17,18,17,22,8,8,14,10,null,7223]
["F86028",null,null,null,null,null,null,null,null,null,null,null,null,null,null,null,null,null,null,1]
["F86030",null,null,null,null,null,null,null,null,null,null,null,null,null,null,null,null,null,null,2]
["F86034",null,null,null,null,null,null,null,null,null,null,null,null,null,null,null,null,null,null,1]
["F86036",null,null,null,null,null,null,null,null,null,null,null,null,null,null,null,null,null,null,1]
["F86044",null,null,null,null,null,null,null,null,null,null,null,null,null,null,null,null,null,null,2]
["F86045",null,null,null,null,null,null,null,null,null,null,null,null,null,null,null,null,null,null,1]
["F86062",null,null,null,null,null,null,null,null,null,null,null,null,null,null,null,null,null,null,1]
["F86074",39,37,34,34,25,7,52,42,17,32,43,43,53,29,30,33,31,null,15092]
["F86082",null,null,null,null,null,null,null,null,null,null,null,null,null,null,null,null,null,null,68]
["F86616",null,null,null,null,null,null,null,null,null,null,null,null,null,null,null,null,null,null,2]
["F86626",null,null,null,null,null,null,null,null,null,null,null,null,null,null,null,null,null,null,1]
["F86638",17,12,12,12,1,2,18,13,1,12,13,14,20,14,2,9,16,1,5199]
["F86644",null,null,null,null,null,null,null,null,null,null,null,null,null,null,null,null,null,null,2]
["F86657",null,null,null,null,null,null,null,null,null,null,null,null,null,null,null,null,null,null,120]
["F86691",null,null,null,null,null,null,null,null,null,null,null,null,null,null,null,null,null,null,2]
["F86700",null,null,null,null,null,null,null,null,null,null,null,null,null,null,null,null,null,null,1]
["F86701",null,null,null,null,null,null,null,null,null,null,null,null,null,null,null,null,null,null,1]
["G85012",null,null,null,null,null,null,null,null,null,null,null,null,null,null,null,null,null,null,1]
["G85087",null,null,null,null,null,null,null,null,null,null,null,null,null,null,null,null,null,null,1]
["G85109",null,null,null,null,null,null,null,null,null,null,null,null,null,null,null,null,null,null,1]
["G85136",null,null,null,null,null,null,null,null,null,null,null,null,null,null,null,null,null,null,1]
["H83015",null,null,null,null,null,null,null,null,null,null,null,null,null,null,null,null,null,null,1]
["J81028",null,null,null,null,null,null,null,null,null,null,null,null,null,null,null,null,null,null,1]
["K83059",null,null,null,null,null,null,null,null,null,null,null,null,null,null,null,null,null,null,3]
["M83650",null,null,null,null,null,null,null,null,null,null,null,null,null,null,null,null,null,null,1]
["P81002",null,null,null,null,null,null,null,null,null,null,null,null,null,null,null,null,null,null,1]
["Unknown",null,null,null,null,null,null,null,null,null,null,null,null,null,null,null,null,null,null,46]
["Y00155",null,null,null,null,null,null,null,null,null,null,null,null,null,null,null,null,null,null,191]
["Y00403",null,null,null,null,null,null,null,null,null,null,null,null,null,null,null,null,null,null,1]
["Y01066",null,null,null,null,null,null,null,null,null,null,null,null,null,null,null,null,null,null,1]
["Y01795",null,null,null,null,null,null,null,null,null,null,null,null,null,null,null,null,null,null,1]
["Y01839",null,null,null,null,null,null,null,null,null,null,null,null,null,null,null,null,null,null,1]
["Y02987",null,null,null,null,null,null,null,null,null,null,null,null,null,null,null,null,null,null,3]

{"sheet":"Control Panel","index":10,"n_rows":171,"n_cols":26,"rows_kept":171,"cut":false,"hidden":true,"merged":[]}
[null,"Q4",null,null,"Search Title","Report Title",null,null,"2019-03-01"]
[null,null,null,null,"All Patients","Listsize ",null,null,"April 2021","Q1","Q1: April 2017 - June 2017",null,"Select Dates",null,null,null,null,null,null,null,"total",2,{"$f":"$V$7&ADDRESS(1,V2)&\":\"&ADDRESS($V$8,V2)","v":"'Data'!$B$1:$B$2000"}]
[null,null,null,null,"(01) 12 MONTH COHORT","Patients becoming 12m",null,null,"May 2021","Q1","Q1: April 2017 - June 2017",null,"2017-04-01",null," -","Select Practice","DN Team","Patch","Network",null,"OrgID",10,{"$f":"$V$7&ADDRESS(1,V3)&\":\"&ADDRESS($V$8,V3)","v":"'Data'!$J$1:$J$2000"}]
[null,null,null,null,"(01.01) DTaP/IPV/Hib 6in1","DTaP/IPV/Hib/HepB",null,null,"June 2021","Q1","Q1: April 2017 - June 2017",null,"2017-05-01","Bethnal Green Health Centre","F84083","Bethnal Green Health Centre",null,null,"NW1",null,"REL_D",1,{"$f":"$V$7&ADDRESS(1,V4)&\":\"&ADDRESS($V$8,V4)","v":"'Data'!$A$1:$A$2000"}]
[null,null,null,null,"DTaP/IPV/Hib(%)","DTaP/IPV/Hib/HepB(%)",null,null,"July 2021","Q2","Q2: July 2017 - September 2017",null,"2017-06-01","The Mission Practice","F84016","The Mission Practice",null,null,"NW1",null,"IND"," -",{"$f":"$V$7&ADDRESS(V12,1)&\":\"&ADDRESS(V12,V9)","v":"'Data'!$A$1:$AD$1"}]
[null,null,null,null,"Patients required to achieve NHSE Target (90%)","Patients required to achieve NHSE Target (90%)",null,null,"August 2021","Q2","Q2: July 2017 - September 2017",null,"2017-07-01","Globe Town Surgery","F84123","Globe Town Surgery",null,null,"NW1",null,"NwID",3,{"$f":"$V$7&ADDRESS(1,V6)&\":\"&ADDRESS($V$8,V6)","v":"'Data'!$C$1:$C$2000"}]
[null,null,null,null,"Patients required to achieve CCG Target (95%)","Patients required to achieve CCG Target (95%)",null,null,"September 2021","Q2","Q2: July 2017 - September 2017",null,"2017-08-01","Pollard Row Surgery","Y00212","Pollard Row Surgery",null,null,"NW1",null,"Data",{"$f":"IF(V10=\"N\",\"BLANK!\",\"'\"&V11&\"'!\")","v":"'Data'!"}]
[null,null,null,null,"(01.02) Men B (1st and 2nd)","Men B",null,null,"October 2021","Q3","Q3: October 2017 - December 2017",null,"2017-09-01","Strouts Place Medical Centre","F84051","Strouts Place Medical Centre",null,null,"NW1",null,"Rows",2000]
[null,"Waltham Forest","Total",null,"Men B(%)","Men B(%)",null,null,"November 2021","Q3","Q3: October 2017 - December 2017",null,"2017-10-01","Spitalfields Practice","F84081","Spitalfields Practice",null,null,"NW2",null,"Columns",30]
["LC1","Chingford Locality","LC1",null,"Patients required to achieve NHSE Target (90%)","Patients required to achieve NHSE Target (90%)",null,null,"December 2021","Q3","Q3: October 2017 - December 2017",null,"2017-11-01","Blithehale Medical Centre","F84718","Blithehale Medical Centre",null,null,"NW2",null,"Data (Y/N)","Y"]
["LC2","Leyton & Leytonstone Locality","LC2",null,"Patients required to achieve CCG Target (95%)","Patients required to achieve CCG Target (95%)",null,null,"January 2022","Q4","Q4: January 2018 - March 2018",null,"2017-12-01","Health E1","F84733","Health E1",null,null,"NW2",null,"Q Work Sheet","Data",{"$f":"$V$7&ADDRESS(1,1)&\":\"&ADDRESS(V8,V9)","v":"'Data'!$A$1:$AD$2000"}]
["LC3","Walthamstow Locality","LC3",null,"(01.03) PCV","PCV",null,null,"February 2022","Q4","Q4: January 2018 - March 2018",null,"2018-01-01","Albion Health Centre","F84012","Albion Health Centre",null,null,"NW2",null,"Header Row",1]
["LC1",{"$f":"VLOOKUP(C13,$C$132:$D$171,2,FALSE)","v":"Chingford Medical Practice"},"Y01291","LC3","PCV(%)","PCV(%)",null,null,"March 2022","Q4","Q4: January 2018 - March 2018",null,"2018-02-01","Harford Health Centre","F84087","Harford Health Centre",null,null,"NW3",null,"Header Row 2",3]
["LC1","Churchill Medical Centre","F86627","LC1","Patients required to achieve NHSE Target (90%)","Patients required to achieve NHSE Target (90%)",null,null,null,null,null,null,"2018-03-01","Brayford Square (Dr Varma)","F84046","Brayford Square (Dr Varma)",null,null,"NW3"]
["LC1","Kings Head Medical Practice","F86700","LC1","Patients required to achieve CCG Target (95%)","Patients required to achieve CCG Target (95%)",null,null,null,null,null,null,null,"Whitechapel Health (Shah Jalal)","F84039","Whitechapel Health (Shah Jalal)",null,null,"NW3"]
["LC1","Larkshall Medical Centre","F86664","LC3","(01.04) Rotavirus","Rotavirus",null,null,null,null,null,null,null,"City Wellbeing Practice (Tower Medical)","F84114","City Wellbeing Practice (Tower Medical)",null,null,"NW3"]
["LC1","Old Church Surgery","F86616","LC2","Rotavirus(%)","Rotavirus(%)",null,null,null,null,null,null,null,"Wapping Group Practice","F84079","Wapping Group Practice",null,null,"NW4"]
["LC1","The Ridgeway Surgery","F86078","LC3",null,null,null,null,null,null,null,null,null,"Jubilee Street Practice","F84031","Jubilee Street Practice",null,null,"NW4",null,null,"Patients becoming 12m",null,null,null,"Patients becoming 12m"]
["LC2"," Crawley Road Medical Centre","F86044","LC3",null,null,null,null,null,null,"2015/16 Q1",null,null,"St Katharine Docks Practice","F84731","St Katharine Docks Practice",null,null,"NW4",null,null,"DTaP/IPV/Hib",null,null,null,"DTaP/IPV/Hib %"]
["LC2","Francis Road Medical Centre","F86696","LC2",null,null,null,null,null,null,"2015/16 Q2",null,null,"East One Health","F84682","East One Health",null,null,"NW4",null,null,"Men B",null,null,null,"Men C / Men B %"]
["LC2","Green Man Medical Centre","F86621","LC2",null,null,null,null,null,null,"2015/16 Q3",null,null,"Harley Grove Medical Centre","F84044","Harley Grove Medical Centre",null,null,"NW5",null,null,"PCV",null,null,null,"PCV %"]
["LC2","Hampton Medical Centre","F86712","LC2",null,null,null,null,null,null,"2015/16 Q4",null,null,"St Stephens Health Centre","F84034","St Stephens Health Centre",null,null,"NW5"]
["LC2","High Road Surgery","F86045","LC2",null,null,null,null,null,null,"2016/17 Q1",null,null,"Ruston Street Clinic (Dr Amin)","F84030","Ruston Street Clinic (Dr Amin)",null,null,"NW5",null,null,"Patients becoming 24m",null,null,null,"Patients becoming 24m"]
["LC2","Kiyani Medical Practice","F86701","LC3",null,null,null,null,null,null,"2016/17 Q2",null,null,"Grove Road Surgery (Dr Shah)","F84055","Grove Road Surgery (Dr Shah)",null,null,"NW5",null,null,"MMR",null,null,null,"MMR %"]
["LC2","LL Medical Care (Agarwal & Agrwal Practice)","F86625","LC1","All Patients","Listsize ",null,null,null,null,"2016/17 Q3",null,null,"The Tredegar Practice","F84696","The Tredegar Practice",null,null,"NW5",null,null,"HiB/Men C",null,null,null,"HiB/Men C %"]
["LC2","The Langthorne Sharma Family Practice","F86705","LC2","(02) 24 MONTH COHORT","Patients becoming 24m",null,null,null,null,"2016/17 Q4",null,null,"Stroudley Walk Centre","F84676","Stroudley Walk Centre",null,null,"NW6",null,null,"PCV (Booster)",null,null,null,"PCV (Booster) %"]
["LC2","Lime Tree Surgery","F86650","LC2","(02.01) DTaP/IPV/Hib or DTaP/IPV/Hib/HepB","DTaP/IPV/Hib",null,null,null,null,"2017/18 Q1",null,null,"St Andrews Health Centre","Y03023","St Andrews Health Centre",null,null,"NW6"]
["LC2","Sma Medical Centre","F86038","LC2","DTaP/IPV/Hib(%)","DTaP/IPV/Hib(%)",null,null,null,null,"2017/18 Q2",null,null,"Merchant Street (Dr Rana)","F84118","Merchant Street (Dr Rana)",null,null,"NW6",null,null,"Patients becoming 5y",null,null,null,"Patients becoming 5y"]
["LC2","The Allum Medical Centre","F86036","LC1","Patients required to achieve NHSE Target (90%)","Patients required to achieve NHSE Target (90%)",null,null,null,null,"2017/18 Q3",null,null,"St Pauls Way Medical Centre","F84714","St Pauls Way Medical Centre",null,null,"NW6",null,null,"DTaP/IPV (Booster)(%)",null,null,null,"DTaP/IPV (Booster)(%)"]
["LC2","The Harrow Road Surgery","F86666","LC3","Patients required to achieve CCG Target (95%)","Patients required to achieve CCG Target (95%)",null,null,null,null,"2017/18 Q4",null,null,"Bromley-By-Bow Health Centre / XX Place","F84122","Bromley-By-Bow Health Centre / XX Place",null,null,"NW6",null,null,"MMR (Booster)(%)",null,null,null,"MMR (Booster)(%)"]
["LC2","The Lyndhurst Surgery","F86088","LC2","(02.02) MMR","MMR",null,null,null,null,"2018/19 Q1",null,null,"Limehouse Practice (Gill Street)","F84054","Limehouse Practice (Gill Street)",null,null,"NW7"]
["LC2","The Manor Practice","F86011","LC3","MMR(%)","MMR(%)",null,null,null,null,"2018/19 Q2",null,null,"Chrisp Street Health Centre","F84062","Chrisp Street Health Centre",null,null,"NW7",null,null,"(01) 12 MONTH COHORT"]
["LC3",{"$f":"VLOOKUP(C33,$C$132:$D$171,2,FALSE)","v":"Addison Road Medical Practice"},"F86607","LC3","Patients required to achieve NHSE Target (90%)","Patients required to achieve NHSE Target (90%)",null,null,null,null,"2018/19 Q3",null,null,"Aberfeldy Practice","F84698","Aberfeldy Practice",null,null,"NW7",null,null,"(01.01) DTaP/IPV/Hib 6in1"]
["LC3","Claremont Medical Centre","F86708","LC2","Patients required to achieve CCG Target (95%)","Patients required to achieve CCG Target (95%)",null,null,null,null,"2018/19 Q4",null,null,"Gough Walk (Dr Selvan)","F84025","Gough Walk (Dr Selvan)",null,null,"NW7",null,null,"(01.02) Men B (1st and 2nd)"]
["LC3","Dr Dhital Practice","F86086","LC3","(02.03) HiB/Men C","HiB/Men C",null,null,null,null,null,null,null,"Island Health","F84710","Island Health",null,null,"NW8",null,null,"(01.03) PCV"]
["LC3","Dr Shantir Practice","F86626","LC2","HiB/Men C (%)","HiB/Men C (%)",null,null,null,"Patient becoming 12m","'Control Panel'!$V$18:$V$21","'Control Panel'!$Z$18:$Z$21",null,"Docklands Medical Centre","F84656","Docklands Medical Centre",null,null,"NW8"]
["LC3","Higham Hill Medical Centre","F86679","LC3","Patients required to achieve NHSE Target (90%)","Patients required to achieve NHSE Target (90%)",null,null,null,"Patient becoming 24m","'Control Panel'!$V23:$V$26","'Control Panel'!$Z23:$Z$26",null,"Island Medical Centre","F84647","Island Medical Centre",null,null,"NW8",null,null,"(02) 24 MONTH COHORT"]
["LC3","Lime Tree & Sinnott Healthcare Ltd","Y01839","LC3","Patients required to achieve CCG Target (95%)","Patients required to achieve CCG Target (95%)",null,null,null,"Patient becoming 5y","'Control Panel'!$V28:$V$30","'Control Panel'!$Z28:$Z$30",null,"Barkantine Practice","F84747","Barkantine Practice",null,null,"NW8",null,null,"(02.02) MMR"]
["LC3"," The Penryhn Surgery","F86005","LC3","(02.04) PCV (Booster)","PCV (Booster)",null,null,null,null,null,null,null,"Tower Hamlets","Total","Tower Hamlets",null,null,null,null,null,"(02.03) HiB/Men C"]
["LC3"," Queens Road Medical Centre","F86030","LC2","PCV (Booster)(%)","PCV (Booster)(%)",null,null,null,null,null,null,null,"The One Network","NW1","The One Network",null,null,"NW1",null,null,"(02.04) PCV (Booster)"]
["LC3","Seymour Medical Centre","F86006","LC2","Patients required to achieve NHSE Target (90%)","Patients required to achieve NHSE Target (90%)",null,null,null,"Patient becoming 12m","'Control Panel'!$V$32:$V$35",null,null,"East End Health Network","NW2","East End Health Network",null,null,"NW2"]
["LC3","St James Medical Practice Ltd","F86058","LC2","Patients required to achieve CCG Target (95%)","Patients required to achieve CCG Target (95%)",null,null,null,"Patient becoming 24m","'Control Panel'!$V37:$V$40",null,null,"Stepney and Whitechapel Network","NW3","Stepney and Whitechapel Network",null,null,"NW3",null,null,"(03) 5 YEAR COHORT"]
["LC3","The Bailey Practice","F86689","LC1","(02.05) Men B (Booster)","Men B (Booster)",null,null,null,"Patient becoming 5y","'Control Panel'!$V42:$V$44",null,null,"The Highway Network","NW4","The Highway Network",null,null,"NW4",null,null,"(03.03) DTaP/IPV (Booster)"]
["LC3"," The Firs","F86001","LC2","Men B (Booster)(%)","Men B (Booster)(%)",null,null,null,null,null,null,null,"Bow Health Network","NW5","Bow Health Network",null,null,"NW5",null,null,"(03.05) MMR (Booster)"]
["LC3","Grove Surgery","F86062","LC1",null,null,null,null,null,null,null,null,null,"Mile End East and Bromley by Bow Network","NW6","Mile End East and Bromley by Bow Network",null,null,"NW6"]
["LC3","Waltham Forest Community & Family Health Services Ltd","F86644","LC3",null,null,null,null,null,null,null,null,null,"Poplar and Limehouse Network","NW7","Poplar and Limehouse Network",null,null,"NW7"]
[null,null,null,null,null,null,null,null,null,null,null,null,null,"Healthy Island Network","NW8","Healthy Island Network",null,null,"NW8"]
[null,null,null,null,"All Patients","Listsize "]
[null,null,null,null,"(03) 5 YEAR COHORT","Patients becoming 5y",null,null,null,null,null,null,null,null,null,null,null,null,null,null,null,null,null,null,"April 2019","2019-05-01"]
[null,null,null,null,"(03.01) DTaP/IPV/Hib or DTaP/IPV/Hib/HepB","DTaP/IPV/Hib",null,null,null,null,null,null,null,null,null,null,null,null,null,null,null,null,null,null,"May 2019","2019-06-01"]
[null,null,null,null,"DTaP/IPV/Hib(%)","DTaP/IPV/Hib(%)",null,null,null,null,null,null,null,"xx",null,null,null,"bbb",null,null,null,null,null,null,"June 2019","2019-07-01"]
[null,null,null,null,"(03.02) MMR (Primary)","MMR (Primary)",null,null,null,null,null,null,null,null,null,null,null,null,null,null,null,null,null,null,"July 2019","2019-08-01"]
[null,null,null,null,"MMR (Primary)(%)","MMR (Primary)(%)",null,null,null,"Data",null,null,null,"Array Start","Array End","Array as Text",null,"Array Start","Array End",null,null,null,null,null,"August 2019","2019-09-01"]
[null,null,null,null,"(03.03) DTaP/IPV (Booster)","DTaP/IPV (Booster)",null,null,null,null,null,null,null,{"$f":"\"'XX place'!\"&ADDRESS(MATCH(I56,#REF!,0)+7,2)","v":{"$error":"#REF!"}},{"$f":"ADDRESS(MATCH(I56,#REF!,0)+43,3)","v":{"$error":"#REF!"}},{"$f":"TEXT(N54&\":\"&O54,\"\")","v":{"$error":"#REF!"}},null,{"$f":"\"'BBB'!\"&ADDRESS(MATCH(I56,#REF!,0)+7,2)","v":{"$error":"#REF!"}},{"$f":"ADDRESS(MATCH(I56,#REF!,0)+43,3)","v":{"$error":"#REF!"}},null,null,null,null,null,"September 2019","2019-10-01"]
[null,null,null,null,"DTaP/IPV (Booster)(%)","DTaP/IPV (Booster)(%)",null,null,"Search Title","Array Start","Array End","Array as Text",null,{"$f":"\"'XX place'!\"&ADDRESS(MATCH(I57,#REF!,0)+7,2)","v":{"$error":"#REF!"}},{"$f":"ADDRESS(MATCH(I57,#REF!,0)+43,3)","v":{"$error":"#REF!"}},{"$error":"#REF!"},null,{"$f":"\"'BBB'!\"&ADDRESS(MATCH(I57,#REF!,0)+7,2)","v":{"$error":"#REF!"}},{"$f":"ADDRESS(MATCH(I57,#REF!,0)+43,3)","v":{"$error":"#REF!"}},"Array as Text",null,null,null,null,"October 2019","2019-11-01"]
[null,null,null,null,"Patients required to achieve NHSE Target (90%)","Patients required to achieve NHSE Target (90%)",null,null,"All Patients",{"$f":"\"Data!\"&ADDRESS(MATCH(I56,#REF!,0)+7,2)","v":{"$error":"#REF!"}},{"$f":"ADDRESS(MATCH(I56,#REF!,0)+46,3)","v":{"$error":"#REF!"}},{"$f":"TEXT(J56&\":\"&K56,\"\")","v":{"$error":"#REF!"}},null,{"$f":"\"'XX place'!\"&ADDRESS(MATCH(I58,#REF!,0)+7,2)","v":{"$error":"#REF!"}},{"$f":"ADDRESS(MATCH(I58,#REF!,0)+43,3)","v":{"$error":"#REF!"}},{"$error":"#REF!"},null,{"$f":"\"'BBB'!\"&ADDRESS(MATCH(I58,#REF!,0)+7,2)","v":{"$error":"#REF!"}},{"$f":"ADDRESS(MATCH(I58,#REF!,0)+43,3)","v":{"$error":"#REF!"}},{"$f":"TEXT(R54&\":\"&S54,\"\")","v":{"$error":"#REF!"}},null,null,null,null,"November 2019","2019-12-01"]
[null,null,null,null,"Patients required to achieve CCG Target (95%)","Patients required to achieve CCG Target (95%)",null,null,"(01) 12 MONTH COHORT",{"$f":"\"Data!\"&ADDRESS(MATCH(I57,#REF!,0)+7,2)","v":{"$error":"#REF!"}},{"$f":"ADDRESS(MATCH(I57,#REF!,0)+46,3)","v":{"$error":"#REF!"}},{"$error":"#REF!"},null,{"$f":"\"'XX place'!\"&ADDRESS(MATCH(I59,#REF!,0)+7,2)","v":{"$error":"#REF!"}},{"$f":"ADDRESS(MATCH(I59,#REF!,0)+43,3)","v":{"$error":"#REF!"}},{"$error":"#REF!"},null,{"$f":"\"'BBB'!\"&ADDRESS(MATCH(I59,#REF!,0)+7,2)","v":{"$error":"#REF!"}},{"$f":"ADDRESS(MATCH(I59,#REF!,0)+43,3)","v":{"$error":"#REF!"}},{"$error":"#REF!"},null,null,null,null,"December 2019","2020-01-01"]
[null,null,null,null,"(03.05) MMR (Booster)","MMR (Booster)",null,null,"(01.01) DTaP/IPV/Hib",{"$f":"\"Data!\"&ADDRESS(MATCH(I58,#REF!,0)+7,2)","v":{"$error":"#REF!"}},{"$f":"ADDRESS(MATCH(I58,#REF!,0)+46,3)","v":{"$error":"#REF!"}},{"$error":"#REF!"},null,{"$f":"\"'XX place'!\"&ADDRESS(MATCH(I60,#REF!,0)+7,2)","v":{"$error":"#REF!"}},{"$f":"ADDRESS(MATCH(I60,#REF!,0)+43,3)","v":{"$error":"#REF!"}},{"$error":"#REF!"},null,{"$f":"\"'BBB'!\"&ADDRESS(MATCH(I60,#REF!,0)+7,2)","v":{"$error":"#REF!"}},{"$f":"ADDRESS(MATCH(I60,#REF!,0)+43,3)","v":{"$error":"#REF!"}},{"$error":"#REF!"},null,null,null,null,"January 2020","2020-02-01"]
[null,null,null,null,"MMR (Booster)(%)","MMR (Booster)(%)",null,null,"(01.02) Men C",{"$f":"\"Data!\"&ADDRESS(MATCH(I59,#REF!,0)+7,2)","v":{"$error":"#REF!"}},{"$f":"ADDRESS(MATCH(I59,#REF!,0)+46,3)","v":{"$error":"#REF!"}},{"$error":"#REF!"},null,{"$f":"\"'XX place'!\"&ADDRESS(MATCH(I61,#REF!,0)+7,2)","v":{"$error":"#REF!"}},{"$f":"ADDRESS(MATCH(I61,#REF!,0)+43,3)","v":{"$error":"#REF!"}},{"$error":"#REF!"},null,{"$f":"\"'BBB'!\"&ADDRESS(MATCH(I61,#REF!,0)+7,2)","v":{"$error":"#REF!"}},{"$f":"ADDRESS(MATCH(I61,#REF!,0)+43,3)","v":{"$error":"#REF!"}},{"$error":"#REF!"},null,null,null,null,"February 2020","2020-03-01"]
[null,null,null,null,"Patients required to achieve NHSE Target (90%)","Patients required to achieve NHSE Target (90%)",null,null,"(01.03) PCV",{"$f":"\"Data!\"&ADDRESS(MATCH(I60,#REF!,0)+7,2)","v":{"$error":"#REF!"}},{"$f":"ADDRESS(MATCH(I60,#REF!,0)+46,3)","v":{"$error":"#REF!"}},{"$error":"#REF!"},null,{"$f":"\"'XX place'!\"&ADDRESS(MATCH(I62,#REF!,0)+7,2)","v":{"$error":"#REF!"}},{"$f":"ADDRESS(MATCH(I62,#REF!,0)+43,3)","v":{"$error":"#REF!"}},{"$error":"#REF!"},null,{"$f":"\"'BBB'!\"&ADDRESS(MATCH(I62,#REF!,0)+7,2)","v":{"$error":"#REF!"}},{"$f":"ADDRESS(MATCH(I62,#REF!,0)+43,3)","v":{"$error":"#REF!"}},{"$error":"#REF!"},null,null,null,null,"March 2020","2020-04-01"]
[null,null,null,null,"Patients required to achieve CCG Target (95%)","Patients required to achieve CCG Target (95%)",null,null,"(01.04) Rotavirus",{"$f":"\"Data!\"&ADDRESS(MATCH(I61,#REF!,0)+7,2)","v":{"$error":"#REF!"}},{"$f":"ADDRESS(MATCH(I61,#REF!,0)+46,3)","v":{"$error":"#REF!"}},{"$error":"#REF!"},null,{"$f":"\"'XX place'!\"&ADDRESS(MATCH(I63,#REF!,0)+7,2)","v":{"$error":"#REF!"}},{"$f":"ADDRESS(MATCH(I63,#REF!,0)+43,3)","v":{"$error":"#REF!"}},{"$error":"#REF!"},null,{"$f":"\"'BBB'!\"&ADDRESS(MATCH(I63,#REF!,0)+7,2)","v":{"$error":"#REF!"}},{"$f":"ADDRESS(MATCH(I63,#REF!,0)+43,3)","v":{"$error":"#REF!"}},{"$error":"#REF!"}]
[null,null,null,null,"(03.04) HiB/Men C","HiB/Men C",null,null,"(01.05) BCG",{"$f":"\"Data!\"&ADDRESS(MATCH(I62,#REF!,0)+7,2)","v":{"$error":"#REF!"}},{"$f":"ADDRESS(MATCH(I62,#REF!,0)+46,3)","v":{"$error":"#REF!"}},{"$error":"#REF!"},null,{"$f":"\"'XX place'!\"&ADDRESS(MATCH(I64,#REF!,0)+7,2)","v":{"$error":"#REF!"}},{"$f":"ADDRESS(MATCH(I64,#REF!,0)+43,3)","v":{"$error":"#REF!"}},{"$error":"#REF!"},null,{"$f":"\"'BBB'!\"&ADDRESS(MATCH(I64,#REF!,0)+7,2)","v":{"$error":"#REF!"}},{"$f":"ADDRESS(MATCH(I64,#REF!,0)+43,3)","v":{"$error":"#REF!"}},{"$error":"#REF!"}]
[null,null,null,null,"HiB/Men C(%)","HiB/Men C(%)",null,null,"(02) 24 MONTH COHORT",{"$f":"\"Data!\"&ADDRESS(MATCH(I63,#REF!,0)+7,2)","v":{"$error":"#REF!"}},{"$f":"ADDRESS(MATCH(I63,#REF!,0)+46,3)","v":{"$error":"#REF!"}},{"$error":"#REF!"},null,{"$f":"\"'XX place'!\"&ADDRESS(MATCH(I65,#REF!,0)+7,2)","v":{"$error":"#REF!"}},{"$f":"ADDRESS(MATCH(I65,#REF!,0)+43,3)","v":{"$error":"#REF!"}},{"$error":"#REF!"},null,{"$f":"\"'BBB'!\"&ADDRESS(MATCH(I65,#REF!,0)+7,2)","v":{"$error":"#REF!"}},{"$f":"ADDRESS(MATCH(I65,#REF!,0)+43,3)","v":{"$error":"#REF!"}},{"$error":"#REF!"}]
[null,null,null,null,null,null,null,null,"(02.01) DTaP/IPV/Hib",{"$f":"\"Data!\"&ADDRESS(MATCH(I64,#REF!,0)+7,2)","v":{"$error":"#REF!"}},{"$f":"ADDRESS(MATCH(I64,#REF!,0)+46,3)","v":{"$error":"#REF!"}},{"$error":"#REF!"},null,{"$f":"\"'XX place'!\"&ADDRESS(MATCH(I66,#REF!,0)+7,2)","v":{"$error":"#REF!"}},{"$f":"ADDRESS(MATCH(I66,#REF!,0)+43,3)","v":{"$error":"#REF!"}},{"$error":"#REF!"},null,{"$f":"\"'BBB'!\"&ADDRESS(MATCH(I66,#REF!,0)+7,2)","v":{"$error":"#REF!"}},{"$f":"ADDRESS(MATCH(I66,#REF!,0)+43,3)","v":{"$error":"#REF!"}},{"$error":"#REF!"}]
[null,null,null,null,null,null,null,null,"(02.02) MMR",{"$f":"\"Data!\"&ADDRESS(MATCH(I65,#REF!,0)+7,2)","v":{"$error":"#REF!"}},{"$f":"ADDRESS(MATCH(I65,#REF!,0)+46,3)","v":{"$error":"#REF!"}},{"$error":"#REF!"},null,{"$f":"\"'XX place'!\"&ADDRESS(MATCH(I67,#REF!,0)+7,2)","v":{"$error":"#REF!"}},{"$f":"ADDRESS(MATCH(I67,#REF!,0)+43,3)","v":{"$error":"#REF!"}},{"$error":"#REF!"},null,{"$f":"\"'BBB'!\"&ADDRESS(MATCH(I67,#REF!,0)+7,2)","v":{"$error":"#REF!"}},{"$f":"ADDRESS(MATCH(I67,#REF!,0)+43,3)","v":{"$error":"#REF!"}},{"$error":"#REF!"}]
[null,null,null,null,null,null,null,null,"(02.03) HiB/Men C",{"$f":"\"Data!\"&ADDRESS(MATCH(I66,#REF!,0)+7,2)","v":{"$error":"#REF!"}},{"$f":"ADDRESS(MATCH(I66,#REF!,0)+46,3)","v":{"$error":"#REF!"}},{"$error":"#REF!"},null,{"$f":"\"'XX place'!\"&ADDRESS(MATCH(I68,#REF!,0)+7,2)","v":{"$error":"#REF!"}},{"$f":"ADDRESS(MATCH(I68,#REF!,0)+43,3)","v":{"$error":"#REF!"}},{"$error":"#REF!"},null,{"$f":"\"'BBB'!\"&ADDRESS(MATCH(I68,#REF!,0)+7,2)","v":{"$error":"#REF!"}},{"$f":"ADDRESS(MATCH(I68,#REF!,0)+43,3)","v":{"$error":"#REF!"}},{"$error":"#REF!"}]
[null,null,null,null,"3rd DTAP/IPV/Hib","'Control Panel'!$G$67:$G$69","(01) 12 MONTH COHORT",null,"(02.04) PCV (Booster)",{"$f":"\"Data!\"&ADDRESS(MATCH(I67,#REF!,0)+7,2)","v":{"$error":"#REF!"}},{"$f":"ADDRESS(MATCH(I67,#REF!,0)+46,3)","v":{"$error":"#REF!"}},{"$error":"#REF!"},null,{"$f":"\"'XX place'!\"&ADDRESS(MATCH(I69,#REF!,0)+7,2)","v":{"$error":"#REF!"}},{"$f":"ADDRESS(MATCH(I69,#REF!,0)+43,3)","v":{"$error":"#REF!"}},{"$error":"#REF!"},null,{"$f":"\"'BBB'!\"&ADDRESS(MATCH(I69,#REF!,0)+7,2)","v":{"$error":"#REF!"}},{"$f":"ADDRESS(MATCH(I69,#REF!,0)+43,3)","v":{"$error":"#REF!"}},{"$error":"#REF!"}]
[null,null,null,null,"MMR 1 at 2years","'Control Panel'!$G$70:$G$72","(01.01) DTaP/IPV/Hib",null,"(03) 5 YEAR COHORT",{"$f":"\"Data!\"&ADDRESS(MATCH(I68,#REF!,0)+7,2)","v":{"$error":"#REF!"}},{"$f":"ADDRESS(MATCH(I68,#REF!,0)+46,3)","v":{"$error":"#REF!"}},{"$error":"#REF!"},null,{"$f":"\"'XX place'!\"&ADDRESS(MATCH(I70,#REF!,0)+7,2)","v":{"$error":"#REF!"}},{"$f":"ADDRESS(MATCH(I70,#REF!,0)+43,3)","v":{"$error":"#REF!"}},{"$error":"#REF!"},null,{"$f":"\"'BBB'!\"&ADDRESS(MATCH(I70,#REF!,0)+7,2)","v":{"$error":"#REF!"}},{"$f":"ADDRESS(MATCH(I70,#REF!,0)+43,3)","v":{"$error":"#REF!"}},{"$error":"#REF!"}]
[null,null,null,null,"MMR 2 at 5yrs ","'Control Panel'!$G$73:$G$75","DTaP/IPV/Hib(%)",null,"(03.01) DTaP/IPV/Hib",{"$f":"\"Data!\"&ADDRESS(MATCH(I69,#REF!,0)+7,2)","v":{"$error":"#REF!"}},{"$f":"ADDRESS(MATCH(I69,#REF!,0)+46,3)","v":{"$error":"#REF!"}},{"$error":"#REF!"},null,{"$f":"\"'XX place'!\"&ADDRESS(MATCH(I71,#REF!,0)+7,2)","v":{"$error":"#REF!"}},{"$f":"ADDRESS(MATCH(I71,#REF!,0)+43,3)","v":{"$error":"#REF!"}},{"$error":"#REF!"},null,{"$f":"\"'BBB'!\"&ADDRESS(MATCH(I71,#REF!,0)+7,2)","v":{"$error":"#REF!"}},{"$f":"ADDRESS(MATCH(I71,#REF!,0)+43,3)","v":{"$error":"#REF!"}},{"$error":"#REF!"}]
[null,null,null,null,"3rd DTAP/IPV/Hib at 1 year","'Control Panel'!$G$67:$G$69","(02) 24 MONTH COHORT",null,"(03.02) MMR (Primary)",{"$f":"\"Data!\"&ADDRESS(MATCH(I70,#REF!,0)+7,2)","v":{"$error":"#REF!"}},{"$f":"ADDRESS(MATCH(I70,#REF!,0)+46,3)","v":{"$error":"#REF!"}},{"$error":"#REF!"},null,{"$f":"\"'XX place'!\"&ADDRESS(MATCH(I72,#REF!,0)+7,2)","v":{"$error":"#REF!"}},{"$f":"ADDRESS(MATCH(I72,#REF!,0)+43,3)","v":{"$error":"#REF!"}},{"$error":"#REF!"},null,{"$f":"\"'BBB'!\"&ADDRESS(MATCH(I72,#REF!,0)+7,2)","v":{"$error":"#REF!"}},{"$f":"ADDRESS(MATCH(I72,#REF!,0)+43,3)","v":{"$error":"#REF!"}},{"$error":"#REF!"}]
[null,null,null,null,"MMR 1 at 2 years","'Control Panel'!$G$70:$G$72","(02.02) MMR",null,"(03.03) DTaP/IPV (Booster)",{"$f":"\"Data!\"&ADDRESS(MATCH(I71,#REF!,0)+7,2)","v":{"$error":"#REF!"}},{"$f":"ADDRESS(MATCH(I71,#REF!,0)+46,3)","v":{"$error":"#REF!"}},{"$error":"#REF!"},null,{"$f":"\"'XX place'!\"&ADDRESS(MATCH(I73,#REF!,0)+7,2)","v":{"$error":"#REF!"}},{"$f":"ADDRESS(MATCH(I73,#REF!,0)+43,3)","v":{"$error":"#REF!"}},{"$f":"TEXT(N71&\":\"&O71,\"\")","v":{"$error":"#REF!"}},null,{"$f":"\"'BBB'!\"&ADDRESS(MATCH(I73,#REF!,0)+7,2)","v":{"$error":"#REF!"}},{"$f":"ADDRESS(MATCH(I73,#REF!,0)+43,3)","v":{"$error":"#REF!"}},{"$error":"#REF!"}]
[null,null,null,null,"Pre-school booster at 5years","'Control Panel'!$G$76:$G$78","MMR(%)",null,"(03.04) HiB/Men C",{"$f":"\"Data!\"&ADDRESS(MATCH(I72,#REF!,0)+7,2)","v":{"$error":"#REF!"}},{"$f":"ADDRESS(MATCH(I72,#REF!,0)+46,3)","v":{"$error":"#REF!"}},{"$error":"#REF!"},null,null,null,null,null,null,null,{"$error":"#REF!"}]
[null,null,null,null,null,null,"(03) 5 YEAR COHORT",null,"(03.05) MMR (Booster)",{"$f":"\"Data!\"&ADDRESS(MATCH(I73,#REF!,0)+7,2)","v":{"$error":"#REF!"}},{"$f":"ADDRESS(MATCH(I73,#REF!,0)+46,3)","v":{"$error":"#REF!"}},{"$f":"TEXT(J73&\":\"&K73,\"\")","v":{"$error":"#REF!"}},null,null,null,null,null,null,null,{"$f":"TEXT(R71&\":\"&S71,\"\")","v":{"$error":"#REF!"}}]
[null,null,null,null,null,null,"(03.02) MMR (Primary)"]
[null,null,null,null,null,null,"MMR (Primary)(%)"]
[null,null,null,null,null,null,"(03) 5 YEAR COHORT"]
[null,null,null,null,null,null,"(03.05) MMR (Booster)",null,"Waltham Forest","Total"]
[null,null,null,null,null,null,"MMR (Booster)(%)","WF-1","Chingford/ Walthamstow","WF-1"]
[null,null,null,null,null,null,null,"WF-2","Chingford E4","WF-2"]
[null,null,null,null,null,null,null,"WF-3","Leyton Collaborative","WF-3"]
[null,null,null,null,null,null,null,"WF-4","Forest Integrated Health","WF-4"]
[null,null,null,null,null,null,null,"WF-5","South Leytonstone","WF-5"]
[null,null,null,null,null,null,null,"WF-6","Central Walthamstow","WF-6"]
[null,null,null,null,null,null,null,"WF-7","Walthamstow West","WF-7"]
["F86700","Kings Head Medical Practice","WF","Waltham Forest","WF-1","Chingford E4",null,"WF-1","Dr Shantir Practice","F86626","WF-6"]
["F86664","Larkshall Medical Centre","WF","Waltham Forest","WF-1","Chingford E4",null,"WF-1","Kings Head Medical Practice","F86700","WF-2"]
["F86638","The Microfaculty*","WF","Waltham Forest","WF-1","Chingford E4",null,"WF-1","Larkshall Medical Centre","F86664","WF-2"]
["F86005"," The Penryhn Surgery","WF","Waltham Forest","WF-1","Chingford/ Walthamstow",null,"WF-1","Lime Tree & Sinnott Healthcare Ltd","Y01839","WF-6"]
["F86626","Dr Shantir Practice","WF","Waltham Forest","WF-1","Chingford/ Walthamstow",null,"WF-1"," The Penryhn Surgery","F86005","WF-4"]
["Y01839","Lime Tree & Sinnott Healthcare Ltd","WF","Waltham Forest","WF-1","Chingford E4",null,"WF-1","The Bailey Practice","F86689","WF-6"]
["F86689","The Bailey Practice","WF","Waltham Forest","WF-1","Chingford/ Walthamstow",null,"WF-2","Chingford Medical Practice","Y01291","WF-1"]
["F86026","Forest Surgery*","WF","Waltham Forest","WF-1","Leyton Collaborative",null,"WF-2","Churchill Medical Centre","F86627","WF-4"]
["F86004","Handsworth Medical Centre*","WF","Waltham Forest","WF-1","Forest Integrated Health",null,"WF-2","Old Church Surgery","F86616","WF-5"]
["Y01291","Chingford Medical Practice","WF","Waltham Forest","WF-2","Leyton Collaborative",null,"WF-2","The Ridgeway Surgery","F86078","WF-4"]
["F86627","Churchill Medical Centre","WF","Waltham Forest","WF-2","Forest Integrated Health",null,"WF-3","Sma Medical Centre","F86038","WF-5"]
["F86078","The Ridgeway Surgery","WF","Waltham Forest","WF-2","Forest Integrated Health",null,"WF-3","The Manor Practice","F86011","WF-7"]
["F86616","Old Church Surgery","WF","Waltham Forest","WF-2","South Leytonstone",null,"WF-4"," Crawley Road Medical Centre","F86044","WF-5"]
["F86011","The Manor Practice","WF","Waltham Forest","WF-3","Forest Integrated Health",null,"WF-4","Francis Road Medical Centre","F86696","WF-5"]
["F86038","Sma Medical Centre","WF","Waltham Forest","WF-3","South Leytonstone",null,"WF-4","Hampton Medical Centre","F86712","WF-5"]
["F86074","Leyton Healthcare (Oliver Road)*","WF","Waltham Forest","WF-3","South Leytonstone",null,"WF-4","Lime Tree Surgery","F86650","WF-1"]
["F86036","The Allum Medical Centre","WF","Waltham Forest","WF-4","Forest Integrated Health",null,"WF-4","The Allum Medical Centre","F86036","WF-1"]
["F86044"," Crawley Road Medical Centre","WF","Waltham Forest","WF-4","South Leytonstone",null,"WF-4","The Lyndhurst Surgery","F86088","WF-4"]
["F86696","Francis Road Medical Centre","WF","Waltham Forest","WF-4","South Leytonstone",null,"WF-5","Green Man Medical Centre","F86621","WF-1"]
["F86712","Hampton Medical Centre","WF","Waltham Forest","WF-4","South Leytonstone",null,"WF-5","High Road Surgery","F86045","WF-7"]
["F86650","Lime Tree Surgery","WF","Waltham Forest","WF-4","Forest Integrated Health",null,"WF-5","Kiyani Medical Practice","F86701","WF-7"]
["F86088","The Lyndhurst Surgery","WF","Waltham Forest","WF-4","Leyton Collaborative",null,"WF-5","LL Medical Care (Agarwal & Agrwal Practice)","F86625","WF-3"]
["F86018","The Ecclesbourne Practice*","WF","Waltham Forest","WF-4","Leyton Collaborative",null,"WF-5","The Langthorne Sharma Family Practice","F86705","WF-7"]
["F86621","Green Man Medical Centre","WF","Waltham Forest","WF-5","Forest Integrated Health",null,"WF-5","The Harrow Road Surgery","F86666","WF-4"]
["F86045","High Road Surgery","WF","Waltham Forest","WF-5","Central Walthamstow",null,"WF-6","Addison Road Medical Practice","F86607","WF-1"]
["F86701","Kiyani Medical Practice","WF","Waltham Forest","WF-5","Central Walthamstow",null,"WF-6","Claremont Medical Centre","F86708","WF-6"]
["F86625","LL Medical Care (Agarwal & Agrwal Practice)","WF","Waltham Forest","WF-5","Central Walthamstow",null,"WF-6","Dr Dhital Practice","F86086","WF-7"]
["F86666","The Harrow Road Surgery","WF","Waltham Forest","WF-5","Chingford/ Walthamstow",null,"WF-6"," The Firs","F86001","WF-5"]
["F86705","The Langthorne Sharma Family Practice","WF","Waltham Forest","WF-5","Central Walthamstow",null,"WF-6","Waltham Forest Community & Family Health Services Ltd","F86644","WF-4"]
["F86607","Addison Road Medical Practice","WF","Waltham Forest","WF-6","Walthamstow West",null,"WF-7","Higham Hill Medical Centre","F86679","WF-3"]
["F86708","Claremont Medical Centre","WF","Waltham Forest","WF-6","Chingford/ Walthamstow",null,"WF-7"," Queens Road Medical Centre","F86030","WF-2"]
["F86001"," The Firs","WF","Waltham Forest","WF-6","Walthamstow West",null,"WF-7","Seymour Medical centre ","F86006","WF-3"]
["F86086","Dr Dhital Practice","WF","Waltham Forest","WF-6","Walthamstow West",null,"WF-7","St James Medical Practice Ltd","F86058","WF-2"]
["F86644","Waltham Forest Community & Family Health Services Ltd","WF","Waltham Forest","WF-6","Walthamstow West",null,"WF-7","The Grove Road Medical Centre ","F86062","WF-6"]
["F86006","Seymour Medical centre ","WF","Waltham Forest","WF-7","Chingford/ Walthamstow"]
["F86030"," Queens Road Medical Centre","WF","Waltham Forest","WF-7","Walthamstow West"]
["F86062","The Grove Road Medical Centre ","WF","Waltham Forest","WF-7","Chingford/ Walthamstow"]
["F86679","Higham Hill Medical Centre","WF","Waltham Forest","WF-7","Central Walthamstow"]
["F86058","St James Medical Practice Ltd","WF","Waltham Forest","WF-7","Chingford/ Walthamstow"]
[null,null,null,null,null,"Chingford/ Walthamstow"]
[]
[]
[]
[]
[]
[]
[]
[null,{"$f":"VLOOKUP(D132,$B$13:$C$47,2,FALSE)","v":"F86700"},"F86700","Kings Head Medical Practice",null,null,"F86700","Kings Head Medical Practice","WF","Waltham Forest","WF-1"]
[null,{"$f":"VLOOKUP(D133,$B$13:$C$47,2,FALSE)","v":"F86664"},"F86664","Larkshall Medical Centre",null,null,"F86664","Larkshall Medical Centre","WF","Waltham Forest","WF-1"]
[null,{"$error":"#N/A"},"F86638","The Microfaculty",null,null,"F86638","The Microfaculty","WF","Waltham Forest","WF-1"]
[null,"F86005","F86005"," The Penryhn Surgery",null,null,"F86005"," The Penryhn Surgery","WF","Waltham Forest","WF-1"]
[null,"F86626","F86626","Dr Shantir Practice",null,null,"F86626","Dr Shantir Practice","WF","Waltham Forest","WF-1"]
[null,"Y01839","Y01839","Lime Tree & Sinnott Healthcare Ltd",null,null,"Y01839","Lime Tree & Sinnott Healthcare Ltd","WF","Waltham Forest","WF-1"]
[null,"F86689","F86689","The Bailey Practice",null,null,"F86689","The Bailey Practice","WF","Waltham Forest","WF-1"]
[null,{"$error":"#N/A"},"F86026","Forest Surgery",null,null,"F86026","Forest Surgery","WF","Waltham Forest","WF-1"]
[null,{"$error":"#N/A"},"F86004","Handsworth Medical Centre",null,null,"F86004","Handsworth Medical Centre","WF","Waltham Forest","WF-2"]
[null,"Y01291","Y01291","Chingford Medical Practice",null,null,"Y01291","Chingford Medical Practice","WF","Waltham Forest","WF-2"]
[null,"F86627","F86627","Churchill Medical Centre",null,null,"F86627","Churchill Medical Centre","WF","Waltham Forest","WF-2"]
[null,"F86078","F86078","The Ridgeway Surgery",null,null,"F86078","The Ridgeway Surgery","WF","Waltham Forest","WF-2"]
[null,"F86616","F86616","Old Church Surgery",null,null,"F86616","Old Church Surgery","WF","Waltham Forest","WF-2"]
[null,"F86011","F86011","The Manor Practice",null,null,"F86011","The Manor Practice","WF","Waltham Forest","WF-3"]
[null,"F86038","F86038","Sma Medical Centre",null,null,"F86038","Sma Medical Centre","WF","Waltham Forest","WF-3"]
[null,{"$error":"#N/A"},"Y02585","The Orient Practice",null,null,"Y02585","The Orient Practice","WF","Waltham Forest","WF-3"]
[null,{"$error":"#N/A"},"F86074","Leyton Healthcare (Oliver Road)",null,null,"F86074","Leyton Healthcare (Oliver Road)","WF","Waltham Forest","WF-3"]
[null,"F86036","F86036","The Allum Medical Centre",null,null,"F86036","The Allum Medical Centre","WF","Waltham Forest","WF-4"]
[null,"F86044","F86044"," Crawley Road Medical Centre",null,null,"F86044"," Crawley Road Medical Centre","WF","Waltham Forest","WF-4"]
[null,"F86696","F86696","Francis Road Medical Centre",null,null,"F86696","Francis Road Medical Centre","WF","Waltham Forest","WF-4"]
[null,"F86712","F86712","Hampton Medical Centre",null,null,"F86712","Hampton Medical Centre","WF","Waltham Forest","WF-4"]
[null,"F86650","F86650","Lime Tree Surgery",null,null,"F86650","Lime Tree Surgery","WF","Waltham Forest","WF-4"]
[null,"F86088","F86088","The Lyndhurst Surgery",null,null,"F86088","The Lyndhurst Surgery","WF","Waltham Forest","WF-4"]
[null,{"$error":"#N/A"},"F86018","The Ecclesbourne Practice",null,null,"F86018","The Ecclesbourne Practice","WF","Waltham Forest","WF-4"]
[null,"F86621","F86621","Green Man Medical Centre",null,null,"F86621","Green Man Medical Centre","WF","Waltham Forest","WF-5"]
[null,"F86045","F86045","High Road Surgery",null,null,"F86045","High Road Surgery","WF","Waltham Forest","WF-5"]
[null,"F86701","F86701","Kiyani Medical Practice",null,null,"F86701","Kiyani Medical Practice","WF","Waltham Forest","WF-5"]
[null,"F86625","F86625","LL Medical Care (Agarwal & Agrwal Practice)",null,null,"F86625","LL Medical Care (Agarwal & Agrwal Practice)","WF","Waltham Forest","WF-5"]
[null,"F86666","F86666","The Harrow Road Surgery",null,null,"F86666","The Harrow Road Surgery","WF","Waltham Forest","WF-5"]
[null,"F86705","F86705","The Langthorne Sharma Family Practice",null,null,"F86705","The Langthorne Sharma Family Practice","WF","Waltham Forest","WF-5"]
[null,"F86607","F86607","Addison Road Medical Practice",null,null,"F86607","Addison Road Medical Practice","WF","Waltham Forest","WF-6"]
[null,"F86708","F86708","Claremont Medical Centre",null,null,"F86708","Claremont Medical Centre","WF","Waltham Forest","WF-6"]
[null,"F86001","F86001"," The Firs",null,null,"F86001"," The Firs","WF","Waltham Forest","WF-6"]
[null,"F86086","F86086","Dr Dhital Practice",null,null,"F86086","Dr Dhital Practice","WF","Waltham Forest","WF-6"]
[null,"F86644","F86644","Waltham Forest Community & Family Health Services Ltd",null,null,"F86644","Waltham Forest Community & Family Health Services Ltd","WF","Waltham Forest","WF-6"]
[null,"F86006","F86006","Seymour Medical Centre",null,null,"F86006","Seymour Medical Centre","WF","Waltham Forest","WF-7"]
[null,"F86030","F86030"," Queens Road Medical Centre",null,null,"F86030"," Queens Road Medical Centre","WF","Waltham Forest","WF-7"]
[null,"F86062","F86062","Grove Surgery",null,null,"F86062","Grove Surgery","WF","Waltham Forest","WF-7"]
[null,"F86679","F86679","Higham Hill Medical Centre",null,null,"F86679","Higham Hill Medical Centre","WF","Waltham Forest","WF-7"]
[null,"F86058","F86058","St James Medical Practice Ltd",null,null,"F86058","St James Medical Practice Ltd","WF","Waltham Forest","WF-7"]

{"sheet":"Sheet2","index":11,"n_rows":274,"n_cols":15,"rows_kept":274,"cut":false,"hidden":true,"merged":[]}
["Practice ID","Practice","Locality ID","Locality","SubLocality ID","SubLocality","Clinical System","Address 1","Address 2","Postcode","Grid Reference","X (easting)","Y (northing)","Latitude","Longitude"]
["F82001","Halbutt Street Surgery","BK","Barking and Dagenham","BK-1","East","EMISweb","2 Halbutt Street","Dagenham","RM9 5AS","TQ 48956 85305",548956,185305,51.546982999999997,0.14681208000000001]
["F82005","Church Elm Lane Medical Practice","BK","Barking and Dagenham","BK-1","East","EMISweb","Church Elm Lane","Dagenham","RM10 9RR","TQ 49667 84556",549667,184556,51.540066000000003,0.15673988]
["Y01719","Broad Street Medical Centre","BK","Barking and Dagenham","BK-1","East","EMISweb","Broad Street Resource Centre","Dagenham","RM10 9HU","TQ 49367 83962",549367,183962,51.534807999999998,0.15216547999999999]
["Y02575","Porters Avenue Doctors Surgery","BK","Barking and Dagenham","BK-1","East","EMISweb","234 Porters Avenue","Dagenham","RM8 2EQ","TQ 47283 85077",547283,185077,51.545372999999998,0.12260706]
["F82003","First Avenue Surgery","BK","Barking and Dagenham","BK-2","East One","EMISweb","2 First Avenue","Dagenham","RM10 9AT","TQ 49762 83388",549762,183388,51.529546000000003,0.15761231000000001]
["F82015","Hedgemans Surgery","BK","Barking and Dagenham","BK-2","East One","EMISweb","92 Hedgemans Road","Dagenham","RM9 6HT","TQ 48734 84495",548734,184495,51.539763999999998,0.14327081999999999]
["F82017","St Albans Surgery ","BK","Barking and Dagenham","BK-2","East One","EMISweb","Urswick Road","Dagenham","RM9 6EA","TQ 48052 84181",548052,184181,51.537121999999997,0.13331214999999999]
["F82621","The Surgery (Dr Ola)","BK","Barking and Dagenham","BK-2","East One","EMISweb","36 Dewey Road","Dagenham","RM10 8AR","TQ 50141 84824",550141,184824,51.542347999999997,0.16368373999999999]
["F82634","Heathway Medical Centre","BK","Barking and Dagenham","BK-2","East One","EMISweb","Morland Road ","Dagenham","RM10 9HU","TQ 49367 83962",549367,183962,51.534807999999998,0.15216547999999999]
["F82678","Dr Alkaisy Surgery ","BK","Barking and Dagenham","BK-2","East One","EMISweb","Urswick Road","Dagenham","RM9 6EA","TQ 48052 84181",548052,184181,51.537121999999997,0.13331214999999999]
["F82679","Parkview Medical Practice","BK","Barking and Dagenham","BK-2","East One","EMISweb","199 Reede Road","Dagenham","RM10 8EJ","TQ 49877 85126",549877,185126,51.545130999999998,0.16000821000000001]
["F82034","Victoria Medical Centre","BK","Barking and Dagenham","BK-3","West","EMISweb","1 Queens Road","Barking","IG11 8GD","TQ 44085 84494",544085,184494,51.540959999999998,7.6282445000000004E-2]
["F82042","Aurora Medcare","BK","Barking and Dagenham","BK-3","West","EMISweb","1 King Edwards Road","Barking","IG11 7TB","TQ 44643 83708",544643,183708,51.533754999999999,8.4000310999999994E-2]
["F82625","Abbey Medical centre","BK","Barking and Dagenham","BK-3","West","EMISweb","1 Harpour Road","Barking","IG11 8RJ","TQ 44215 84642",544215,184642,51.542256000000002,7.8216283999999997E-2]
["Y01280","Shifa Medical Practice","BK","Barking and Dagenham","BK-3","West","EMISweb","Gasgoine Road","Barking","IG11 7RS","TQ 44478 83438",544478,183438,51.531371,8.1512427999999998E-2]
["F82018","Barking Medical  Group Practice","BK","Barking and Dagenham","BK-4","West One","EMISweb","130 Upney lane","Barking","IG11 9LT","TQ 45536 84574",545536,184574,51.541307000000003,9.7223614999999999E-2]
["F82040","John Smith House","BK","Barking and Dagenham","BK-4","West One","EMISweb","145-207 Bevan Avenue","Barking","IG11 9NS","TQ 46496 84245",546496,184245,51.538102000000002,0.11091985]
["F82612","The White House","BK","Barking and Dagenham","BK-4","West One","EMISweb","12 Movers Lane","Barking","IG11 7UN","TQ 44930 83744",544930,183744,51.534005000000001,8.8149991999999996E-2]
["F82647","Dr Gupta & Partner","BK","Barking and Dagenham","BK-4","West One","EMISweb","7 Salisbury Avenue","Barking","IG11 9XQ","TQ 44605 84272",544605,184272,51.538831999999999,8.3684289999999995E-2]
["F82650","Ripple Road Medical Centre","BK","Barking and Dagenham","BK-4","West One","EMISweb","343 Ripple Road","Barking","IG11 7RJ","TQ 45217 83938",545217,183938,51.535674,9.2364823999999998E-2]
["F82680","Highgrove Surgery","BK","Barking and Dagenham","BK-4","West One","SystmOne","Upney Lane ","Barking","IG11 9LX","TQ 45644 84306",545644,184306,51.538871,9.8669044999999997E-2]
["F82027","Faircross Health Centre","BK","Barking and Dagenham","BK-5","North","EMISweb","51 Upney Lane","Barking","IG11 9LP","TQ 45367 84850",545367,184850,51.54383,9.4902305000000006E-2]
["F82012","Five Elms","BK","Barking and Dagenham","BK-5","North","EMISweb","Five Elms Road","Dagenham","RM9 5TT","TQ 48622 86004",548622,186004,51.553351999999997,0.14229391]
["F82025","Julia Engwell Surgery","BK","Barking and Dagenham","BK-5","North","EMISweb","Woodward Road","Dagenham","RM9 4SR","TQ 47520 84362",547520,184362,51.538887000000003,0.12572291999999999]
["F82051","Laburnum Health centre","BK","Barking and Dagenham","BK-5","North","EMISweb","11 Althorne Way","Dagenham","RM10 7DF","TQ 49234 86817",549234,186817,51.560495000000003,0.15145929999999999]
["F82642","Gables Surgery","BK","Barking and Dagenham","BK-5","North","EMISweb","Markyate Road","Dagenham","RM8 2LD","TQ 46953 85105",546953,185105,51.545710999999997,0.11786323999999999]
["F82661","Green Lane Surgery","BK","Barking and Dagenham","BK-5","North","EMISweb","872 Green Lane","Dagenham","RM8 1BX","TQ 48005 86869",548005,186869,51.561286000000003,0.13376487000000001]
["F86040","The Surgery","BK","Barking and Dagenham","BK-5","North","EMISweb","620 Longbridge Road","Dagenham","RM8 2AJ","TQ 46755 85732",546755,185732,51.551395999999997,0.11527123]
["Y01795","Oval Road Practice","BK","Barking and Dagenham","BK-5","North","EMISweb","69 Oval Road North","Dagenham","RM10 9ET","TQ 49697 83763",549697,183763,51.532933,0.15683522999999999]
["F82038","Valence Medical Centre","BK","Barking and Dagenham","BK-5","North","EMISweb","563 Valence Avenue","Dagenham","RM8 3RH","TQ 47822 85951",547822,185951,51.553086,0.13074125]
["F82604","Marks Gate Medical Practice","BK","Barking and Dagenham","BK-6","Central","EMISweb","Lawn Farm Grove","Dagenham","RM6 5LL","TQ 48155 89472",548155,189472,51.584634999999999,0.13702396999999999]
["F82660","Tulasi Medical Centre","BK","Barking and Dagenham","BK-6","Central","EMISweb","10 Bennetts Castle Lane","Dagenham","RM8 3XU","TQ 47363 86819",547363,186819,51.561005000000002,0.12448914]
["F82677","Becontree Medical Centre","BK","Barking and Dagenham","BK-6","Central","EMISweb","645 Becontree Avenue","Dagenham","RM8 3HP","TQ 48516 86671",548516,186671,51.559373000000001,0.1410476]
["F84013","Stamford Hill Surgery ","CH","City & Hackney","CH-NE1","Springfield Park (NE1)","EMISweb","2 Egerton Road","Stamford Hill","N16 6UA","TQ 33741 87885",533741,187885,51.573976000000002,-7.1492951999999999E-2]
["F84686","Cranwich Road Surgery ","CH","City & Hackney","CH-NE1","Springfield Park (NE1)","EMISweb","62 Cranwich Road",null,"N16 5JF","TQ 33045 87827",533045,187827,51.573619000000001,-8.1552204000000003E-2]
["Y03049","Spring Hill Practice","CH","City & Hackney","CH-NE1","Springfield Park (NE1)","EMISweb","19-21 Oldhill Street",null,"N16 6LU","TQ 34202 87381",534202,187381,51.569336999999997,-6.5037069000000003E-2]
["F84018","The Nightingale Practice","CH","City & Hackney","CH-NE2","Hackney Downs (NE2)","EMISweb","10 Kenninghall Rd","Clapton","E5 8BY","TQ 34412 86145",534412,186145,51.55818,-6.2481117000000003E-2]
["F84080","The Gadvhi Practice","CH","City & Hackney","CH-NE2","Hackney Downs (NE2)","EMISweb","1a Fountayne Road",null,"N16 7EA","TQ 34209 86834",534209,186834,51.564419999999998,-6.5144830000000001E-2]
["F84619","The Riverside Practice","CH","City & Hackney","CH-NE2","Hackney Downs (NE2)","EMISweb","14 Urban Hive, Theydon Rd",null,"E5 9BQ","TQ 35164 86953",535164,186953,51.565261999999997,-5.1329751999999999E-2]
["F84668","Clapton Surgery","CH","City & Hackney","CH-NE2","Hackney Downs (NE2)","EMISweb","14 Theydon Road",null,"E5 9BQ","TQ 35164 86953",535164,186953,51.565261999999997,-5.1329751999999999E-2]
["F84685","Elm Practice","CH","City & Hackney","CH-NE2","Hackney Downs (NE2)","EMISweb","1a Fountayne Road",null,"N16 7EA","TQ 34209 86834",534209,186834,51.564419999999998,-6.5144830000000001E-2]
["F84711","Rosewood Practice","CH","City & Hackney","CH-NE2","Hackney Downs (NE2)","EMISweb","1a Fountayne Road",null,"N16 7EA","TQ 34209 86834",534209,186834,51.564419999999998,-6.5144830000000001E-2]
["F84720","Healy Medical Centre","CH","City & Hackney","CH-NE2","Hackney Downs (NE2)","EMISweb","200 Upper Clapton Road",null,"E5 9HD","TQ 35028 87268",535028,187268,51.568125000000002,-5.3169741999999999E-2]
["F84036","Cedar Practice ","CH","City & Hackney","CH-NW1","Woodberry Wetlands (NW1)","EMISweb","John Scott Health Centre","Green Lanes","N4 2NU","TQ 32221 87203",532221,187203,51.568204999999999,-9.3670042999999995E-2]
["F84115","Statham Grove Surgery","CH","City & Hackney","CH-NW1","Woodberry Wetlands (NW1)","EMISweb","Statham Grove",null,"N16 9DP","TQ 32544 86016",532544,186016,51.557462999999998,-8.9459644000000005E-2]
["F84119","The Heron Practice","CH","City & Hackney","CH-NW1","Woodberry Wetlands (NW1)","EMISweb","John Scott Health Centre","Green Lanes","N4 2NU","TQ 32221 87203",532221,187203,51.568204999999999,-9.3670042999999995E-2]
["F84716","Allerton Road Medical Centre","CH","City & Hackney","CH-NW1","Woodberry Wetlands (NW1)","EMISweb","34a Allerton Road",null,"N16 5UF","TQ 32456 86933",532456,186933,51.565724000000003,-9.0383086000000001E-2]
["F84008","Barton House Health Centre","CH","City & Hackney","CH-NW2","Clissold Park (NW2)","EMISweb","233 Albion Road","Stoke Newington","N16 9JT","TQ 32926 86369",532926,186369,51.560544999999998,-8.3819307999999995E-2]
["F84033","Somerford Grove Practice","CH","City & Hackney","CH-NW2","Clissold Park (NW2)","EMISweb","Somerford Grove",null,"N16 7UA","TQ 33722 85639",533722,185639,51.553797000000003,-7.2620630000000005E-2]
["F84636","Barretts Grove Surgery","CH","City & Hackney","CH-NW2","Clissold Park (NW2)","EMISweb","6 Barretts Grove",null,"N16 8AR","TQ 33334 85451",533334,185451,51.552199999999999,-7.8284858999999998E-2]
["F84694","Brooke Road Surgery","CH","City & Hackney","CH-NW2","Clissold Park (NW2)","EMISweb","40-42 Brooke Road",null,"N16 7LR","TQ 33833 86338",533833,186338,51.560051999999999,-7.0754775000000006E-2]
["F84003","Lower Clapton Group Practice","CH","City & Hackney","CH-SE1","Hackney Marshes (SE1)","EMISweb","36 Lower Clapton Road",null,"E5 0PD","TQ 35145 85320",535145,185320,51.550592000000002,-5.2230775E-2]
["F84015","Kingsmead Healthcare","CH","City & Hackney","CH-SE1","Hackney Marshes (SE1)","EMISweb","4 Kingsmead Way",null,"E9 5QG","TQ 36351 85487",536351,185487,51.551803,-3.4783215999999999E-2]
["F84060","Athena Medical Centre","CH","City & Hackney","CH-SE1","Hackney Marshes (SE1)","EMISweb","21 Atherden Road","Clapton","E5 0QP","TQ 35057 85799",535057,185799,51.554917000000003,-5.3315426999999999E-2]
["F84105","The Lea Surgery","CH","City & Hackney","CH-SE1","Hackney Marshes (SE1)","EMISweb","186 Homerton High Street",null,"E9 6AG","TQ 35784 85079",535784,185079,51.548273000000002,-4.311334E-2]
["F84719","Latimer Health Centre","CH","City & Hackney","CH-SE1","Hackney Marshes (SE1)","EMISweb","4 Homerton Terrace",null,"E9 6RT","TQ 35346 84880",535346,184880,51.546590000000002,-4.9502727000000003E-2]
["F84069","The Well Street Surgery","CH","City & Hackney","CH-SE2","Well Street Common (SE2)","EMISweb","28 Shore Road",null,"E9 7TA","TQ 35138 84055",535138,184055,51.539225999999999,-5.2817041000000002E-2]
["F84601","Elsdale Street Surgery ","CH","City & Hackney","CH-SE2","Well Street Common (SE2)","EMISweb","28 Elsdale Street",null,"E9 6QY","TQ 35380 84483",535380,184483,51.543013999999999,-4.9165300000000002E-2]
["F84620","The Wick Health Centre","CH","City & Hackney","CH-SE2","Well Street Common (SE2)","EMISweb","200 Wick Rd",null,"E9 5AN","TQ 36085 84711",536085,184711,51.544893999999999,-3.8917245000000003E-2]
["F84632","The Greenhouse","CH","City & Hackney","CH-SE2","Well Street Common (SE2)","EMISweb","19 Tudor Road",null,"E9 7SN","TQ 34985 83975",534985,183975,51.538544000000002,-5.5052455E-2]
["Y00403","Trowbridge Surgery ","CH","City & Hackney","CH-SE2","Well Street Common (SE2)","EMISweb","18 Merriam Avenue",null,"E9 5NE","TQ 36747 84792",536747,184792,51.545462000000001,-2.9345178999999999E-2]
["F84021","London Fields Medical Centre","CH","City & Hackney","CH-SW1","London Fields (SW1)","EMISweb","38-44 Broadway Market",null,"E8 4QJ","TQ 34536 83745",534536,183745,51.536583999999998,-6.1610386000000003E-2]
["F84035","Richmond Road Medical Centre","CH","City & Hackney","CH-SW1","London Fields (SW1)","EMISweb","136 Richmond Road",null,"E8 3HN","TQ 34245 84457",534245,184457,51.543050999999998,-6.5532240000000005E-2]
["F84038","Beechwood Medical Centre","CH","City & Hackney","CH-SW1","London Fields (SW1)","EMISweb","86-86a Dalston Lane",null,"E8 3AH","TQ 33890 84780",533890,184780,51.546038000000003,-7.0525556000000003E-2]
["F84063","Dalston Practice","CH","City & Hackney","CH-SW1","London Fields (SW1)","EMISweb","1b Madinah Road",null,"E8 1PG","TQ 34111 84978",534111,184978,51.547764999999998,-6.7264995999999994E-2]
["F84117","Queensbridge Group Practice","CH","City & Hackney","CH-SW1","London Fields (SW1)","EMISweb","24, Holly Street",null,"E8 3XP","TQ 33838 84271",533838,184271,51.541476000000003,-7.1468413999999994E-2]
["F84621","The Sandringham Practice","CH","City & Hackney","CH-SW1","London Fields (SW1)","EMISweb","1a Madinah Road",null,"E8 1PG","TQ 34111 84978",534111,184978,51.547764999999998,-6.7264995999999994E-2]
["F84640","The Neaman Practice","CH","City & Hackney","CH-SW2","Shoreditch Park & City (SW2)","EMISweb","15 Half Moon Court",null,"EC1A 7HF","TQ 32048 81725",532048,181725,51.519018000000003,-9.8218282000000004E-2]
["F84041","Southgate & Whiston Road Surgery","CH","City & Hackney","CH-SW2","Shoreditch Park & City (SW2)","EMISweb","101 - 103 Southgate Road",null,"N1 3JS","TQ 32865 84163",532865,184163,51.540736000000003,-8.5531212999999995E-2]
["F84072","De Beauvoir Surgery","CH","City & Hackney","CH-SW2","Shoreditch Park & City (SW2)","EMISweb","30 Hertford Road",null,"N1 5QT","TQ 33377 83922",533377,183922,51.538449,-7.8244064000000002E-2]
["F84096","The Lawson Practice","CH","City & Hackney","CH-SW2","Shoreditch Park & City (SW2)","EMISweb","St Leonard's Hospital, Nuttall St","Nuttall Street","N1 5HZ","TQ 33302 83395",533302,183395,51.533731000000003,-7.9524182999999998E-2]
["F84635","Shoreditch Park Surgery","CH","City & Hackney","CH-SW2","Shoreditch Park & City (SW2)","EMISweb","10 Rushton Street",null,"N1 5DR","TQ 32796 83359",532796,183359,51.533526999999999,-8.6828572000000007E-2]
["F84692","The Hoxton Surgery","CH","City & Hackney","CH-SW2","Shoreditch Park & City (SW2)","EMISweb","12 Rushton Street",null,"N1 5DR","TQ 32796 83359",532796,183359,51.533526999999999,-8.6828572000000007E-2]
["F82011","St Edwards Surgery","HV","Havering","HV-1","Havering Crest","EMISweb","7 St Edwards Way","Romford","RM1 3DQ","TQ 51307 89056",551307,189056,51.580061000000001,0.18230462]
["F82019","Chadwell Heath Health Centre - The Upstairs Surgery (Dr Hamilton-Smith)","HV","Havering","HV-1","Havering Crest","EMISweb","Ashton Garden","Chadwell Heath","RM6 6RT","TQ 48405 88264",548405,188264,51.573715,0.14011965000000001]
["F82638","The Modern Medical Centre","HV","Havering","HV-1","Havering Crest","EMISweb","195 Rush Green Road","Rush Green","RM7 0PX","TQ 51030 87418",551030,187418,51.565418000000001,0.17760643000000001]
["F82039","Rush Green Medical Centre (Dr Poologanathan & Partners)","HV","Havering","HV-1","Havering Crest","EMISweb","261 Dagenham Road","Rush Green","RM7 0XR","TQ 50932 86893",550932,186893,51.560727,0.1759684]
["F82031","Rush Green Medical Centre (Dr Sanomi)","HV","Havering","HV-1","Havering Crest","EMISweb","261 Dagenham Road","Rush Green","RM7 0XR","TQ 50932 86893",550932,186893,51.560727,0.1759684]
["F82023","High Street Surgery (Dr Pervez)","HV","Havering","HV-1","Havering Crest","EMISweb","219 High Street","Hornchurch","RM11 3XT","TQ 54233 87089",554233,187089,51.561596000000002,0.22363675]
["F82675","Billet Lane Medical Centre","HV","Havering","HV-1","Havering Crest","EMISweb","58b Billet Lane","Hornchurch","RM11 1XA","TQ 53895 87670",553895,187670,51.566907999999998,0.21901872]
["F82663","Brentwood Road Surgery (Dr Marks)","HV","Havering","HV-1","Havering Crest","EMISweb","107 Brentwood Road","Romford","RM1 2SB","TQ 52030 88243",552030,188243,51.572561999999998,0.19237934000000001]
["F82013","Western Road Medical Centre ","HV","Havering","HV-2","Havering Marshall","EMISweb","99 Western Road","Romford","RM1 3LS","TQ 51671 88948",551671,188948,51.578992,0.18750723]
["F82021","The New Medical Centre","HV","Havering","HV-2","Havering Marshall","EMISweb","264 Brentwood Road","Romford","RM2 5SU","TQ 52819 88475",552819,188475,51.574432999999999,0.20385631000000001]
["F82009","North Street Medical Care","HV","Havering","HV-2","Havering Marshall","EMISweb","274 North Street","Romford","RM1 4QJ","TQ 50672 89720",550672,189720,51.586196000000001,0.17343195]
["F82686","Chadwell Heath Health Centre (Dr A Patel)","HV","Havering","HV-3","Havering North","EMISweb","Ashton Gardens","Chadwell Heath","RM6 6RT","TQ 48405 88264",548405,188264,51.573715,0.14011965000000001]
["F82010","Petersfield Surgery","HV","Havering","HV-3","Havering North","EMISweb","70 Petersfield Ave","Harold Hill","RM3 9PD","TQ 54717 92014",554717,192014,51.605711999999997,0.23278188999999999]
["F82648","Ingrebourne Medical Centre","HV","Havering","HV-3","Havering North","EMISweb","135 Straight Road","Harold Hill","RM3 7JJ","TQ 53197 91366",553197,191366,51.600304999999999,0.21056731000000001]
["F82671","Straight Road Doctors Surgery (Dr Prasad)","HV","Havering","HV-3","Havering North","EMISweb","137 Straight Road","Harold Hill","RM3 7JJ","TQ 53197 91366",553197,191366,51.600304999999999,0.21056731000000001]
["F82670","AbbaMoor Surgery","HV","Havering","HV-3","Havering North","EMISweb","Gooshays Drive","Harold Hill","RM3 9SU","TQ 54169 92056",554169,192056,51.606239000000002,0.22489343000000001]
["F82014","Harold Hill Health Centre (Dr Kuchhai)","HV","Havering","HV-3","Havering North","EMISweb","Gooshays Drive","Harold Hill","RM3 9SU","TQ 54169 92056",554169,192056,51.606239000000002,0.22489343000000001]
["F82016","Central Park Surgery (Dr Kakad)","HV","Havering","HV-3","Havering North","EMISweb","Gooshays Drive","Harold Hill","RM3 9SU","TQ 54169 92056",554169,192056,51.606239000000002,0.22489343000000001]
["Y00312","The Robins Surgery","HV","Havering","HV-3","Havering North","EMISweb","Gooshays Drive","Harold Hill","RM3 9SU","TQ 54169 92056",554169,192056,51.606239000000002,0.22489343000000001]
["F82007","The Greenwood Practice","HV","Havering","HV-3","Havering North","EMISweb","89 Gubbins Lane","Harold Wood","RM3 0DR","TQ 54748 90860",554748,190860,51.595334999999999,0.23272048000000001]
["F82045","Oak Lodge Surgery (Dr Chowdhury)","HV","Havering","HV-3","Havering North","EMISweb","6 Oak Road","Harold Wood","RM3 0PT","TQ 54849 90533",554849,190533,51.592370000000003,0.23403325]
["Y02973","Kings Park Surgery","HV","Havering","HV-3","Havering North","EMISweb","St Clements Avenue","Harold Wood","RM3 0FE","TQ 54268 90605",554268,190605,51.593176,0.22568427999999999]
["F82030","Lynwood Medical Centre","HV","Havering","HV-3","Havering North","EMISweb","4 Lynwood Drive","Collier Row","RM5 3QL","TQ 49970 91426",549970,191426,51.601711999999999,0.16403546999999999]
["F82630","Chase Cross Medical Centre (Dr Kulendran)","HV","Havering","HV-3","Havering North","EMISweb","Chase Cross Road","Collier Row","RM5 3PJ","TQ 50027 91251",550027,191251,51.600124000000001,0.16478307]
["F82610","Dr N K Gupta Surgery","HV","Havering","HV-3","Havering North","EMISweb","206 Mawney Road","Romford","RM7 8BU","TQ 50077 89338",550077,189338,51.582923000000001,0.16468706999999999]
["F82055","Hornchurch Healthcare","HV","Havering","HV-4","Havering South","EMISweb","58b Billet Lane","Hornchurch","RM11 1XA","TQ 53895 87670",553895,187670,51.566907999999998,0.21901872]
["F82609","Sutton Ave surgery (P M Patel)","HV","Havering","HV-4","Havering South","EMISweb","24 Suttons Ave","Hornchurch","RM12 4LF","TQ 53941 86488",553941,186488,51.556274999999999,0.21916472000000001]
["F82002","Haiderian Medical Centre","HV","Havering","HV-4","Havering South","EMISweb","181 Corbets Tey Road","Upminster","RM14 2YN","TQ 55913 85795",555913,185795,51.549508000000003,0.24727998000000001]
["F82008","Maylands Health Care","HV","Havering","HV-4","Havering South","EMISweb","300 Upper Rainham Road","Elm Park","RM12 4EQ","TQ 51980 86056",551980,186056,51.552925000000002,0.19071367]
["F82028","Wood Lane Medical Centre","HV","Havering","HV-4","Havering South","EMISweb","39 Wood Lane","Elm Park","RM12 5HX","TQ 52375 85087",552375,185087,51.544113000000003,0.19598719000000001]
["F82666","The Surgery (Dr Rahman)","HV","Havering","HV-4","Havering South","EMISweb","482 South End Road","Elm Park","RM12 5PA","TQ 52924 85456",552924,185456,51.547280000000001,0.20405819]
["F82022","The Rosewood Medical Centre","HV","Havering","HV-4","Havering South","EMISweb","30 Astra Close","Hornchurch","RM12 5NJ","TQ 52722 84935",552722,184935,51.542653000000001,0.20092135999999999]
["F82619","Harlow Road Surgery (Dr N Tariq)","HV","Havering","HV-4","Havering South","EMISweb","1 Harlow Road","Rainham","RM13 7UP","TQ 51752 83712",551752,183712,51.531925999999999,0.18641779999999999]
["F82627","Rainham Health Centre","HV","Havering","HV-4","Havering South","EMISweb","Upminster Road South","Rainham","RM13 9AB","TQ 52533 82337",552533,182337,51.519362000000001,0.19707374999999999]
["F82649","Berwick Surgery","HV","Havering","HV-4","Havering South","EMISweb","17 Berwick Road","Rainham","RM13 9QU","TQ 53679 83242",553679,183242,51.527183000000001,0.21397231999999999]
["F82607","South Hornchurch Medical Practice","HV","Havering","HV-4","Havering South","EMISweb","382 Upminster Road North","North Rainham","RM13 9RZ","TQ 53703 82663",553703,182663,51.521974,0.21406560999999999]
["F82674","Avon Road Surgery (Cranham Health Centre)","HV","Havering","HV-4","Havering South","EMISweb","Avon Road","Cranham","RM14 1RG","TQ 57095 87988",557095,187988,51.568883,0.26529226]
["F82006","Cranham Village Surgery (Dr C Dahs & Dr IP Humberstone Surgery)","HV","Havering","HV-4","Havering South","EMISweb","143 Ingrebourne Gardens","Cranham","RM14 1BJ","TQ 56984 87288",556984,187288,51.562624999999997,0.26337961999999998]
["F82053","Upminster Medical Centre","HV","Havering","HV-4","Havering South","EMISweb","226 St Mary's Lane","Upminster","RM14 3DH","TQ 56440 86625",556440,186625,51.556818999999997,0.25524323999999998]
["F82624","The Upminster Bridge Surgery (Dr O'Moore)","HV","Havering","HV-4","Havering South","EMISweb","126 Upminster Road","Upminster","RM12 6PL","TQ 55046 86819",555046,186819,51.558947000000003,0.23523689]
["F82033","Dr V M Patel Surgery","HV","Havering","HV-4","Havering South","VISION","9 Glanville Drive","Hornchurch","RM11 3SZ","TQ 54586 87037",554586,187037,51.561031999999997,0.22870229]
["F84047","Custom House Surgery ","NH","Newham","NH-PCN1","South One Newham","EMISweb","16 Freemasons Rd",null,"E16 3NA","TQ 40635 81244",540635,181244,51.512625,2.5271616E-2]
["F84666","Dr Ruiz – St Lukes Medical Centre ","NH","Newham","NH-PCN1","South One Newham","EMISweb","2 St Luke's Square",null,"E16 1HT","TQ 39825 81135",539825,181135,51.511847000000003,1.3563443E-2]
["F84657","Cumberland Road Medical Practice ","NH","Newham","NH-PCN1","South One Newham","EMISweb","179 Cumberland Rd",null,"E13 8LS","TQ 40666 82033",540666,182033,51.519706999999997,2.6032652E-2]
["F84092","Glen Road Medical Centre ","NH","Newham","NH-PCN1","South One Newham","EMISweb","1-9 Glen Rd",null,"E13 8RU","TQ 41109 82327",541109,182327,51.522238999999999,3.2530946999999998E-2]
["F84017","Star Lane Medical Centre ","NH","Newham","NH-PCN1","South One Newham","EMISweb","121 Star Ln",null,"E16 4QH","TQ 39602 82012",539602,182012,51.519781999999999,1.0699055000000001E-2]
["F84717","Royal Docks Medical Centre ","NH","Newham","NH-PCN10","Docklands","EMISweb","21 East Ham Manor Way",null,"E6 5NA","TQ 43258 80969",543258,180969,51.509495999999999,6.2933420000000004E-2]
["F84093","Tollgate Health Centre ","NH","Newham","NH-PCN10","Docklands","EMISweb","220 Tollgate Rd",null,"E6 5JS","TQ 42787 81629",542787,181629,51.515546000000001,5.6418168999999997E-2]
["Y02928","E16 Health","NH","Newham","NH-PCN10","Docklands","EMISweb","76 Albert Rd",null,"E16 2DY","TQ 42593 80059",542593,180059,51.501486999999997,5.2989908000000002E-2]
["F84735","The Azad Practice ","NH","Newham","NH-PCN2","Central 1","EMISweb","152 Barking Road",null,"E6 3BD","TQ 41930 83350",541930,183350,51.531225999999997,4.4768458999999997E-2]
["F84669","Newham Medical Centre ","NH","Newham","NH-PCN2","Central 1","EMISweb","576 Green St",null,"E13 9DA","TQ 41405 83360",541405,183360,51.531447,3.7208861000000003E-2]
["F84010","St Bartholomew Surgery ","NH","Newham","NH-PCN2","Central 1","EMISweb","292A Barking Road ",null,"E6 3BA","TQ 42477 83507",542477,183507,51.532499000000001,5.2712424000000001E-2]
["F84004","Market Street Health Group","NH","Newham","NH-PCN2","Central 1","EMISweb","52 Market St",null,"E6 2RA","TQ 42814 83350",542814,183350,51.531002999999998,5.7504007000000003E-2]
["F84053","Greengate Medical Practice ","NH","Newham","NH-PCN2","Central 1","EMISweb","497 Barking Road",null,"E13 8PS","TQ 40757 82646",540757,182646,51.525193000000002,2.7588027000000001E-2]
["F84124","The Project Surgery ","NH","Newham","NH-PCN2","Central 1","EMISweb","10 Lettsom Walk",null,"E13 0LN","TQ 40253 83419",540253,183419,51.532263999999998,2.0635384999999999E-2]
["F84050","Boleyn Medical Centre ","NH","Newham","NH-PCN2","Central 1","EMISweb","152 Barking Road",null,"E6 3BD","TQ 41930 83350",541930,183350,51.531225999999997,4.4768458999999997E-2]
["F84052","Essex Lodge ","NH","Newham","NH-PCN3","Newham Central","EMISweb","94 Greengate St",null,"E13 0AS","TQ 40684 82946",540684,182946,51.527906999999999,2.6656164E-2]
["F84681","Balaam Street Practice ","NH","Newham","NH-PCN3","Newham Central","EMISweb","113 Balaam St",null,"E13 8AF","TQ 40488 82808",540488,182808,51.526716,2.3777605E-2]
["F84642","Lucas Avenue Surgery","NH","Newham","NH-PCN3","Newham Central","EMISweb",null,null,"E13 0QP","TQ 40943 83883",540943,183883,51.536262000000001,3.0761987000000001E-2]
["F84749","Carpenter's Practice","NH","Newham","NH-PCN3","Newham Central","EMISweb","236-252 High St",null,"E15 2JA","TQ 38568 83938",538568,183938,51.537343999999997,-3.4372387999999999E-3]
["F84658","Sangam Surgery ","NH","Newham","NH-PCN4","North East 1","EMISweb","Snowshill Rd",null,"E12 6BE","TQ 42142 85378",542142,185378,51.549394999999997,4.8640959999999997E-2]
["F84660","Dr CM Patel ","NH","Newham","NH-PCN4","North East 1","EMISweb","2 Jephson Rd",null,"E7 8LZ","TQ 41250 84414",541250,184414,51.540956999999999,3.5398279999999997E-2]
["F84088","Plashet Medical Centre ","NH","Newham","NH-PCN4","North East 1","EMISweb","152 Plashet Rd",null,"E13 0QT","TQ 41097 84021",541097,184021,51.537464,3.3036159000000002E-2]
["F84670","Westbury Road Medical Practice","NH","Newham","NH-PCN4","North East 1","EMISweb","45 Westbury Terrace",null,"E7 8BU","TQ 40876 84941",540876,184941,51.545786,3.0219711999999999E-2]
["F84729","The Manor Park Practice","NH","Newham","NH-PCN4","North East 1","EMISweb","778 Romford Rd",null,"E12 5JG","TQ 42725 85896",542725,185896,51.553902999999998,5.7253423999999997E-2]
["F84641","Birchdale Road Medical Practice ","NH","Newham","NH-PCN4","North East 1","EMISweb","2 Birchdale Rd",null,"E7 8AR","TQ 41441 85069",541441,185069,51.546795000000003,3.8413612E-2]
["F84739","E12 Medical Practice ","NH","Newham","NH-PCN5","North East 2","EMISweb","243 High Street North",null,"E12 6SJ","TQ 42286 84464",542286,184464,51.541145999999998,5.0347099999999999E-2]
["F84006","Shrewsbury Road Surgery ","NH","Newham","NH-PCN5","North East 2","EMISweb","Shrewsbury Annexe' Shrewsbury Road",null,"E7 8QP","TQ 41796 84426",541796,184426,51.540928000000001,4.3270927000000001E-2]
["F84074","Wordsworth Health Centre ","NH","Newham","NH-PCN5","North East 2","EMISweb","19 Wordsworth Avenue",null,"E12 6SU","TQ 42172 84503",542172,184503,51.541525,4.8720109999999997E-2]
["F84741","Dr Sathyajith Surgery","NH","Newham","NH-PCN5","North East 2","EMISweb","Eastham Memorial Hospital",null,"E7 8QP","TQ 41796 84426",541796,184426,51.540928000000001,4.3270927000000001E-2]
["F84742","The Summit Practice ","NH","Newham","NH-PCN5","North East 2","EMISweb","Old East Ham Memorial Hospital",null,"E7 8PP","TQ 41670 84155",541670,184155,51.538524000000002,4.1346302000000001E-2]
["F84070","Lathom Medical Centre ","NH","Newham","NH-PCN5","North East 2","EMISweb","2A Lathom Rd",null,"E6 2DU","TQ 42458 84130",542458,184130,51.538102000000002,5.2690542999999999E-2]
["F84672","E7 Health - First 4 Health Group","NH","Newham","NH-PCN6","North Newham ","EMISweb","157 Leytonstone Rd",null,"E15 1LH","TQ 39102 85361",539102,185361,51.55,4.8192100999999996E-3]
["F84097","Claremont Clinic ","NH","Newham","NH-PCN6","North Newham ","EMISweb","459-463 Romford Rd",null,"E7 8AB","TQ 41105 85137",541105,185137,51.547490000000003,3.3598484999999997E-2]
["F84724","Woodgrange Medical Practice ","NH","Newham","NH-PCN6","North Newham ","EMISweb","40 Woodgrange Rd",null,"E7 0QH","TQ 40516 85243",540516,185243,51.548589,2.5152046000000001E-2]
["F84111","Abbey Road Medical Practice ","NH","Newham","NH-PCN8","Stratford","EMISweb","28a Abbey Rd",null,"E15 3LT","TQ 39225 83671",539225,183671,51.534782999999997,5.9240574000000001E-3]
["Y04273","Liberty Bridge Road ","NH","Newham","NH-PCN8","Stratford","EMISweb","40 Liberty Bridge Rd",null,"E20 1AS","TQ 38349 85140",538349,185140,51.548198999999997,-6.1207496000000002E-3]
["F84730","The Vicarage Lane Surgery","NH","Newham","NH-PCN8","Stratford","EMISweb","10 Vicarage Ln",null,"E15 4HG","TQ 39553 84332",539553,184332,51.540641999999998,1.0911766999999999E-2]
["F84121","First4Health Church Road","NH","Newham","NH-PCN8","Stratford","EMISweb","30 Church Road",null,"E12 6AQ","TQ 42460 85199",542460,185199,51.547707000000003,5.3151713000000003E-2]
["F84009","Stratford Village Surgery ","NH","Newham","NH-PCN8","Stratford","EMISweb","50C Romford Rd",null,"E15 4BZ","TQ 39233 84486",539233,184486,51.542104999999999,6.3613932999999996E-3]
["F84740","Newham Transitional Team ","NH","Newham","NH-PCN8","Stratford","EMISweb","30 Church Rd",null,"E12 6AQ","TQ 42460 85199",542460,185199,51.547707000000003,5.3151713000000003E-2]
["F84077","Dr Samuel & Dr Khan's Practice","NH","Newham","NH-PCN9","North West 2","EMISweb","10 Vicarage Ln",null,"E15 4ES","TQ 39491 84416",539491,184416,51.541412000000001,1.0051602E-2]
["F84677","East End Medical Centre ","NH","Newham","NH-PCN9","North West 2","EMISweb","61 Plashet Rd",null,"E13 0QA","TQ 40567 83994",540567,183994,51.537353000000003,2.5388643999999998E-2]
["F84022","Stratford Health Centre ","NH","Newham","NH-PCN9","North West 2","EMISweb","123 The Grove",null,"E15 1EN","TQ 39112 84766",539112,184766,51.544649999999997,4.7282946000000003E-3]
["F84086","The Forest Practice","NH","Newham","NH-PCN9","North West 2","EMISweb","121 Woodgrange Rd",null,"E7 0EP","TQ 40492 85464",540492,185464,51.550581000000001,2.4894327000000001E-2]
["F84014","Upton Lane Medical Centre ","NH","Newham","NH-PCN9","North West 2","EMISweb","75-77 Upton Ln",null,"E7 9PB","TQ 40620 84636",540620,184636,51.543109000000001,2.6408576E-2]
["F86652","Drive Surgery","RB","Redbridge","RB-1","Cranbrook","EMISweb","68 The Drive","Ilford","IG1 3HZ","TQ 42899 87429",542899,187429,51.567633999999998,6.0384001E-2]
["F86702","St Clements Surgery","RB","Redbridge","RB-1","Cranbrook","EMISweb","38 Bathhurst Road","Ilford","IG1 4LA","TQ 43751 87002",543751,187002,51.563580999999999,7.2493724999999995E-2]
["Y00918","Granville Medical Centre","RB","Redbridge","RB-1","Cranbrook","EMISweb","4 Granville Road","Ilford","IG1 4JY","TQ 43646 86952",543646,186952,51.563158000000001,7.0959545999999998E-2]
["F86042","Balfour Road Surgery","RB","Redbridge","RB-1","Cranbrook","EMISweb","92 Balfour Road","Ilford","IG1 4JE","TQ 43990 86949",543990,186949,51.563043,7.5917640999999994E-2]
["F86698","Cranbrook Surgery","RB","Redbridge","RB-1","Cranbrook","EMISweb","465 Cranbrook Road","Ilford","IG2 6EW","TQ 43201 88032",543201,188032,51.572975,6.4983819999999998E-2]
["F86008","Gants Hill Medical Centre","RB","Redbridge","RB-1","Cranbrook","EMISweb","63-65 Ethelbert Gardens","Gants Hill","IG2 6UW","TQ 43151 88496",543151,188496,51.577157,6.4451751000000002E-2]
["F86703","Redbridge Surgery","RB","Redbridge","RB-1","Cranbrook","EMISweb","49 Windermere Gardens","Gants Hill","IG4 5BZ","TQ 42406 88530",542406,188530,51.577651000000003,5.3721702000000003E-2]
["F86657","York Road Surgery","RB","Redbridge","RB-1","Cranbrook","SystmOne","55 York Road","Ilford","IG1 3AF","TQ 43305 86498",543305,186498,51.559165,6.5858546000000004E-2]
["F86081","Kenwood Medical Centre","RB","Redbridge","RB-2","Fairlop","EMISweb","Kenwood Gardens","Gants Hill","IG2 6YG","TQ 43661 88984",543661,188984,51.581412999999998,7.2005967000000004E-2]
["F86083","Eastern Avenue Medical Centre","RB","Redbridge","RB-2","Fairlop","EMISweb","167 Eastern Avenue","Gants Hill","IG4 5AW","TQ 42226 88390",542226,188390,51.576439000000001,5.1069203000000001E-2]
["F86612","Fullwell Avenue Surgery","RB","Redbridge","RB-2","Fairlop","EMISweb","272 Fullwell Avenue","Fullwell Cross","IG5 0SB","TQ 43621 90647",543621,190647,51.596366000000003,7.2108948000000006E-2]
["F86624","Heathcote Primary Care Centre","RB","Redbridge","RB-2","Fairlop","EMISweb","Heathcote Avenue","Barkingside","IG5 0QS","TQ 42982 90347",542982,190347,51.593831999999999,6.2767795000000001E-2]
["F86707","Fencepiece Road Medical Practice","RB","Redbridge","RB-2","Fairlop","EMISweb","83 Fencepiece Road","Fairlop","IG6 2NB","TQ 44453 91094",544453,191094,51.600169999999999,8.4296185999999995E-2]
["F86057","The Willows Practice","RB","Redbridge","RB-2","Fairlop","EMISweb","Hainault Health Centre","Chigwell","IG7 4DF","TQ 45822 91978",545822,191978,51.607759999999999,0.10441554]
["F86007","Forest Edge Practice","RB","Redbridge","RB-2","Fairlop","EMISweb","Hainault Health Centre","Chigwell","IG7 4DF","TQ 45822 91978",545822,191978,51.607759999999999,0.10441554]
["F86009","The Palms Medical Centre","RB","Redbridge","RB-3","Seven Kings","EMISweb","97-101 Netley Road","Newbury Park","IG2 7NW","TQ 44820 88524",544820,188524,51.576982999999998,8.8531907000000007E-2]
["F86087","Goodmayes Medical Centre","RB","Redbridge","RB-3","Seven Kings","EMISweb","4 Eastwood Road","Goodmayes","IG3 8XB","TQ 46331 87526",546331,187526,51.567625999999997,0.10990630999999999]
["F86637","Seven Kings Practice","RB","Redbridge","RB-3","Seven Kings","EMISweb","1 Salisbury Road","Seven Kings","IG3 8BG","TQ 45438 87037",545438,187037,51.563462999999999,9.6829019000000002E-2]
["Y00090","Doctor's House","RB","Redbridge","RB-3","Seven Kings","EMISweb","40 Cameron Road","Seven Kings","IG3 8LF","TQ 45249 87246",545249,187246,51.565389000000003,9.4190582999999994E-2]
["F86034","Green Lane, Goodmayes Medical practice","RB","Redbridge","RB-3","Seven Kings","EMISweb","595 Green Lane","Goodmayes","IG3 9RN","TQ 46598 87054",546598,187054,51.563316,0.11355912999999999]
["F86642","Castleton Road Surgery","RB","Redbridge","RB-3","Seven Kings","EMISweb","19 Castleton Road","Goodmayes","IG3 9QW","TQ 46532 87121",546532,187121,51.563935000000001,0.11263556]
["F86028","Chadwell Heath Surgery","RB","Redbridge","RB-3","Seven Kings","EMISweb","72 Chadwell Heath Lane","Chadwell Heath","RM6 4AF","TQ 47352 88216",547352,188216,51.573560000000001,0.12491581]
["Y00155","Grove Surgery","RB","Redbridge","RB-3","Seven Kings","SystmOne","200-202 Chadwell Heath Lane","Chadwell Heath","RM6 4YU","TQ 47178 88535",547178,188535,51.576472000000003,0.12254036]
["F86013","Broadway Surgery","RB","Redbridge","RB-4","Wanstead & Woodford","SystmOne","3 The Broadway","Woodford Green","IG8 0HF","TQ 40897 91927",540897,191927,51.608555000000003,3.3322327999999998E-2]
["F86023","The Evergreen Practice","RB","Redbridge","RB-4","Wanstead & Woodford","EMISweb","26 High Street","Wanstead","E11 2AQ","TQ 40453 88526",540453,188526,51.578105000000001,2.5554684000000001E-2]
["F86032","Wanstead Place Surgery","RB","Redbridge","RB-4","Wanstead & Woodford","EMISweb","45 Wanstead Place","Wanstead","E11 2SW","TQ 40289 88521",540289,188521,51.578100999999997,2.3187508999999999E-2]
["F86731","Aldersbrook Medical Centre","RB","Redbridge","RB-4","Wanstead & Woodford","EMISweb","65 Aldersbrook Road","Manor Park","E12 5DL","TQ 41394 86612",541394,186612,51.560670999999999,3.8356031999999998E-2]
["F86066","Southdene Surgery","RB","Redbridge","RB-4","Wanstead & Woodford","EMISweb","The Shrubberies, George Ln","South Woodford","E18 1BD","TQ 40404 90279",540404,190279,51.593868999999998,2.554851E-2]
["F86641","Shrubberies Medical Centre","RB","Redbridge","RB-4","Wanstead & Woodford","EMISweb","12 The Shrubberies, ","South Woodford","E18 1BD","TQ 40404 90279",540404,190279,51.593868999999998,2.554851E-2]
["F86020","Glebelands Practice","RB","Redbridge","RB-4","Wanstead & Woodford","EMISweb","2 Glebelands Avenue","South Woodford","E18 2AB","TQ 40310 90124",540310,190124,51.592500000000001,2.4130467999999999E-2]
["F86064","Elmhurst Practice","RB","Redbridge","RB-4","Wanstead & Woodford","EMISweb","114 High Road","South Woodford","E18 2QS","TQ 40129 90669",540129,190669,51.597442000000001,2.1736756999999999E-2]
["F86691","Clayhall Clinic","RB","Redbridge","RB-4","Wanstead & Woodford","EMISweb","14 Clayhall Avenue","Ilford","IG5 0LG","TQ 42206 90038",542206,190038,51.591251999999997,5.1447693000000003E-2]
["F86012","Rydal Practice","RB","Redbridge","RB-4","Wanstead & Woodford","EMISweb","375 High Road","Woodford Green","IG8 9QJ","TQ 39982 91888",539982,191888,51.608432000000001,2.0101964E-2]
["F86658","Queen Mary Practice","RB","Redbridge","RB-4","Wanstead & Woodford","EMISweb","114 High Road","South Woodford","E18 2QS","TQ 40129 90669",540129,190669,51.597442000000001,2.1736756999999999E-2]
["F86022","Ilford Medical Centre","RB","Redbridge","RB-5","Loxford","EMISweb","61 Cleveland Road","Ilford","IG1 1EE","TQ 43897 86254",543897,186254,51.556821999999997,7.4292691999999994E-2]
["Y02987","The Practice Loxford","RB","Redbridge","RB-5","Loxford","EMISweb","417 Ilford Lane","Ilford","IG1 2SN","TQ 44106 85110",544106,185110,51.546489000000001,7.6837077000000004E-2]
["F86692","Mathukias Surgery","RB","Redbridge","RB-5","Loxford","EMISweb","281 Ilford Lane","Ilford","IG1 2SF","TQ 43991 85477",543991,185477,51.549816,7.5329842999999994E-2]
["F86082","Ilford Lane Surgery","RB","Redbridge","RB-5","Loxford","SystmOne","417 Ilford Lane","Ilford","IG1 2SN","TQ 44106 85110",544106,185110,51.546489000000001,7.6837077000000004E-2]
["F86025","Oak Tree Medical Practice","RB","Redbridge","RB-5","Loxford","SystmOne","273-275 Green Lane","Seven Kings","IG3 9TJ","TQ 45422 86734",545422,186734,51.560744,9.6473119999999996E-2]
["F86085","Hainault Surgery","RB","Redbridge","RB-6","NewCross Alliance","EMISweb","34 New North Road","Hainault","IG6 2XG","TQ 44572 91321",544572,191321,51.602179,8.6106632000000002E-2]
["F86010","Fullwell Cross Medical Centre","RB","Redbridge","RB-6","NewCross Alliance","EMISweb","1 Tomswood Hill","Fairlop","IG6 2HG","TQ 44435 90476",544435,190476,51.594620999999997,8.3782263999999995E-2]
["F86060","Newbury Group Practice","RB","Redbridge","RB-6","NewCross Alliance","EMISweb","40 Perrymans Farm Road","Newbury Park","IG2 7LE","TQ 44654 88447",544654,188447,51.576334000000003,8.6106352999999997E-2]
["F84083","Bethnal Green Health Centre","TH","Tower Hamlets","TH-NW1","The One Network","EMISweb","60 Florida Street",null,"E2 6LL","TQ 34381 82665",534381,182665,51.526916,-6.4255604999999993E-2]
["F84016","The Mission Practice","TH","Tower Hamlets","TH-NW1","The One Network","EMISweb","208 Cambridge Heath Road",null,"E2 9LS","TQ 34907 83175",534907,183175,51.531373000000002,-5.6482689000000003E-2]
["F84123","Globe Town Surgery","TH","Tower Hamlets","TH-NW1","The One Network","EMISweb","82a Roman Road",null,"E2 0PJ","TQ 35420 82859",535420,182859,51.528410999999998,-4.9212931000000001E-2]
["F84051","Strouts Place Medical Centre","TH","Tower Hamlets","TH-NW1","The One Network","EMISweb","3 Strouts Place, Pelter Street",null,"E2 7QU","TQ 33683 82924",533683,182924,51.529409000000001,-7.4213118999999994E-2]
["F84081","Spitalfields Practice","TH","Tower Hamlets","TH-NW2","East End Health Network","EMISweb","20 Old Montague Street",null,"E1 5PB","TQ 34066 81571",534066,181571,51.517158999999999,-6.9209514E-2]
["F84718","Blithehale Medical Centre","TH","Tower Hamlets","TH-NW2","East End Health Network","EMISweb","22 Dunbridge Street",null,"E2 6JA","TQ 34306 82311",534306,182311,51.523752000000002,-6.5470924E-2]
["F84733","Health E1","TH","Tower Hamlets","TH-NW2","East End Health Network","EMISweb","9-11 Brick Lane",null,"E1 6PU","TQ 33910 81676",533910,181676,51.518140000000002,-7.1416585000000005E-2]
["F84012","Albion Health Centre","TH","Tower Hamlets","TH-NW2","East End Health Network","EMISweb","333 Whitechapel Road",null,"E1 1BU","TQ 34859 81910",534859,181910,51.520017000000003,-5.7658092000000001E-2]
["F84087","Harford Health Centre","TH","Tower Hamlets","TH-NW3","Tower Network","EMISweb","79 Ben Jonson Road",null,"E1 4SA","TQ 35898 81752",535898,181752,51.518349000000001,-4.2753129000000001E-2]
["F84039","Goodman’s Field Health Centre","TH","Tower Hamlets","TH-NW3","Tower Network","EMISweb","44-56 Hessel Street",null,"E1 2LP","TQ 34537 81246",534537,181246,51.514127000000002,-6.2549480000000005E-2]
["F84114","City Square Medical Group","TH","Tower Hamlets","TH-NW3","Tower Network","EMISweb","129 Cannon Street Road",null,"E1 2LX","TQ 34595 81156",534595,181156,51.513303999999998,-6.1748474999999997E-2]
["F84079","Wapping Group Practice","TH","Tower Hamlets","TH-NW3","Tower Network","EMISweb","22 Wapping Lane",null,"E1W 2RL","TQ 34810 80364",534810,180364,51.506135999999998,-5.8954558999999997E-2]
["F84031","Jubilee Street Practice","TH","Tower Hamlets","TH-NW3","Tower Network","EMISweb","368-374 Commercial Road",null,"E1 0LS","TQ 35359 81212",535359,181212,51.513624999999998,-5.0723846000000003E-2]
["F84731","St Katharine Docks Practice","TH","Tower Hamlets","TH-NW3","Tower Network","EMISweb","12-14 Nightingale House, 50 Thomas More Street",null,"E1W 1UA","TQ 34160 80441",534160,180441,51.506982999999998,-6.8285214999999996E-2]
["F84044","Harley Grove Medical Centre","TH","Tower Hamlets","TH-NW4","Bow Health ","EMISweb","15 Harley Grove",null,"E3 2AT","TQ 36903 82836",536903,182836,51.527847000000001,-2.7856860000000001E-2]
["F84034","St Stephens Health Centre","TH","Tower Hamlets","TH-NW4","Bow Health ","EMISweb","Bow Community Hall, William Place",null,"E3 5ED","TQ 36678 83316",536678,183316,51.532215000000001,-3.0912192000000002E-2]
["F84030","Ruston Street Clinic (Dr Amin)","TH","Tower Hamlets","TH-NW4","Bow Health ","EMISweb","Ruston Street",null,"E3 2LR","TQ 36931 83782",536931,183782,51.536341,-2.7085962000000002E-2]
["F84055","Grove Road Surgery (Dr Shah)","TH","Tower Hamlets","TH-NW4","Bow Health ","EMISweb","3 Ivanhoe House, 130 Grove Road",null,"E3 5TW","TQ 36133 83031",536133,183031,51.529784999999997,-3.8874542999999998E-2]
["F84696","The Tredegar Practice","TH","Tower Hamlets","TH-NW4","Bow Health ","EMISweb","35 St. Stephens Road",null,"E3 5JD","TQ 36617 83214",536617,183214,51.531312999999997,-3.1830602999999999E-2]
["F84676","Stroudley Walk Centre","TH","Tower Hamlets","TH-NW5","Mile End East and Bromley by Bow Network","EMISweb","38 Stroudley Walk, Bow",null,"E3 3EW","TQ 37650 82725",537650,182725,51.526668000000001,-1.7138677000000001E-2]
["Y03023","St Andrews Health Centre","TH","Tower Hamlets","TH-NW5","Mile End East and Bromley by Bow Network","EMISweb","2 Hannaford Way",null,"E3 3FF","TQ 37837 82418",537837,182418,51.523864000000003,-1.4564782E-2]
["F84118","Merchant Street (Dr Rana)","TH","Tower Hamlets","TH-NW5","Mile End East and Bromley by Bow Network","EMISweb","5 Merchant Street",null,"E3 4LJ","TQ 36940 82648",536940,182648,51.526148999999997,-2.7396845E-2]
["F84714","St Pauls Way Medical Centre","TH","Tower Hamlets","TH-NW5","Mile End East and Bromley by Bow Network","EMISweb","First Floor. 11 Selsey Street",null,"E14 7LJ","TQ 37160 81748",537160,181748,51.518008000000002,-2.4577591999999999E-2]
["F84122","XXP/BBB","TH","Tower Hamlets","TH-NW5","Mile End East and Bromley by Bow Network","EMISweb","St Leonard’s Street",null,"E3 3BT","TQ 37975 82706",537975,182706,51.526418,-1.2464196E-2]
["F84054","Limehouse Practice (Gill Street)","TH","Tower Hamlets","TH-NW6","Poplar and Limehouse Network","EMISweb","Gill St Health Centre, 11 Gill Street",null,"E14 8HQ","TQ 36891 80989",536891,180989,51.511253000000004,-2.8746565000000002E-2]
["F84062","Chrisp Street Health Centre","TH","Tower Hamlets","TH-NW6","Poplar and Limehouse Network","EMISweb","100 Chrisp Street",null,"E14 6PG","TQ 37882 81345",537882,181345,51.514211000000003,-1.4335996E-2]
["F84698","Aberfeldy Practice","TH","Tower Hamlets","TH-NW6","Poplar and Limehouse Network","EMISweb","2a Ettrick Street",null,"E14 0PU","TQ 38534 81393",538534,181393,51.514482999999998,-4.9271033000000001E-3]
["F84025","Gough Walk (Dr Selvan)","TH","Tower Hamlets","TH-NW6","Poplar and Limehouse Network","EMISweb","21 Newby Place ",null,"E14 0EY","TQ 38012 80933",538012,180933,51.510477000000002,-1.2624882E-2]
["F84710","Island Health","TH","Tower Hamlets","TH-NW7","Healthy Island Network","EMISweb","145 East Ferry Road",null,"E14 3BQ","TQ 37996 79250",537996,179250,51.495356999999998,-1.3513117E-2]
["F84656","Docklands Medical Centre","TH","Tower Hamlets","TH-NW7","Healthy Island Network","EMISweb","100 Spindrift Avenue",null,"E14 9WU","TQ 37480 78772",537480,178772,51.491188000000001,-2.1127525000000001E-2]
["F84647","Island Medical Centre","TH","Tower Hamlets","TH-NW7","Healthy Island Network","EMISweb","Roserton Street",null,"E14 3PG","TQ 38227 79604",538227,179604,51.498482000000003,-1.0049091E-2]
["F84747","Barkantine Practice","TH","Tower Hamlets","TH-NW7","Healthy Island Network","EMISweb","121 Westferry Road",null,"E14 8JH","TQ 37136 79834",537136,179834,51.500813999999998,-2.5666996000000001E-2]
["F86026","Forest Surgery","WF","Waltham Forest","WF-1","Chingford/ Walthamstow","SystmOne","2 Macdonald Road","Walthamstow","E17 4BA","TQ 38283 90316",538283,190316,51.594726000000001,-5.0366318E-3]
["F86700","Kings Head Medical Practice","WF","Waltham Forest","WF-1","Chingford/ Walthamstow","EMISweb","178 Kings Head Hill","Chingford","E4 7NX","TQ 37715 94859",537715,194859,51.635688000000002,-1.1447793E-2]
["F86664","Larkshall Medical Centre","WF","Waltham Forest","WF-1","Chingford/ Walthamstow","EMISweb","1 Larkshall Road","Chingford","E4 7HS","TQ 38739 93914",538739,193914,51.626944999999999,2.9649466000000002E-3]
["F86005"," The Penryhn Surgery","WF","Waltham Forest","WF-1","Chingford/ Walthamstow","EMISweb","2a Penryn Avenue","Walthamstow","E17 5DB","TQ 36985 90544",536985,190544,51.597090999999999,-2.3674555E-2]
["F86626","Dr Shantir Practice","WF","Waltham Forest","WF-1","Chingford/ Walthamstow","EMISweb","354-358 Forest Rd","Walthamstow","E17 5JG","TQ 36694 89687",536694,189687,51.589461,-2.8206729E-2]
["Y01839","Lime Tree & Sinnott Healthcare Ltd","WF","Waltham Forest","WF-1","Chingford/ Walthamstow","EMISweb","12b Sinnott Road","Walthamstow","E17 5QB","TQ 35891 90652",535891,190652,51.598326999999998,-3.9417391000000003E-2]
["F86689","The Bailey Practice","WF","Waltham Forest","WF-1","Chingford/ Walthamstow","EMISweb","107 Shernhall Street","Walthamstow","E17 9HS","TQ 38167 89081",538167,189081,51.583657000000002,-7.1959318999999999E-3]
["F86638","The Microfaculty","WF","Waltham Forest","WF-1","Chingford/ Walthamstow","SystmOne","107 Chingford Mount Road","Chingford","E4 8LT","TQ 37307 92314",537307,192314,51.612918000000001,-1.8336228999999999E-2]
["F86004","Handsworth Medical Centre","WF","Waltham Forest","WF-2","Chingford E4","SystmOne","Highams Park, Handsworth Avenue","Chingford","E4 9PD"]
["Y01291","Chingford Medical Practice","WF","Waltham Forest","WF-2","Chingford E4","EMISweb","109 York Road","Chingford","E4 8LF","TQ 37006 92657",537006,192657,51.616073999999998,-2.2546676000000002E-2]
["F86627","Churchill Medical Centre","WF","Waltham Forest","WF-2","Chingford E4","EMISweb","1 Churchill Terrace","Chingford","E4 8DG","TQ 37293 92913",537293,192913,51.618304000000002,-1.8303841000000001E-2]
["F86078","The Ridgeway Surgery","WF","Waltham Forest","WF-2","Chingford E4","EMISweb","1 Mount Echo Avenue","Chingford","E4 7JX","TQ 37765 94083",537765,194083,51.628701999999997,-1.1030843E-2]
["F86616","Old Church Surgery","WF","Waltham Forest","WF-2","Chingford E4","EMISweb","99 Chingford Avenue","Chingford","E4 6RG","TQ 37534 93450",537534,193450,51.623071000000003,-1.4614411000000001E-2]
["F86074","Leyton Healthcare (Oliver Road)","WF","Waltham Forest","WF-3","Leyton Collaborative","SystmOne","Leyton Orient Football Club (West Stand), 75 Oliver Road","Leyton","E10 5LG","TQ 37815 86429",537815,186429,51.559911999999997,-1.3312475000000001E-2]
["F86011","The Manor Practice","WF","Waltham Forest","WF-3","Leyton Collaborative","EMISweb","454 Lea Bridge Road","Leyton","E10 7DY","TQ 37179 87682",537179,187682,51.571325999999999,-2.1992728E-2]
["F86038","Sma Medical Centre","WF","Waltham Forest","WF-3","Leyton Collaborative","EMISweb","693-695 High Road","Leyton","E10 6RA","TQ 38108 87688",538108,187688,51.571154,-8.5942013999999994E-3]
["F86018","The Ecclesbourne Practice","WF","Waltham Forest","WF-4","Forest Integrated Health","SystmOne","Ecclesbourne Warwick Terrace, Leabridge Rd","Leyton","E17 9DP","TQ 38574 88755",538574,188755,51.580627,-1.4539803E-3]
["F86036","The Allum Medical Centre","WF","Waltham Forest","WF-4","Forest Integrated Health","EMISweb","Fairlop Road","Leytonstone","E11 1BN","TQ 38947 87574",538947,187574,51.569923000000003,3.4589922000000002E-3]
["F86044"," Crawley Road Medical Centre","WF","Waltham Forest","WF-4","Forest Integrated Health","EMISweb","479 High Road","Leyton","E10 5EL","TQ 37940 86918",537940,186918,51.564276,-1.1318719E-2]
["F86696","Francis Road Medical Centre","WF","Waltham Forest","WF-4","Forest Integrated Health","EMISweb","94 Francis Road","Leyton","E10 6PP","TQ 38466 86672",538466,186672,51.561936000000003,-3.8318204999999998E-3]
["F86712","Hampton Medical Centre","WF","Waltham Forest","WF-4","Forest Integrated Health","EMISweb","1 Pretoria Road","Leytonstone","E11 4BB","TQ 38721 87186",538721,187186,51.566491999999997,4.7171125999999997E-5]
["F86650","Lime Tree Surgery","WF","Waltham Forest","WF-4","Forest Integrated Health","EMISweb","38 Cann Hall Road","Leytonstone","E11 3HZ","TQ 39258 85734",539258,185734,51.553313000000003,7.2151919999999996E-3]
["F86088","The Lyndhurst Surgery","WF","Waltham Forest","WF-4","Forest Integrated Health","EMISweb","53 Lyndhurst Drive","Leyton","E10 6JB","TQ 38433 87787",538433,187787,51.571964000000001,-3.8687688000000001E-3]
["F86621","Green Man Medical Centre","WF","Waltham Forest","WF-5","South Leytonstone","EMISweb","1 Hanbury Drive","Leytonstone","E11 1HR","TQ 39685 87696",539685,187696,51.570836999999997,1.4148923000000001E-2]
["F86045","High Road Surgery","WF","Waltham Forest","WF-5","South Leytonstone","EMISweb","287 High Road","Leytonstone","E11 4HH","TQ 39101 85749",539101,185749,51.553485999999999,4.9580980000000002E-3]
["F86701","Kiyani Medical Practice","WF","Waltham Forest","WF-5","South Leytonstone","EMISweb","13 Langthorne Rd","Leytonstone","E11 4HX","TQ 38897 85957",538897,185957,51.555405999999998,2.0996700000000001E-3]
["F86625","LL Medical Care (Agarwal & Agrwal Practice)","WF","Waltham Forest","WF-5","South Leytonstone","EMISweb","13 Langthorne Rd","Leytonstone","E11 4HX","TQ 38897 85957",538897,185957,51.555405999999998,2.0996700000000001E-3]
["F86666","The Harrow Road Surgery","WF","Waltham Forest","WF-5","South Leytonstone","EMISweb","2-8 Harrow Road","Leytonstone","E11 3QF","TQ 39369 86366",539369,186366,51.558964000000003,9.0654107999999997E-3]
["F86705","The Langthorne Sharma Family Practice","WF","Waltham Forest","WF-5","South Leytonstone","EMISweb","13 Langthorne Rd","Leytonstone","E11 4HX","TQ 38897 85957",538897,185957,51.555405999999998,2.0996700000000001E-3]
["F86607","Addison Road Medical Practice","WF","Waltham Forest","WF-6","Central Walthamstow","EMISweb","Comely Bank Clinic","Walthamstow","E17 9LY","TQ 38040 89024",538040,189024,51.583176000000002,-9.0501534999999998E-3]
["F86708","Claremont Medical Centre","WF","Waltham Forest","WF-6","Central Walthamstow","EMISweb","29-31 Claremont Medical Centre","Walthamstow","E17 5RJ","TQ 36291 90221",536291,190221,51.594357000000002,-3.3813172000000002E-2]
["F86001"," The Firs","WF","Waltham Forest","WF-6","Central Walthamstow","EMISweb","26 Stephenson Road","Walthamstow","E17 7JT","TQ 36241 88655",536241,188655,51.580297000000002,-3.5141800000000001E-2]
["F86086","Dr Dhital Practice","WF","Waltham Forest","WF-6","Central Walthamstow","EMISweb","6 Linford Rd","Walthamstow","E17 3LA","TQ 38444 89544",538444,189544,51.587749000000002,-3.0181050000000001E-3]
["F86644","Waltham Forest Community & Family Health Services Ltd","WF","Waltham Forest","WF-6","Central Walthamstow","EMISweb","6 Linford Rd","Walthamstow","E17 3LA","TQ 38444 89544",538444,189544,51.587749000000002,-3.0181050000000001E-3]
["F86006","Seymour Medical Centre","WF","Waltham Forest","WF-7","Walthamstow West","EMISweb","266 Lea Bridge Road","Walthamstow","E10 7LD","TQ 36763 87420",536763,187420,51.569073000000003,-2.8093386000000001E-2]
["F86030","Queens Road Medical Centre","WF","Waltham Forest","WF-7","Walthamstow West","EMISweb","48 Queens Road","Walthamstow","E17 8PX","TQ 37259 88627",537259,188627,51.579799000000001,-2.0470187000000001E-2]
["F86062","Grove Surgery","WF","Waltham Forest","WF-7","Walthamstow West","EMISweb","103-105 Grove Road","Walthamstow","E17 9BU","TQ 37919 88578",537919,188578,51.579197000000001,-1.0970442E-2]
["F86679","Higham Hill Medical Centre","WF","Waltham Forest","WF-7","Walthamstow West","EMISweb","258-260 Higham Hill Road","Walthamstow","E17 5RQ","TQ 36234 90272",536234,190272,51.594828999999997,-3.4615754999999998E-2]
["F86058","St James Medical Practice Ltd","WF","Waltham Forest","WF-7","Walthamstow West","EMISweb","47 St James St","Walthamstow","E17 7NH","TQ 36455 88670",536455,188670,51.580379999999998,-3.2049451E-2]
["Y06760","City & Hackney GP Confederation","CH","City & Hackney",null,null,"EMISweb"]