{"text_format":"1","workbook":"xlsx","n_sheets":17,"sheets":["Compiled_06_2018","Homepage","Summary","Detail","TRENDS","PRACTICE","HEADERTOGGLE","HEADERINFO2","Locations","BLANK","CHART","Sheet2","Sheet3","Sheet4","DATA","Sheet6","Sheet7"],"not_rendered":{"charts":3,"images":9,"macros":1,"external_links":14,"defined_names":25,"comments":0,"pivot_tables":0},"unopened":[],"bounds":{"document_bytes":16777216,"sheet_cells":100000,"rows_first":2000,"rows_last":500,"rows_between":2000,"halvings":0,"cell_chars":16384,"cell_head_chars":4096},"cells_cut":0,"cells_raw":0,"read":"whole","date_system":"1900"}

{"sheet":"Compiled_06_2018","index":0,"n_rows":62,"n_cols":13,"rows_kept":62,"cut":false,"hidden":true,"merged":[]}
["PracName","Locality","NACS","Worksheet","[00-00]","[08-CKD]","NIS08-CKD01","NIS08-CKD01%","NIS08-CKD02","NIS08-CKD02%","NIS08-CKD03","NIS08-CKD03%","NIS08-CKD08"]
[null,null,null,"Seach Code:","[00-00]","[08-CKD]","NIS08-CKD01","NIS08-CKD01%","NIS08-CKD02","NIS08-CKD02%","NIS08-CKD03","NIS08-CKD03%","NIS08-CKD08"]
["2018-06-01",null,null,"Found EMISweb Search:","[00-00] Listsize","[08-CKD] eGFR evidence of CKD","NIS08-CKD01: evidence of CKD coded CKD (QOF v33)",null,"NIS08-CKD02: evidence of CKD with appropriate BP",null,"NIS08-CKD03: evidence of CKD on Statins",null,"NIS08-CKD08: Referrals to community renal clinic"]
[null,null,null,"Relative Run Date:","2018-06-01","2018-06-01","2018-06-01",null,"2018-06-01",null,"2018-06-01",null,"2018-06-01"]
[null,null,null,"Top Left EMISweb Data:","$A$9","$A$45","$A$81",null,"$A$117",null,"$A$153",null,"$A$225"]
["2018-06-01",null,null,"EMISweb Array Start:","$B$9","$B$45","$B$81",null,"$B$117",null,"$B$153",null,"$B$225"]
[null,null,null,"Top Left EMISweb Data +1 Row:","$A$10","$A$46","$A$82",null,"$A$118",null,"$A$154",null,"$A$226"]
[null,null,null,"EMISweb Array End:","$C$44","$C$80","$C$116",null,"$C$152",null,"$C$188",null,"$C$237"]
["Payment",null,"Payment"]
["Dr Zamora-Eguiluz - Leyton Green Neighbourhood H S","LC1","F86073","'CKD AR 06 18'!",3695,70,54,0.77142857142857146,38,0.54285714285714282,41,0.58571428571428574,0]
["Addison Road Medical Practice","LC1","F86607","'CKD AR 06 18'!",14040,216,82,0.37962962962962965,124,0.57407407407407407,138,0.63888888888888884,0]
["Dr Shantir Practice","LC1","F86626","'CKD AR 06 18'!",5257,72,63,0.875,49,0.68055555555555558,43,0.59722222222222221,0]
["Lime Tree Surgery","LC1","F86650","'CKD AR 06 18'!",8088,120,61,0.5083333333333333,49,0.40833333333333333,78,0.65,0]
["Francis Road Medical Centre","LC1","F86696","'CKD AR 06 18'!",4851,123,94,0.76422764227642281,67,0.54471544715447151,88,0.71544715447154472,1]
["The Vicarage Road Practice","LC1","Y00092","'CKD AR 06 18'!",0,0,0,"N/A",0,"N/A",0,"N/A",0]
["Dr S Phillips & Dr M Patel","LC2","F86006","'CKD AR 06 18'!",6053,126,76,0.60317460317460314,60,0.47619047619047616,71,0.56349206349206349,0]
["Dr Sheikh & Partners - Queens Road Medical Centre","LC2","F86030","'CKD AR 06 18'!",7753,157,93,0.59235668789808915,90,0.57324840764331209,132,0.84076433121019112,1]
["Dr K Aswani - The Allum Medical Centre","LC2","F86036","'CKD AR 06 18'!",15560,292,104,0.35616438356164382,170,0.5821917808219178,184,0.63013698630136983,3]
["Dr Sm Ali - Sma Medical Centre","LC2","F86038","'CKD AR 06 18'!",10744,171,60,0.35087719298245612,109,0.63742690058479534,122,0.71345029239766078,1]
["Dr T Kalra - Crawley Road Medical Centre","LC2","F86044","'CKD AR 06 18'!",7990,108,93,0.86111111111111116,61,0.56481481481481477,78,0.72222222222222221,0]
["Grove Surgery","LC2","F86062","'CKD AR 06 18'!",6580,153,98,0.64052287581699341,86,0.56209150326797386,116,0.75816993464052285,0]
["Dr Rp Dhital - Dr Dhital Practice","LC2","F86086","'CKD AR 06 18'!",5852,86,28,0.32558139534883723,49,0.56976744186046513,59,0.68604651162790697,0]
["Old Church Surgery","LC2","F86616","'CKD AR 06 18'!",5955,230,105,0.45652173913043476,151,0.65652173913043477,134,0.58260869565217388,2]
["Green Man Medical Centre","LC2","F86621","'CKD AR 06 18'!",5443,148,50,0.33783783783783783,112,0.7567567567567568,88,0.59459459459459463,0]
["Churchill Medical Centre","LC2","F86627","'CKD AR 06 18'!",14118,549,250,0.45537340619307831,261,0.47540983606557374,350,0.63752276867030966,4]
["Waltham Forest Community & Family Health Services Ltd","LC2","F86644","'CKD AR 06 18'!",10901,230,78,0.33913043478260868,141,0.61304347826086958,131,0.56956521739130439,0]
["Larkshall Medical Centre","LC2","F86664","'CKD AR 06 18'!",8162,186,29,0.15591397849462366,102,0.54838709677419351,112,0.60215053763440862,0]
["The Bailey Practice","LC2","F86689","'CKD AR 06 18'!",3826,51,26,0.50980392156862742,21,0.41176470588235292,32,0.62745098039215685,0]
["Kings Head Medical Practice","LC2","F86700","'CKD AR 06 18'!",3751,199,198,0.99497487437185927,116,0.58291457286432158,137,0.68844221105527637,0]
["Kiyani Medical Practice","LC2","F86701","'CKD AR 06 18'!",3134,80,54,0.67500000000000004,58,0.72499999999999998,55,0.6875,0]
["Claremont Medical Centre","LC2","F86708","'CKD AR 06 18'!",2872,48,18,0.375,32,0.66666666666666663,35,0.72916666666666663,0]
["Hampton Medical Centre","LC2","F86712","'CKD AR 06 18'!",2978,81,78,0.96296296296296291,56,0.69135802469135799,61,0.75308641975308643,0]
["Lime Tree & Sinnott Healthcare Ltd","LC2","Y01839","'CKD AR 06 18'!",6530,124,25,0.20161290322580644,88,0.70967741935483875,78,0.62903225806451613,1]
["Dr John & Partners - The Firs","LC3","F86001","'CKD AR 06 18'!",8118,174,81,0.46551724137931033,73,0.41954022988505746,111,0.63793103448275867,0]
["Dr Lindall & Partners - The Penryhn Surgery","LC3","F86005","'CKD AR 06 18'!",7742,211,157,0.74407582938388628,136,0.64454976303317535,137,0.64928909952606639,5]
["Dr Huddart - The Manor Practice","LC3","F86011","'CKD AR 06 18'!",9093,212,100,0.47169811320754718,129,0.60849056603773588,129,0.60849056603773588,0]
["High Road Surgery","LC3","F86045","'CKD AR 06 18'!",1895,47,35,0.74468085106382975,15,0.31914893617021278,33,0.7021276595744681,1]
["Brunner Road Medical Centre","LC3","F86049","'CKD AR 06 18'!",0,0,0,"N/A",0,"N/A",0,"N/A",0]
["St James Medical Practice Ltd","LC3","F86058","'CKD AR 06 18'!",14437,207,152,0.7342995169082126,137,0.66183574879227058,152,0.7342995169082126,0]
["Dr Cave & Partners - The Ridgeway Surgery","LC3","F86078","'CKD AR 06 18'!",7436,364,97,0.26648351648351648,171,0.46978021978021978,224,0.61538461538461542,1]
["The Lyndhurst Surgery","LC3","F86088","'CKD AR 06 18'!",4380,96,73,0.76041666666666663,69,0.71875,73,0.76041666666666663,1]
["LL Medical Care (Agarwal & Agrwal Practice)","LC3","F86625","'CKD AR 06 18'!",5980,127,46,0.36220472440944884,75,0.59055118110236215,80,0.62992125984251968,0]
["Thatched House Medical Centre","LC3","F86639","'CKD AR 06 18'!",0,0,0,"N/A",0,"N/A",0,"N/A",0]
["The Harrow Road Surgery","LC3","F86666","'CKD AR 06 18'!",13757,231,147,0.63636363636363635,129,0.55844155844155841,156,0.67532467532467533,1]
["Higham Hill Medical Centre","LC3","F86679","'CKD AR 06 18'!",5435,77,21,0.27272727272727271,56,0.72727272727272729,44,0.5714285714285714,0]
["The Langthorne Sharma Family Practice","LC3","F86705","'CKD AR 06 18'!",2895,50,8,0.16,33,0.66,32,0.64,0]
["Chingford Medical Practice","LC3","Y01291","'CKD AR 06 18'!",8697,363,249,0.68595041322314054,197,0.54269972451790638,203,0.55922865013774103,1]
["The Orient Practice","LC3","Y02585","'CKD AR 06 18'!",8203,41,26,0.63414634146341464,24,0.58536585365853655,28,0.68292682926829273,0]
[null,null,null,"Found EMISweb Search:","[00-00] Listsize","[08-CKD] eGFR evidence of CKD","NIS08-CKD01: evidence of CKD coded CKD (QOF v33)",null,"NIS08-CKD02: evidence of CKD with appropriate BP",null,"NIS08-CKD03: evidence of CKD on Statins",null,"NIS08-CKD08: Referrals to community renal clinic"]
[null,null,null,"Top Left EMISweb Data:","$A$9","$A$45","$A$81",null,"$A$117",null,"$A$153",null,"$A$225"]
[null,null,null,"EMISweb Array Start:","$B$9","$B$45","$B$81",null,"$B$117",null,"$B$153",null,"$B$225"]
[null,null,null,"Top Left EMISweb Data +1 Row:","$A$10","$A$46","$A$82",null,"$A$118",null,"$A$154",null,"$A$226"]
[null,null,null,"EMISweb Array End:","$C$44","$C$80","$C$116",null,"$C$152",null,"$C$188",null,"$C$237"]
["Chingford",null,"LC1",null,35931,601,354,0.589018302828619,327,0.54409317803660562,388,0.64559068219633942,1]
["Leyton & Leytonstone",null,"LC2",null,128202,3019,1463,0.48459754885723749,1763,0.5839682013911891,1975,0.65419012918184827,12]
["Walthamstow",null,"LC3",null,98068,2200,1192,0.54181818181818187,1244,0.56545454545454543,1402,0.63727272727272732,10]
["Waltham Forest Average",null,"Ave",null,null,null,null,0.53975287801137251,null,0.58500538009159608,null,0.65748456632349161]
[null,null,"Total","Networks",262201,5820,3009,0.51701030927835057,3334,0.57285223367697591,3765,0.64690721649484539,23]
[null,null,null,"Practices",245301,5416,2734,0.50480059084194973,3113,0.57477843426883313,3534,0.6525110782865583,22]
[null,null," -"," -"," -"," -"," -"," -"," -"," -"," -"," -"," -"]
["Target3",null,"Target3"]
["Target4",null,"Target4"]

{"sheet":"Homepage","index":1,"n_rows":29,"n_cols":13,"rows_kept":29,"cut":false,"hidden":false,"merged":[[18,2,19,3],[18,4,19,4],[4,5,4,7],[6,2,7,3],[8,2,9,3],[10,2,11,3],[12,2,13,3],[14,2,15,3],[12,4,13,4],[14,4,15,4],[16,4,17,4],[16,2,17,3],[6,4,7,4],[8,4,9,4],[10,4,11,4]]}
[]
[null,null,"WF CKD MANAGEMENT 2021-2022",null,null,null,"SELECT DATE >>",null,null,"SELECT PRACTICE >>",null,null,"SELECT KPI >>"]
[]
[]
[null,null,{"$f":"UPPER(CHART!B1)","v":"EVIDENCE OF CKD WITH ACR"},null,null,"PROGRESS TO TARGET",null,null,null,null,null,"MONTHLY ACHIEVEMENT TREND"]
[]
[null,null,"ELIGIBLE",null,{"$f":"IF(CHART!C8=\"#N/A\",\"-\",CHART!C8)","v":275}]
[]
[null,null,"AIM%",null,{"$f":"IFERROR(CHART!D12,\"-\")","v":0.5}]
[]
[null,null,"TOTAL REMAINING",null,{"$f":"IF(ISNA(CHART!C10), \"-\", CHART!C10)","v":"-"}]
[]
[null,null,"MIN REMAINING",null,{"$f":" CHART!E9","v":"-"}]
[]
[null,null,"COMPLETED",null,{"$f":"IF(ISNA(CHART!C9), \"-\", CHART!C9)","v":"-"}]
[]
[null,null,"ACHIEVED%",null,{"$f":"IF(ISNA(CHART!C12),\"-\",CHART!C12)","v":"-"}]
[]
[null,null,"WF AVERAGE%",null,{"$f":"IF(ISNA(CHART!B14), \"-\", CHART!B14)","v":0.32127946963608123}]
[]
[]
[]
[]
[null,null,"*Data is cumulative"]
[]
[]
[]
[]
[null,null,"Version: 10.0",null,"CEG Website:","Visit CEG website","CEG WF Facilitator:","Fae Wilkins","Email:","Contact Fae"]

{"sheet":"Summary","index":2,"n_rows":11,"n_cols":13,"rows_kept":11,"cut":false,"hidden":false,"merged":[]}
[null,"Waltham Forest: CKD - Summary "]
[null,null,null,null,null,"<< SELECT  DATE"]
[]
[null,null,null,"[00-00]","[08-CKD]","NIS08-CKD01","NIS08-CKD01%","NIS08-CKD02","NIS08-CKD02%","NIS08-CKD03","NIS08-CKD03%",null,"NIS08-CKD03%"]
[null,null,null,"Listsize","eGFR evidence of CKD","evidence of CKD coded CKD","% evidence of CKD coded CKD","evidence of CKD with BP below 140/90","% evidence of CKD with BP below 140/90","evidence of CKD on Statins","% evidence of CKD on Statins","evidence of CKD to have ACR","% evidence of CKD to have ACR"]
[null,"Select a Practice >>","Leyton Healthcare (Oliver Road) **",{"$f":"IF(COUNTIFS(WF_CKD_DATA[[#All],[OrgID]],PRACTICE!$F$11,WF_CKD_DATA[[#All],[Rel_D]],Locations!$E$17)=0,\"-\",(SUMIFS(WF_CKD_DATA[[#All],[00-00]],WF_CKD_DATA[[#All],[OrgID]],PRACTICE!F11,WF_CKD_DATA[[#All],[Rel_D]],Locations!$E$17)))","v":15084},{"$f":"IF(COUNTIFS(WF_CKD_DATA[[#All],[OrgID]],PRACTICE!$F$11,WF_CKD_DATA[[#All],[Rel_D]],Locations!$E$17)=0,\"-\",(SUMIFS(WF_CKD_DATA[[#All],[08-CKD]],WF_CKD_DATA[[#All],[OrgID]],PRACTICE!F11,WF_CKD_DATA[[#All],[Rel_D]],Locations!$E$17)))","v":372},{"$f":"IF(COUNTIFS(WF_CKD_DATA[[#All],[OrgID]],PRACTICE!$F$11,WF_CKD_DATA[[#All],[Rel_D]],Locations!$E$17)=0,\"-\",(SUMIFS(WF_CKD_DATA[[#All],[NIS08-CKD01]],WF_CKD_DATA[[#All],[OrgID]],PRACTICE!F11,WF_CKD_DATA[[#All],[Rel_D]],Locations!$E$17)))","v":260},{"$f":"IFERROR(F6/E6,\"-\")","v":0.69892473118279574},{"$f":"IF(COUNTIFS(WF_CKD_DATA[[#All],[OrgID]],PRACTICE!$F$11,WF_CKD_DATA[[#All],[Rel_D]],Locations!$E$17)=0,\"-\",(SUMIFS(WF_CKD_DATA[[#All],[NIS08-CKD02]],WF_CKD_DATA[[#All],[OrgID]],PRACTICE!F11,WF_CKD_DATA[[#All],[Rel_D]],Locations!$E$17)))","v":189},{"$f":"IFERROR(H6/E6,\"-\")","v":0.50806451612903225},{"$f":"IF(COUNTIFS(WF_CKD_DATA[[#All],[OrgID]],PRACTICE!$F$11,WF_CKD_DATA[[#All],[Rel_D]],Locations!$E$17)=0,\"-\",(SUMIFS(WF_CKD_DATA[[#All],[NIS08-CKD03]],WF_CKD_DATA[[#All],[OrgID]],PRACTICE!F11,WF_CKD_DATA[[#All],[Rel_D]],Locations!$E$17)))","v":242},{"$f":"IFERROR(J6/E6,\"-\")","v":0.65053763440860213},{"$f":"IF(COUNTIFS(WF_CKD_DATA[[#All],[OrgID]],PRACTICE!$F$11,WF_CKD_DATA[[#All],[Rel_D]],Locations!$E$17)=0,\"-\",(SUMIFS(WF_CKD_DATA[[#All],[NIS08-CKD04]],WF_CKD_DATA[[#All],[OrgID]],PRACTICE!F11,WF_CKD_DATA[[#All],[Rel_D]],Locations!$E$17)))","v":0},{"$f":"IFERROR(L6/E6,\"-\")","v":0}]
[null,"Network",{"$f":"VLOOKUP($C$6,PRACTICE!$B$2:$C$40,2,0)","v":"Leyton Collaborative"},{"$f":"SUMIFS(WF_CKD_DATA[[#All],[00-00]],WF_CKD_DATA[[#All],[SubLocality]],$C$7,WF_CKD_DATA[[#All],[Rel_D]],Locations!$E$17)","v":35883},{"$f":"SUMIFS(WF_CKD_DATA[[#All],[08-CKD]],WF_CKD_DATA[[#All],[SubLocality]],$C$7,WF_CKD_DATA[[#All],[Rel_D]],Locations!$E$17)","v":779},{"$f":"SUMIFS(WF_CKD_DATA[[#All],[NIS08-CKD01]],WF_CKD_DATA[[#All],[SubLocality]],$C$7,WF_CKD_DATA[[#All],[Rel_D]],Locations!$E$17)","v":581},{"$f":"IFERROR(F7/E7, \"-\")","v":0.74582798459563548},{"$f":"SUMIFS(WF_CKD_DATA[[#All],[NIS08-CKD02]],WF_CKD_DATA[[#All],[SubLocality]],$C$7,WF_CKD_DATA[[#All],[Rel_D]],Locations!$E$17)","v":449},{"$f":"IFERROR(H7/E7, \"-\")","v":0.57637997432605903},{"$f":"SUMIFS(WF_CKD_DATA[[#All],[NIS08-CKD03]],WF_CKD_DATA[[#All],[SubLocality]],$C$7,WF_CKD_DATA[[#All],[Rel_D]],Locations!$E$17)","v":531},{"$f":"IFERROR(J7/E7, \"-\")","v":0.68164313222079587},{"$f":"SUMIFS(WF_CKD_DATA[[#All],[NIS08-CKD04]],WF_CKD_DATA[[#All],[SubLocality]],$C$7,WF_CKD_DATA[[#All],[Rel_D]],Locations!$E$17)","v":156},{"$f":"IFERROR(L7/E7, \"-\")","v":0.20025673940949937}]
[null,"Waltham Forest Total","Total",{"$f":"SUMIFS(WF_CKD_DATA[[#All],[00-00]],WF_CKD_DATA[[#All],[Rel_D]],Locations!$E$17)","v":323029},{"$f":"SUMIFS(WF_CKD_DATA[[#All],[08-CKD]],WF_CKD_DATA[[#All],[Rel_D]],Locations!$E$17)","v":8222},{"$f":"SUMIFS(WF_CKD_DATA[[#All],[NIS08-CKD01]],WF_CKD_DATA[[#All],[Rel_D]],Locations!$E$17)","v":6643},{"$f":"IFERROR(F8/E8, \"-\")","v":0.80795426903429823},{"$f":"SUMIFS(WF_CKD_DATA[[#All],[NIS08-CKD02]],WF_CKD_DATA[[#All],[Rel_D]],Locations!$E$17)","v":4457},{"$f":"IFERROR(H8/E8,\"-\")","v":0.54208221843833615},{"$f":"SUMIFS(WF_CKD_DATA[[#All],[NIS08-CKD03]],WF_CKD_DATA[[#All],[Rel_D]],Locations!$E$17)","v":5512},{"$f":"IFERROR(J8/E8, \"-\")","v":0.67039649720262706},{"$f":"SUMIFS(WF_CKD_DATA[[#All],[NIS08-CKD04]],WF_CKD_DATA[[#All],[Rel_D]],Locations!$E$17)","v":2153},{"$f":"IFERROR(L8/E8, \"-\")","v":0.26185842860617853}]
[]
[]
[null,null,null,"**","SystmOne practices"]

{"sheet":"Detail","index":3,"n_rows":62,"n_cols":15,"rows_kept":62,"cut":false,"hidden":false,"merged":[[56,12,56,13],[57,12,57,13],[58,12,58,13],[59,12,59,13],[57,3,57,4],[59,3,59,4],[56,3,56,4],[58,3,58,4]]}
[]
[null,null,null,null,{"$f":"MATCH(C6,HEADERINFO2!D:D,0)-1","v":2},"A",0,1,2,3,4,5,6,5,6]
[null,null,"CKD DETAIL",null,null,"[00-00]",{"$f":"OFFSET(HEADERINFO2!$B$1,$E$2+G2,0)","v":"[08-CKD]"},{"$f":"OFFSET(HEADERINFO2!$B$1,$E$2+H2,0)","v":"NIS08-CKD01"},{"$f":"OFFSET(HEADERINFO2!$B$1,$E$2+I2,0)","v":"NIS08-CKD01%"},{"$f":"OFFSET(HEADERINFO2!$B$1,$E$2+J2,0)","v":"NIS08-CKD02"},{"$f":"OFFSET(HEADERINFO2!$B$1,$E$2+K2,0)","v":"NIS08-CKD02%"},{"$f":"OFFSET(HEADERINFO2!$B$1,$E$2+L2,0)","v":"NIS08-CKD03"},{"$f":"OFFSET(HEADERINFO2!$B$1,$E$2+M2,0)","v":"NIS08-CKD03%"},"NIS08-CKD04","NIS08-CKD04%"]
[]
[null,null,"Practice","NACS","Locality","Listsize",{"$f":"VLOOKUP(G$3,INDIRECT(Locations!$B$39),2,0)","v":"Complex Care"}]
[null,null,{"$f":"F2&HEADERTOGGLE!$J$2","v":"A"},null,null,null,{"$f":"VLOOKUP(G$3,INDIRECT(Locations!$B$39),4,0)","v":"eGFR evidence of CKD"},{"$f":"VLOOKUP(H$3,INDIRECT(Locations!$B$39),4,0)","v":"evidence of CKD coded CKD"},{"$f":"VLOOKUP(I$3,INDIRECT(Locations!$B$39),4,0)","v":"% evidence of CKD coded CKD"},{"$f":"VLOOKUP(J$3,INDIRECT(Locations!$B$39),4,0)","v":"evidence of CKD with BP below 140/90"},{"$f":"VLOOKUP(K$3,INDIRECT(Locations!$B$39),4,0)","v":"% evidence of CKD with BP below 140/90"},{"$f":"VLOOKUP(L$3,INDIRECT(Locations!$B$39),4,0)","v":"evidence of CKD on Statins"},{"$f":"VLOOKUP(M$3,INDIRECT(Locations!$B$39),4,0)","v":"% evidence of CKD on Statins"},{"$f":"VLOOKUP(N$3,INDIRECT(Locations!$B$39),4,0)","v":"evidence of CKD to have ACR"},{"$f":"VLOOKUP(O$3,INDIRECT(Locations!$B$39),4,0)","v":"% evidence of CKD to have ACR"}]
[null,null,"Kings Head Medical Practice","F86700","WF-1",{"$f":"SUMIFS(WF_CKD_DATA[[#All],[00-00]],WF_CKD_DATA[[#All],[OrgID]],$D7,WF_CKD_DATA[[#All],[Rel_D]],Locations!$E$17)","v":3901},{"$f":"SUMIFS(WF_CKD_DATA[[#All],[08-CKD]],WF_CKD_DATA[[#All],[OrgID]],$D7,WF_CKD_DATA[[#All],[Rel_D]],Locations!$E$17)","v":172},{"$f":"SUMIFS(WF_CKD_DATA[[#All],[NIS08-CKD01]],WF_CKD_DATA[[#All],[OrgID]],$D7,WF_CKD_DATA[[#All],[Rel_D]],Locations!$E$17)","v":172},{"$f":"H7/G7","v":1},{"$f":"SUMIFS(WF_CKD_DATA[[#All],[NIS08-CKD02]],WF_CKD_DATA[[#All],[OrgID]],$D7,WF_CKD_DATA[[#All],[Rel_D]],Locations!$E$17)","v":124},{"$f":"J7/G7","v":0.72093023255813948},{"$f":"SUMIFS(WF_CKD_DATA[[#All],[NIS08-CKD03]],WF_CKD_DATA[[#All],[OrgID]],$D7,WF_CKD_DATA[[#All],[Rel_D]],Locations!$E$17)","v":115},{"$f":"L7/G7","v":0.66860465116279066},{"$f":"SUMIFS(WF_CKD_DATA[[#All],[NIS08-CKD04]],WF_CKD_DATA[[#All],[OrgID]],$D7,WF_CKD_DATA[[#All],[Rel_D]],Locations!$E$17)","v":49},{"$f":"N7/G7","v":0.28488372093023256}]
[null,null,"Larkshall Medical Centre","F86664","WF-1",{"$f":"SUMIFS(WF_CKD_DATA[[#All],[00-00]],WF_CKD_DATA[[#All],[OrgID]],$D8,WF_CKD_DATA[[#All],[Rel_D]],Locations!$E$17)","v":8471},{"$f":"SUMIFS(WF_CKD_DATA[[#All],[08-CKD]],WF_CKD_DATA[[#All],[OrgID]],$D8,WF_CKD_DATA[[#All],[Rel_D]],Locations!$E$17)","v":209},{"$f":"SUMIFS(WF_CKD_DATA[[#All],[NIS08-CKD01]],WF_CKD_DATA[[#All],[OrgID]],$D8,WF_CKD_DATA[[#All],[Rel_D]],Locations!$E$17)","v":165},{"$f":"H8/G8","v":0.78947368421052633},{"$f":"SUMIFS(WF_CKD_DATA[[#All],[NIS08-CKD02]],WF_CKD_DATA[[#All],[OrgID]],$D8,WF_CKD_DATA[[#All],[Rel_D]],Locations!$E$17)","v":105},{"$f":"J8/G8","v":0.50239234449760761},{"$f":"SUMIFS(WF_CKD_DATA[[#All],[NIS08-CKD03]],WF_CKD_DATA[[#All],[OrgID]],$D8,WF_CKD_DATA[[#All],[Rel_D]],Locations!$E$17)","v":148},{"$f":"L8/G8","v":0.70813397129186606},{"$f":"SUMIFS(WF_CKD_DATA[[#All],[NIS08-CKD04]],WF_CKD_DATA[[#All],[OrgID]],$D8,WF_CKD_DATA[[#All],[Rel_D]],Locations!$E$17)","v":38},{"$f":"N8/G8","v":0.18181818181818182}]
[null,null,"The Microfaculty **","F86638","WF-1",{"$f":"SUMIFS(WF_CKD_DATA[[#All],[00-00]],WF_CKD_DATA[[#All],[OrgID]],$D9,WF_CKD_DATA[[#All],[Rel_D]],Locations!$E$17)","v":5191},{"$f":"SUMIFS(WF_CKD_DATA[[#All],[08-CKD]],WF_CKD_DATA[[#All],[OrgID]],$D9,WF_CKD_DATA[[#All],[Rel_D]],Locations!$E$17)","v":275},{"$f":"SUMIFS(WF_CKD_DATA[[#All],[NIS08-CKD01]],WF_CKD_DATA[[#All],[OrgID]],$D9,WF_CKD_DATA[[#All],[Rel_D]],Locations!$E$17)","v":204},{"$f":"IFERROR(H9/G9,\"-\")","v":0.74181818181818182},{"$f":"SUMIFS(WF_CKD_DATA[[#All],[NIS08-CKD02]],WF_CKD_DATA[[#All],[OrgID]],$D9,WF_CKD_DATA[[#All],[Rel_D]],Locations!$E$17)","v":144},{"$f":"IFERROR(J9/G9, \"-\")","v":0.52363636363636368},{"$f":"SUMIFS(WF_CKD_DATA[[#All],[NIS08-CKD03]],WF_CKD_DATA[[#All],[OrgID]],$D9,WF_CKD_DATA[[#All],[Rel_D]],Locations!$E$17)","v":180},{"$f":"IFERROR(L9/G9,\"-\")","v":0.65454545454545454},{"$f":"SUMIFS(WF_CKD_DATA[[#All],[NIS08-CKD04]],WF_CKD_DATA[[#All],[OrgID]],$D9,WF_CKD_DATA[[#All],[Rel_D]],Locations!$E$17)","v":0},{"$f":"IFERROR(N9/G9,\"-\")","v":0}]
[null,null," The Penryhn Surgery","F86005","WF-1",{"$f":"SUMIFS(WF_CKD_DATA[[#All],[00-00]],WF_CKD_DATA[[#All],[OrgID]],$D10,WF_CKD_DATA[[#All],[Rel_D]],Locations!$E$17)","v":9502},{"$f":"SUMIFS(WF_CKD_DATA[[#All],[08-CKD]],WF_CKD_DATA[[#All],[OrgID]],$D10,WF_CKD_DATA[[#All],[Rel_D]],Locations!$E$17)","v":185},{"$f":"SUMIFS(WF_CKD_DATA[[#All],[NIS08-CKD01]],WF_CKD_DATA[[#All],[OrgID]],$D10,WF_CKD_DATA[[#All],[Rel_D]],Locations!$E$17)","v":171},0.92432432432432432,{"$f":"SUMIFS(WF_CKD_DATA[[#All],[NIS08-CKD02]],WF_CKD_DATA[[#All],[OrgID]],$D10,WF_CKD_DATA[[#All],[Rel_D]],Locations!$E$17)","v":90},0.48648648648648651,{"$f":"SUMIFS(WF_CKD_DATA[[#All],[NIS08-CKD03]],WF_CKD_DATA[[#All],[OrgID]],$D10,WF_CKD_DATA[[#All],[Rel_D]],Locations!$E$17)","v":124},0.67027027027027031,{"$f":"SUMIFS(WF_CKD_DATA[[#All],[NIS08-CKD04]],WF_CKD_DATA[[#All],[OrgID]],$D10,WF_CKD_DATA[[#All],[Rel_D]],Locations!$E$17)","v":52},0.2810810810810811]
[null,null,"Dr Shantir Practice","F86626","WF-1",{"$f":"SUMIFS(WF_CKD_DATA[[#All],[00-00]],WF_CKD_DATA[[#All],[OrgID]],$D11,WF_CKD_DATA[[#All],[Rel_D]],Locations!$E$17)","v":7013},{"$f":"SUMIFS(WF_CKD_DATA[[#All],[08-CKD]],WF_CKD_DATA[[#All],[OrgID]],$D11,WF_CKD_DATA[[#All],[Rel_D]],Locations!$E$17)","v":103},{"$f":"SUMIFS(WF_CKD_DATA[[#All],[NIS08-CKD01]],WF_CKD_DATA[[#All],[OrgID]],$D11,WF_CKD_DATA[[#All],[Rel_D]],Locations!$E$17)","v":86},0.83495145631067957,{"$f":"SUMIFS(WF_CKD_DATA[[#All],[NIS08-CKD02]],WF_CKD_DATA[[#All],[OrgID]],$D11,WF_CKD_DATA[[#All],[Rel_D]],Locations!$E$17)","v":47},0.4563106796116505,{"$f":"SUMIFS(WF_CKD_DATA[[#All],[NIS08-CKD03]],WF_CKD_DATA[[#All],[OrgID]],$D11,WF_CKD_DATA[[#All],[Rel_D]],Locations!$E$17)","v":64},0.62135922330097082,{"$f":"SUMIFS(WF_CKD_DATA[[#All],[NIS08-CKD04]],WF_CKD_DATA[[#All],[OrgID]],$D11,WF_CKD_DATA[[#All],[Rel_D]],Locations!$E$17)","v":20},0.1941747572815534]
[null,null,"Lime Tree & Sinnott Healthcare Ltd","Y01839","WF-1",{"$f":"SUMIFS(WF_CKD_DATA[[#All],[00-00]],WF_CKD_DATA[[#All],[OrgID]],$D12,WF_CKD_DATA[[#All],[Rel_D]],Locations!$E$17)","v":6230},{"$f":"SUMIFS(WF_CKD_DATA[[#All],[08-CKD]],WF_CKD_DATA[[#All],[OrgID]],$D12,WF_CKD_DATA[[#All],[Rel_D]],Locations!$E$17)","v":151},{"$f":"SUMIFS(WF_CKD_DATA[[#All],[NIS08-CKD01]],WF_CKD_DATA[[#All],[OrgID]],$D12,WF_CKD_DATA[[#All],[Rel_D]],Locations!$E$17)","v":129},0.85430463576158944,{"$f":"SUMIFS(WF_CKD_DATA[[#All],[NIS08-CKD02]],WF_CKD_DATA[[#All],[OrgID]],$D12,WF_CKD_DATA[[#All],[Rel_D]],Locations!$E$17)","v":70},0.46357615894039733,{"$f":"SUMIFS(WF_CKD_DATA[[#All],[NIS08-CKD03]],WF_CKD_DATA[[#All],[OrgID]],$D12,WF_CKD_DATA[[#All],[Rel_D]],Locations!$E$17)","v":111},0.73509933774834435,{"$f":"SUMIFS(WF_CKD_DATA[[#All],[NIS08-CKD04]],WF_CKD_DATA[[#All],[OrgID]],$D12,WF_CKD_DATA[[#All],[Rel_D]],Locations!$E$17)","v":41},0.27152317880794702]
[null,null,"The Bailey Practice","F86689","WF-1",{"$f":"SUMIFS(WF_CKD_DATA[[#All],[00-00]],WF_CKD_DATA[[#All],[OrgID]],$D13,WF_CKD_DATA[[#All],[Rel_D]],Locations!$E$17)","v":4395},{"$f":"SUMIFS(WF_CKD_DATA[[#All],[08-CKD]],WF_CKD_DATA[[#All],[OrgID]],$D13,WF_CKD_DATA[[#All],[Rel_D]],Locations!$E$17)","v":82},{"$f":"SUMIFS(WF_CKD_DATA[[#All],[NIS08-CKD01]],WF_CKD_DATA[[#All],[OrgID]],$D13,WF_CKD_DATA[[#All],[Rel_D]],Locations!$E$17)","v":70},0.85365853658536583,{"$f":"SUMIFS(WF_CKD_DATA[[#All],[NIS08-CKD02]],WF_CKD_DATA[[#All],[OrgID]],$D13,WF_CKD_DATA[[#All],[Rel_D]],Locations!$E$17)","v":41},0.5,{"$f":"SUMIFS(WF_CKD_DATA[[#All],[NIS08-CKD03]],WF_CKD_DATA[[#All],[OrgID]],$D13,WF_CKD_DATA[[#All],[Rel_D]],Locations!$E$17)","v":56},0.68292682926829273,{"$f":"SUMIFS(WF_CKD_DATA[[#All],[NIS08-CKD04]],WF_CKD_DATA[[#All],[OrgID]],$D13,WF_CKD_DATA[[#All],[Rel_D]],Locations!$E$17)","v":14},0.17073170731707318]
[null,null,"Forest Surgery **","F86026","WF-1",{"$f":"SUMIFS(WF_CKD_DATA[[#All],[00-00]],WF_CKD_DATA[[#All],[OrgID]],$D14,WF_CKD_DATA[[#All],[Rel_D]],Locations!$E$17)","v":7141},{"$f":"SUMIFS(WF_CKD_DATA[[#All],[08-CKD]],WF_CKD_DATA[[#All],[OrgID]],$D14,WF_CKD_DATA[[#All],[Rel_D]],Locations!$E$17)","v":276},{"$f":"SUMIFS(WF_CKD_DATA[[#All],[NIS08-CKD01]],WF_CKD_DATA[[#All],[OrgID]],$D14,WF_CKD_DATA[[#All],[Rel_D]],Locations!$E$17)","v":194},{"$f":"IFERROR(H14/G14,\"-\")","v":0.70289855072463769},{"$f":"SUMIFS(WF_CKD_DATA[[#All],[NIS08-CKD02]],WF_CKD_DATA[[#All],[OrgID]],$D14,WF_CKD_DATA[[#All],[Rel_D]],Locations!$E$17)","v":166},{"$f":"IFERROR(J14/G14, \"-\")","v":0.60144927536231885},{"$f":"SUMIFS(WF_CKD_DATA[[#All],[NIS08-CKD03]],WF_CKD_DATA[[#All],[OrgID]],$D14,WF_CKD_DATA[[#All],[Rel_D]],Locations!$E$17)","v":157},{"$f":"IFERROR(L14/G14,\"-\")","v":0.5688405797101449},{"$f":"SUMIFS(WF_CKD_DATA[[#All],[NIS08-CKD04]],WF_CKD_DATA[[#All],[OrgID]],$D14,WF_CKD_DATA[[#All],[Rel_D]],Locations!$E$17)","v":0},{"$f":"IFERROR(N14/G14,\"-\")","v":0}]
[null,null,"Chingford/ Walthamstow","WF-1","WF-1",{"$f":"SUM(F7:F14)","v":51844},{"$f":"SUM(G7:G14)","v":1453},{"$f":"SUM(H7:H14)","v":1191},{"$f":"IFERROR(H15/G15,\"-\")","v":0.81968341362697872},{"$f":"SUM(J7:J14)","v":787},{"$f":"IFERROR(J15/G15,\"-\")","v":0.54163799036476257},{"$f":"SUM(L7:L14)","v":955},{"$f":"L15/G15","v":0.65726083964211979},{"$f":"SUM(N7:N14)","v":214},0.14728148657949072]
[null,null,"Chingford Medical Practice","Y01291","WF-2",{"$f":"SUMIFS(WF_CKD_DATA[[#All],[00-00]],WF_CKD_DATA[[#All],[OrgID]],$D16,WF_CKD_DATA[[#All],[Rel_D]],Locations!$E$17)","v":9172},{"$f":"SUMIFS(WF_CKD_DATA[[#All],[08-CKD]],WF_CKD_DATA[[#All],[OrgID]],$D16,WF_CKD_DATA[[#All],[Rel_D]],Locations!$E$17)","v":368},{"$f":"SUMIFS(WF_CKD_DATA[[#All],[NIS08-CKD01]],WF_CKD_DATA[[#All],[OrgID]],$D16,WF_CKD_DATA[[#All],[Rel_D]],Locations!$E$17)","v":357},0.97010869565217395,{"$f":"SUMIFS(WF_CKD_DATA[[#All],[NIS08-CKD02]],WF_CKD_DATA[[#All],[OrgID]],$D16,WF_CKD_DATA[[#All],[Rel_D]],Locations!$E$17)","v":225},{"$f":"IFERROR(J16/G16,\"-\")","v":0.61141304347826086},{"$f":"SUMIFS(WF_CKD_DATA[[#All],[NIS08-CKD03]],WF_CKD_DATA[[#All],[OrgID]],$D16,WF_CKD_DATA[[#All],[Rel_D]],Locations!$E$17)","v":247},{"$f":"L16/G16","v":0.67119565217391308},{"$f":"SUMIFS(WF_CKD_DATA[[#All],[NIS08-CKD04]],WF_CKD_DATA[[#All],[OrgID]],$D16,WF_CKD_DATA[[#All],[Rel_D]],Locations!$E$17)","v":206},0.55978260869565222]
[null,null,"Churchill Medical Centre","F86627","WF-2",{"$f":"SUMIFS(WF_CKD_DATA[[#All],[00-00]],WF_CKD_DATA[[#All],[OrgID]],$D17,WF_CKD_DATA[[#All],[Rel_D]],Locations!$E$17)","v":13283},{"$f":"SUMIFS(WF_CKD_DATA[[#All],[08-CKD]],WF_CKD_DATA[[#All],[OrgID]],$D17,WF_CKD_DATA[[#All],[Rel_D]],Locations!$E$17)","v":531},{"$f":"SUMIFS(WF_CKD_DATA[[#All],[NIS08-CKD01]],WF_CKD_DATA[[#All],[OrgID]],$D17,WF_CKD_DATA[[#All],[Rel_D]],Locations!$E$17)","v":447},0.84180790960451979,{"$f":"SUMIFS(WF_CKD_DATA[[#All],[NIS08-CKD02]],WF_CKD_DATA[[#All],[OrgID]],$D17,WF_CKD_DATA[[#All],[Rel_D]],Locations!$E$17)","v":265},0.49905838041431261,{"$f":"SUMIFS(WF_CKD_DATA[[#All],[NIS08-CKD03]],WF_CKD_DATA[[#All],[OrgID]],$D17,WF_CKD_DATA[[#All],[Rel_D]],Locations!$E$17)","v":350},{"$f":"L17/G17","v":0.6591337099811676},{"$f":"SUMIFS(WF_CKD_DATA[[#All],[NIS08-CKD04]],WF_CKD_DATA[[#All],[OrgID]],$D17,WF_CKD_DATA[[#All],[Rel_D]],Locations!$E$17)","v":120},0.22598870056497175]
[null,null,"Handsworth Medical Centre **","F86004","WF-2",{"$f":"SUMIFS(WF_CKD_DATA[[#All],[00-00]],WF_CKD_DATA[[#All],[OrgID]],$D18,WF_CKD_DATA[[#All],[Rel_D]],Locations!$E$17)","v":15928},{"$f":"SUMIFS(WF_CKD_DATA[[#All],[08-CKD]],WF_CKD_DATA[[#All],[OrgID]],$D18,WF_CKD_DATA[[#All],[Rel_D]],Locations!$E$17)","v":809},{"$f":"SUMIFS(WF_CKD_DATA[[#All],[NIS08-CKD01]],WF_CKD_DATA[[#All],[OrgID]],$D18,WF_CKD_DATA[[#All],[Rel_D]],Locations!$E$17)","v":570},{"$f":"IFERROR(H18/G18, \"-\")","v":0.70457354758961677},{"$f":"SUMIFS(WF_CKD_DATA[[#All],[NIS08-CKD02]],WF_CKD_DATA[[#All],[OrgID]],$D18,WF_CKD_DATA[[#All],[Rel_D]],Locations!$E$17)","v":410},{"$f":"IFERROR(J18/G18, \"-\")","v":0.50679851668726827},{"$f":"SUMIFS(WF_CKD_DATA[[#All],[NIS08-CKD03]],WF_CKD_DATA[[#All],[OrgID]],$D18,WF_CKD_DATA[[#All],[Rel_D]],Locations!$E$17)","v":456},{"$f":"IFERROR(L18/G18,\"-\")","v":0.56365883807169348},{"$f":"SUMIFS(WF_CKD_DATA[[#All],[NIS08-CKD04]],WF_CKD_DATA[[#All],[OrgID]],$D18,WF_CKD_DATA[[#All],[Rel_D]],Locations!$E$17)","v":0},{"$f":"IFERROR(N18/G18,\"-\")","v":0}]
[null,null,"The Ridgeway Surgery","F86078","WF-2",{"$f":"SUMIFS(WF_CKD_DATA[[#All],[00-00]],WF_CKD_DATA[[#All],[OrgID]],$D19,WF_CKD_DATA[[#All],[Rel_D]],Locations!$E$17)","v":6869},{"$f":"SUMIFS(WF_CKD_DATA[[#All],[08-CKD]],WF_CKD_DATA[[#All],[OrgID]],$D19,WF_CKD_DATA[[#All],[Rel_D]],Locations!$E$17)","v":316},{"$f":"SUMIFS(WF_CKD_DATA[[#All],[NIS08-CKD01]],WF_CKD_DATA[[#All],[OrgID]],$D19,WF_CKD_DATA[[#All],[Rel_D]],Locations!$E$17)","v":113},0.35759493670886078,{"$f":"SUMIFS(WF_CKD_DATA[[#All],[NIS08-CKD02]],WF_CKD_DATA[[#All],[OrgID]],$D19,WF_CKD_DATA[[#All],[Rel_D]],Locations!$E$17)","v":128},0.4050632911392405,{"$f":"SUMIFS(WF_CKD_DATA[[#All],[NIS08-CKD03]],WF_CKD_DATA[[#All],[OrgID]],$D19,WF_CKD_DATA[[#All],[Rel_D]],Locations!$E$17)","v":190},0.60126582278481011,{"$f":"SUMIFS(WF_CKD_DATA[[#All],[NIS08-CKD04]],WF_CKD_DATA[[#All],[OrgID]],$D19,WF_CKD_DATA[[#All],[Rel_D]],Locations!$E$17)","v":49},0.1550632911392405]
[null,null,"Old Church Surgery","F86616","WF-2",{"$f":"SUMIFS(WF_CKD_DATA[[#All],[00-00]],WF_CKD_DATA[[#All],[OrgID]],$D20,WF_CKD_DATA[[#All],[Rel_D]],Locations!$E$17)","v":7996},{"$f":"SUMIFS(WF_CKD_DATA[[#All],[08-CKD]],WF_CKD_DATA[[#All],[OrgID]],$D20,WF_CKD_DATA[[#All],[Rel_D]],Locations!$E$17)","v":268},{"$f":"SUMIFS(WF_CKD_DATA[[#All],[NIS08-CKD01]],WF_CKD_DATA[[#All],[OrgID]],$D20,WF_CKD_DATA[[#All],[Rel_D]],Locations!$E$17)","v":232},0.86567164179104472,{"$f":"SUMIFS(WF_CKD_DATA[[#All],[NIS08-CKD02]],WF_CKD_DATA[[#All],[OrgID]],$D20,WF_CKD_DATA[[#All],[Rel_D]],Locations!$E$17)","v":187},0.69776119402985071,{"$f":"SUMIFS(WF_CKD_DATA[[#All],[NIS08-CKD03]],WF_CKD_DATA[[#All],[OrgID]],$D20,WF_CKD_DATA[[#All],[Rel_D]],Locations!$E$17)","v":164},0.61194029850746268,{"$f":"SUMIFS(WF_CKD_DATA[[#All],[NIS08-CKD04]],WF_CKD_DATA[[#All],[OrgID]],$D20,WF_CKD_DATA[[#All],[Rel_D]],Locations!$E$17)","v":90},0.33582089552238809]
[null,null,"Chingford E4","WF-2","WF-2",{"$f":"SUM(F16:F20)","v":53248},{"$f":"SUM(G16:G20)","v":2292},1719,0.75,{"$f":"SUM(J16:J20)","v":1215},{"$f":"J21/G21","v":0.53010471204188481},{"$f":"SUM(L16:L20)","v":1407},{"$f":"L21/G21","v":0.61387434554973819},{"$f":"SUM(N16:N20)","v":465},{"$f":"N21/G21","v":0.20287958115183247}]
[null,null,"The Manor Practice","F86011","WF-3",{"$f":"SUMIFS(WF_CKD_DATA[[#All],[00-00]],WF_CKD_DATA[[#All],[OrgID]],$D22,WF_CKD_DATA[[#All],[Rel_D]],Locations!$E$17)","v":9696},{"$f":"SUMIFS(WF_CKD_DATA[[#All],[08-CKD]],WF_CKD_DATA[[#All],[OrgID]],$D22,WF_CKD_DATA[[#All],[Rel_D]],Locations!$E$17)","v":217},{"$f":"SUMIFS(WF_CKD_DATA[[#All],[NIS08-CKD01]],WF_CKD_DATA[[#All],[OrgID]],$D22,WF_CKD_DATA[[#All],[Rel_D]],Locations!$E$17)","v":169},0.77880184331797231,{"$f":"SUMIFS(WF_CKD_DATA[[#All],[NIS08-CKD02]],WF_CKD_DATA[[#All],[OrgID]],$D22,WF_CKD_DATA[[#All],[Rel_D]],Locations!$E$17)","v":110},0.50691244239631339,{"$f":"SUMIFS(WF_CKD_DATA[[#All],[NIS08-CKD03]],WF_CKD_DATA[[#All],[OrgID]],$D22,WF_CKD_DATA[[#All],[Rel_D]],Locations!$E$17)","v":144},{"$f":"L22/G22","v":0.66359447004608296},{"$f":"SUMIFS(WF_CKD_DATA[[#All],[NIS08-CKD04]],WF_CKD_DATA[[#All],[OrgID]],$D22,WF_CKD_DATA[[#All],[Rel_D]],Locations!$E$17)","v":56},0.25806451612903225]
[null,null,"Sma Medical Centre","F86038","WF-3",{"$f":"SUMIFS(WF_CKD_DATA[[#All],[00-00]],WF_CKD_DATA[[#All],[OrgID]],$D23,WF_CKD_DATA[[#All],[Rel_D]],Locations!$E$17)","v":11103},{"$f":"SUMIFS(WF_CKD_DATA[[#All],[08-CKD]],WF_CKD_DATA[[#All],[OrgID]],$D23,WF_CKD_DATA[[#All],[Rel_D]],Locations!$E$17)","v":190},{"$f":"SUMIFS(WF_CKD_DATA[[#All],[NIS08-CKD01]],WF_CKD_DATA[[#All],[OrgID]],$D23,WF_CKD_DATA[[#All],[Rel_D]],Locations!$E$17)","v":152},0.8,{"$f":"SUMIFS(WF_CKD_DATA[[#All],[NIS08-CKD02]],WF_CKD_DATA[[#All],[OrgID]],$D23,WF_CKD_DATA[[#All],[Rel_D]],Locations!$E$17)","v":150},0.78947368421052633,{"$f":"SUMIFS(WF_CKD_DATA[[#All],[NIS08-CKD03]],WF_CKD_DATA[[#All],[OrgID]],$D23,WF_CKD_DATA[[#All],[Rel_D]],Locations!$E$17)","v":145},{"$f":"L23/G23","v":0.76315789473684215},{"$f":"SUMIFS(WF_CKD_DATA[[#All],[NIS08-CKD04]],WF_CKD_DATA[[#All],[OrgID]],$D23,WF_CKD_DATA[[#All],[Rel_D]],Locations!$E$17)","v":100},0.52631578947368418]
[null,null,"Leyton Healthcare (Oliver Road) **","F86074","WF-3",{"$f":"SUMIFS(WF_CKD_DATA[[#All],[00-00]],WF_CKD_DATA[[#All],[OrgID]],$D24,WF_CKD_DATA[[#All],[Rel_D]],Locations!$E$17)","v":15084},{"$f":"SUMIFS(WF_CKD_DATA[[#All],[08-CKD]],WF_CKD_DATA[[#All],[OrgID]],$D24,WF_CKD_DATA[[#All],[Rel_D]],Locations!$E$17)","v":372},{"$f":"SUMIFS(WF_CKD_DATA[[#All],[NIS08-CKD01]],WF_CKD_DATA[[#All],[OrgID]],$D24,WF_CKD_DATA[[#All],[Rel_D]],Locations!$E$17)","v":260},{"$f":"IFERROR(H24/G24,\"-\")","v":0.69892473118279574},{"$f":"SUMIFS(WF_CKD_DATA[[#All],[NIS08-CKD02]],WF_CKD_DATA[[#All],[OrgID]],$D24,WF_CKD_DATA[[#All],[Rel_D]],Locations!$E$17)","v":189},{"$f":"IFERROR(J24/G24, \"-\")","v":0.50806451612903225},{"$f":"SUMIFS(WF_CKD_DATA[[#All],[NIS08-CKD03]],WF_CKD_DATA[[#All],[OrgID]],$D24,WF_CKD_DATA[[#All],[Rel_D]],Locations!$E$17)","v":242},{"$f":"IFERROR(L24/G24,\"-\")","v":0.65053763440860213},{"$f":"SUMIFS(WF_CKD_DATA[[#All],[NIS08-CKD04]],WF_CKD_DATA[[#All],[OrgID]],$D24,WF_CKD_DATA[[#All],[Rel_D]],Locations!$E$17)","v":0},{"$f":"IFERROR(N24/G24,\"-\")","v":0}]
[null,null,"Leyton Collaborative","WF-3","WF-3",{"$f":"SUM(F22:F24)","v":35883},{"$f":"SUM(G22:G24)","v":779},{"$f":"SUM(H22:H24)","v":581},0.74582798459563548,{"$f":"SUM(J22:J24)","v":449},{"$f":"J25/G25","v":0.57637997432605903},{"$f":"SUM(L22:L24)","v":531},{"$f":"L25/G25","v":0.68164313222079587},{"$f":"SUM(N22:N24)","v":156},{"$f":"N25/G25","v":0.20025673940949937}]
[null,null,"The Allum Medical Centre","F86036","WF-4",{"$f":"SUMIFS(WF_CKD_DATA[[#All],[00-00]],WF_CKD_DATA[[#All],[OrgID]],$D26,WF_CKD_DATA[[#All],[Rel_D]],Locations!$E$17)","v":14732},{"$f":"SUMIFS(WF_CKD_DATA[[#All],[08-CKD]],WF_CKD_DATA[[#All],[OrgID]],$D26,WF_CKD_DATA[[#All],[Rel_D]],Locations!$E$17)","v":305},{"$f":"SUMIFS(WF_CKD_DATA[[#All],[NIS08-CKD01]],WF_CKD_DATA[[#All],[OrgID]],$D26,WF_CKD_DATA[[#All],[Rel_D]],Locations!$E$17)","v":224},0.73442622950819669,{"$f":"SUMIFS(WF_CKD_DATA[[#All],[NIS08-CKD02]],WF_CKD_DATA[[#All],[OrgID]],$D26,WF_CKD_DATA[[#All],[Rel_D]],Locations!$E$17)","v":167},0.54754098360655734,{"$f":"SUMIFS(WF_CKD_DATA[[#All],[NIS08-CKD03]],WF_CKD_DATA[[#All],[OrgID]],$D26,WF_CKD_DATA[[#All],[Rel_D]],Locations!$E$17)","v":206},{"$f":"L26/G26","v":0.67540983606557381},{"$f":"SUMIFS(WF_CKD_DATA[[#All],[NIS08-CKD04]],WF_CKD_DATA[[#All],[OrgID]],$D26,WF_CKD_DATA[[#All],[Rel_D]],Locations!$E$17)","v":98},0.32131147540983607]
[null,null," Crawley Road Medical Centre","F86044","WF-4",{"$f":"SUMIFS(WF_CKD_DATA[[#All],[00-00]],WF_CKD_DATA[[#All],[OrgID]],$D27,WF_CKD_DATA[[#All],[Rel_D]],Locations!$E$17)","v":10801},{"$f":"SUMIFS(WF_CKD_DATA[[#All],[08-CKD]],WF_CKD_DATA[[#All],[OrgID]],$D27,WF_CKD_DATA[[#All],[Rel_D]],Locations!$E$17)","v":117},{"$f":"SUMIFS(WF_CKD_DATA[[#All],[NIS08-CKD01]],WF_CKD_DATA[[#All],[OrgID]],$D27,WF_CKD_DATA[[#All],[Rel_D]],Locations!$E$17)","v":105},0.89743589743589747,{"$f":"SUMIFS(WF_CKD_DATA[[#All],[NIS08-CKD02]],WF_CKD_DATA[[#All],[OrgID]],$D27,WF_CKD_DATA[[#All],[Rel_D]],Locations!$E$17)","v":56},0.47863247863247865,{"$f":"SUMIFS(WF_CKD_DATA[[#All],[NIS08-CKD03]],WF_CKD_DATA[[#All],[OrgID]],$D27,WF_CKD_DATA[[#All],[Rel_D]],Locations!$E$17)","v":83},{"$f":"L27/G27","v":0.70940170940170943},{"$f":"SUMIFS(WF_CKD_DATA[[#All],[NIS08-CKD04]],WF_CKD_DATA[[#All],[OrgID]],$D27,WF_CKD_DATA[[#All],[Rel_D]],Locations!$E$17)","v":28},0.23931623931623933]
[null,null,"Francis Road Medical Centre","F86696","WF-4",{"$f":"SUMIFS(WF_CKD_DATA[[#All],[00-00]],WF_CKD_DATA[[#All],[OrgID]],$D28,WF_CKD_DATA[[#All],[Rel_D]],Locations!$E$17)","v":6873},{"$f":"SUMIFS(WF_CKD_DATA[[#All],[08-CKD]],WF_CKD_DATA[[#All],[OrgID]],$D28,WF_CKD_DATA[[#All],[Rel_D]],Locations!$E$17)","v":117},{"$f":"SUMIFS(WF_CKD_DATA[[#All],[NIS08-CKD01]],WF_CKD_DATA[[#All],[OrgID]],$D28,WF_CKD_DATA[[#All],[Rel_D]],Locations!$E$17)","v":109},0.93162393162393164,{"$f":"SUMIFS(WF_CKD_DATA[[#All],[NIS08-CKD02]],WF_CKD_DATA[[#All],[OrgID]],$D28,WF_CKD_DATA[[#All],[Rel_D]],Locations!$E$17)","v":62},0.52991452991452992,{"$f":"SUMIFS(WF_CKD_DATA[[#All],[NIS08-CKD03]],WF_CKD_DATA[[#All],[OrgID]],$D28,WF_CKD_DATA[[#All],[Rel_D]],Locations!$E$17)","v":92},0.78632478632478631,{"$f":"SUMIFS(WF_CKD_DATA[[#All],[NIS08-CKD04]],WF_CKD_DATA[[#All],[OrgID]],$D28,WF_CKD_DATA[[#All],[Rel_D]],Locations!$E$17)","v":50},0.42735042735042733]
[null,null,"Hampton Medical Centre","F86712","WF-4",{"$f":"SUMIFS(WF_CKD_DATA[[#All],[00-00]],WF_CKD_DATA[[#All],[OrgID]],$D29,WF_CKD_DATA[[#All],[Rel_D]],Locations!$E$17)","v":3392},{"$f":"SUMIFS(WF_CKD_DATA[[#All],[08-CKD]],WF_CKD_DATA[[#All],[OrgID]],$D29,WF_CKD_DATA[[#All],[Rel_D]],Locations!$E$17)","v":74},{"$f":"SUMIFS(WF_CKD_DATA[[#All],[NIS08-CKD01]],WF_CKD_DATA[[#All],[OrgID]],$D29,WF_CKD_DATA[[#All],[Rel_D]],Locations!$E$17)","v":73},0.98648648648648651,{"$f":"SUMIFS(WF_CKD_DATA[[#All],[NIS08-CKD02]],WF_CKD_DATA[[#All],[OrgID]],$D29,WF_CKD_DATA[[#All],[Rel_D]],Locations!$E$17)","v":40},0.54054054054054057,{"$f":"SUMIFS(WF_CKD_DATA[[#All],[NIS08-CKD03]],WF_CKD_DATA[[#All],[OrgID]],$D29,WF_CKD_DATA[[#All],[Rel_D]],Locations!$E$17)","v":64},0.86486486486486491,{"$f":"SUMIFS(WF_CKD_DATA[[#All],[NIS08-CKD04]],WF_CKD_DATA[[#All],[OrgID]],$D29,WF_CKD_DATA[[#All],[Rel_D]],Locations!$E$17)","v":16},0.21621621621621623]
[null,null,"Lime Tree Surgery","F86650","WF-4",{"$f":"SUMIFS(WF_CKD_DATA[[#All],[00-00]],WF_CKD_DATA[[#All],[OrgID]],$D30,WF_CKD_DATA[[#All],[Rel_D]],Locations!$E$17)","v":8077},{"$f":"SUMIFS(WF_CKD_DATA[[#All],[08-CKD]],WF_CKD_DATA[[#All],[OrgID]],$D30,WF_CKD_DATA[[#All],[Rel_D]],Locations!$E$17)","v":144},{"$f":"SUMIFS(WF_CKD_DATA[[#All],[NIS08-CKD01]],WF_CKD_DATA[[#All],[OrgID]],$D30,WF_CKD_DATA[[#All],[Rel_D]],Locations!$E$17)","v":131},0.90972222222222221,{"$f":"SUMIFS(WF_CKD_DATA[[#All],[NIS08-CKD02]],WF_CKD_DATA[[#All],[OrgID]],$D30,WF_CKD_DATA[[#All],[Rel_D]],Locations!$E$17)","v":67},0.46527777777777779,{"$f":"SUMIFS(WF_CKD_DATA[[#All],[NIS08-CKD03]],WF_CKD_DATA[[#All],[OrgID]],$D30,WF_CKD_DATA[[#All],[Rel_D]],Locations!$E$17)","v":96},0.66666666666666663,{"$f":"SUMIFS(WF_CKD_DATA[[#All],[NIS08-CKD04]],WF_CKD_DATA[[#All],[OrgID]],$D30,WF_CKD_DATA[[#All],[Rel_D]],Locations!$E$17)","v":100},0.69444444444444442]
[null,null,"The Lyndhurst Surgery","F86088","WF-4",{"$f":"SUMIFS(WF_CKD_DATA[[#All],[00-00]],WF_CKD_DATA[[#All],[OrgID]],$D31,WF_CKD_DATA[[#All],[Rel_D]],Locations!$E$17)","v":5027},{"$f":"SUMIFS(WF_CKD_DATA[[#All],[08-CKD]],WF_CKD_DATA[[#All],[OrgID]],$D31,WF_CKD_DATA[[#All],[Rel_D]],Locations!$E$17)","v":109},{"$f":"SUMIFS(WF_CKD_DATA[[#All],[NIS08-CKD01]],WF_CKD_DATA[[#All],[OrgID]],$D31,WF_CKD_DATA[[#All],[Rel_D]],Locations!$E$17)","v":93},0.85321100917431192,{"$f":"SUMIFS(WF_CKD_DATA[[#All],[NIS08-CKD02]],WF_CKD_DATA[[#All],[OrgID]],$D31,WF_CKD_DATA[[#All],[Rel_D]],Locations!$E$17)","v":46},0.42201834862385323,{"$f":"SUMIFS(WF_CKD_DATA[[#All],[NIS08-CKD03]],WF_CKD_DATA[[#All],[OrgID]],$D31,WF_CKD_DATA[[#All],[Rel_D]],Locations!$E$17)","v":86},0.78899082568807344,{"$f":"SUMIFS(WF_CKD_DATA[[#All],[NIS08-CKD04]],WF_CKD_DATA[[#All],[OrgID]],$D31,WF_CKD_DATA[[#All],[Rel_D]],Locations!$E$17)","v":56},0.51376146788990829]
[null,null,"The Ecclesbourne Practice **","F86018","WF-4",{"$f":"SUMIFS(WF_CKD_DATA[[#All],[00-00]],WF_CKD_DATA[[#All],[OrgID]],$D32,WF_CKD_DATA[[#All],[Rel_D]],Locations!$E$17)","v":9931},{"$f":"SUMIFS(WF_CKD_DATA[[#All],[08-CKD]],WF_CKD_DATA[[#All],[OrgID]],$D32,WF_CKD_DATA[[#All],[Rel_D]],Locations!$E$17)","v":490},{"$f":"SUMIFS(WF_CKD_DATA[[#All],[NIS08-CKD01]],WF_CKD_DATA[[#All],[OrgID]],$D32,WF_CKD_DATA[[#All],[Rel_D]],Locations!$E$17)","v":369},{"$f":"IFERROR(H32/G32, \"-\")","v":0.75306122448979596},{"$f":"SUMIFS(WF_CKD_DATA[[#All],[NIS08-CKD02]],WF_CKD_DATA[[#All],[OrgID]],$D32,WF_CKD_DATA[[#All],[Rel_D]],Locations!$E$17)","v":255},{"$f":"IFERROR(J32/G32, \"-\")","v":0.52040816326530615},{"$f":"SUMIFS(WF_CKD_DATA[[#All],[NIS08-CKD03]],WF_CKD_DATA[[#All],[OrgID]],$D32,WF_CKD_DATA[[#All],[Rel_D]],Locations!$E$17)","v":268},{"$f":"IFERROR(L32/G32,\"-\")","v":0.54693877551020409},{"$f":"SUMIFS(WF_CKD_DATA[[#All],[NIS08-CKD04]],WF_CKD_DATA[[#All],[OrgID]],$D32,WF_CKD_DATA[[#All],[Rel_D]],Locations!$E$17)","v":0},{"$f":"IFERROR(N32/G32,\"-\")","v":0}]
[null,null,"Forest Integrated Health","WF-4","WF-4",{"$f":"SUM(F26:F32)","v":58833},{"$f":"SUM(G26:G32)","v":1356},{"$f":"SUM(H26:H32)","v":1104},0.81415929203539827,{"$f":"SUM(J26:J32)","v":693},{"$f":"J33/G33","v":0.51106194690265483},{"$f":"SUM(L26:L32)","v":895},{"$f":"L33/G33","v":0.66002949852507375},{"$f":"SUM(N26:N32)","v":348},{"$f":"N33/G33","v":0.25663716814159293}]
[null,null,"Green Man Medical Centre","F86621","WF-5",{"$f":"SUMIFS(WF_CKD_DATA[[#All],[00-00]],WF_CKD_DATA[[#All],[OrgID]],$D34,WF_CKD_DATA[[#All],[Rel_D]],Locations!$E$17)","v":6444},{"$f":"SUMIFS(WF_CKD_DATA[[#All],[08-CKD]],WF_CKD_DATA[[#All],[OrgID]],$D34,WF_CKD_DATA[[#All],[Rel_D]],Locations!$E$17)","v":158},{"$f":"SUMIFS(WF_CKD_DATA[[#All],[NIS08-CKD01]],WF_CKD_DATA[[#All],[OrgID]],$D34,WF_CKD_DATA[[#All],[Rel_D]],Locations!$E$17)","v":138},0.87341772151898733,{"$f":"SUMIFS(WF_CKD_DATA[[#All],[NIS08-CKD02]],WF_CKD_DATA[[#All],[OrgID]],$D34,WF_CKD_DATA[[#All],[Rel_D]],Locations!$E$17)","v":88},0.55696202531645567,{"$f":"SUMIFS(WF_CKD_DATA[[#All],[NIS08-CKD03]],WF_CKD_DATA[[#All],[OrgID]],$D34,WF_CKD_DATA[[#All],[Rel_D]],Locations!$E$17)","v":131},{"$f":"L34/G34","v":0.82911392405063289},{"$f":"SUMIFS(WF_CKD_DATA[[#All],[NIS08-CKD04]],WF_CKD_DATA[[#All],[OrgID]],$D34,WF_CKD_DATA[[#All],[Rel_D]],Locations!$E$17)","v":50},0.31645569620253167]
[null,null,"High Road Surgery","F86045","WF-5",{"$f":"SUMIFS(WF_CKD_DATA[[#All],[00-00]],WF_CKD_DATA[[#All],[OrgID]],$D35,WF_CKD_DATA[[#All],[Rel_D]],Locations!$E$17)","v":2025},{"$f":"SUMIFS(WF_CKD_DATA[[#All],[08-CKD]],WF_CKD_DATA[[#All],[OrgID]],$D35,WF_CKD_DATA[[#All],[Rel_D]],Locations!$E$17)","v":50},{"$f":"SUMIFS(WF_CKD_DATA[[#All],[NIS08-CKD01]],WF_CKD_DATA[[#All],[OrgID]],$D35,WF_CKD_DATA[[#All],[Rel_D]],Locations!$E$17)","v":45},0.9,{"$f":"SUMIFS(WF_CKD_DATA[[#All],[NIS08-CKD02]],WF_CKD_DATA[[#All],[OrgID]],$D35,WF_CKD_DATA[[#All],[Rel_D]],Locations!$E$17)","v":35},0.7,{"$f":"SUMIFS(WF_CKD_DATA[[#All],[NIS08-CKD03]],WF_CKD_DATA[[#All],[OrgID]],$D35,WF_CKD_DATA[[#All],[Rel_D]],Locations!$E$17)","v":39},{"$f":"L35/G35","v":0.78},{"$f":"SUMIFS(WF_CKD_DATA[[#All],[NIS08-CKD04]],WF_CKD_DATA[[#All],[OrgID]],$D35,WF_CKD_DATA[[#All],[Rel_D]],Locations!$E$17)","v":37},0.74]
[null,null,"Kiyani Medical Practice","F86701","WF-5",{"$f":"SUMIFS(WF_CKD_DATA[[#All],[00-00]],WF_CKD_DATA[[#All],[OrgID]],$D36,WF_CKD_DATA[[#All],[Rel_D]],Locations!$E$17)","v":3853},{"$f":"SUMIFS(WF_CKD_DATA[[#All],[08-CKD]],WF_CKD_DATA[[#All],[OrgID]],$D36,WF_CKD_DATA[[#All],[Rel_D]],Locations!$E$17)","v":84},{"$f":"SUMIFS(WF_CKD_DATA[[#All],[NIS08-CKD01]],WF_CKD_DATA[[#All],[OrgID]],$D36,WF_CKD_DATA[[#All],[Rel_D]],Locations!$E$17)","v":80},0.95238095238095233,{"$f":"SUMIFS(WF_CKD_DATA[[#All],[NIS08-CKD02]],WF_CKD_DATA[[#All],[OrgID]],$D36,WF_CKD_DATA[[#All],[Rel_D]],Locations!$E$17)","v":53},0.63095238095238093,{"$f":"SUMIFS(WF_CKD_DATA[[#All],[NIS08-CKD03]],WF_CKD_DATA[[#All],[OrgID]],$D36,WF_CKD_DATA[[#All],[Rel_D]],Locations!$E$17)","v":77},0.91666666666666663,{"$f":"SUMIFS(WF_CKD_DATA[[#All],[NIS08-CKD04]],WF_CKD_DATA[[#All],[OrgID]],$D36,WF_CKD_DATA[[#All],[Rel_D]],Locations!$E$17)","v":55},0.65476190476190477]
[null,null,"LL Medical Care (Agarwal & Agrwal Practice)","F86625","WF-5",{"$f":"SUMIFS(WF_CKD_DATA[[#All],[00-00]],WF_CKD_DATA[[#All],[OrgID]],$D37,WF_CKD_DATA[[#All],[Rel_D]],Locations!$E$17)","v":5880},{"$f":"SUMIFS(WF_CKD_DATA[[#All],[08-CKD]],WF_CKD_DATA[[#All],[OrgID]],$D37,WF_CKD_DATA[[#All],[Rel_D]],Locations!$E$17)","v":148},{"$f":"SUMIFS(WF_CKD_DATA[[#All],[NIS08-CKD01]],WF_CKD_DATA[[#All],[OrgID]],$D37,WF_CKD_DATA[[#All],[Rel_D]],Locations!$E$17)","v":129},0.8716216216216216,{"$f":"SUMIFS(WF_CKD_DATA[[#All],[NIS08-CKD02]],WF_CKD_DATA[[#All],[OrgID]],$D37,WF_CKD_DATA[[#All],[Rel_D]],Locations!$E$17)","v":76},0.51351351351351349,{"$f":"SUMIFS(WF_CKD_DATA[[#All],[NIS08-CKD03]],WF_CKD_DATA[[#All],[OrgID]],$D37,WF_CKD_DATA[[#All],[Rel_D]],Locations!$E$17)","v":112},0.7567567567567568,{"$f":"SUMIFS(WF_CKD_DATA[[#All],[NIS08-CKD04]],WF_CKD_DATA[[#All],[OrgID]],$D37,WF_CKD_DATA[[#All],[Rel_D]],Locations!$E$17)","v":47},0.31756756756756754]
[null,null,"The Harrow Road Surgery","F86666","WF-5",{"$f":"SUMIFS(WF_CKD_DATA[[#All],[00-00]],WF_CKD_DATA[[#All],[OrgID]],$D38,WF_CKD_DATA[[#All],[Rel_D]],Locations!$E$17)","v":14976},{"$f":"SUMIFS(WF_CKD_DATA[[#All],[08-CKD]],WF_CKD_DATA[[#All],[OrgID]],$D38,WF_CKD_DATA[[#All],[Rel_D]],Locations!$E$17)","v":263},{"$f":"SUMIFS(WF_CKD_DATA[[#All],[NIS08-CKD01]],WF_CKD_DATA[[#All],[OrgID]],$D38,WF_CKD_DATA[[#All],[Rel_D]],Locations!$E$17)","v":251},0.95437262357414454,{"$f":"SUMIFS(WF_CKD_DATA[[#All],[NIS08-CKD02]],WF_CKD_DATA[[#All],[OrgID]],$D38,WF_CKD_DATA[[#All],[Rel_D]],Locations!$E$17)","v":172},0.6539923954372624,{"$f":"SUMIFS(WF_CKD_DATA[[#All],[NIS08-CKD03]],WF_CKD_DATA[[#All],[OrgID]],$D38,WF_CKD_DATA[[#All],[Rel_D]],Locations!$E$17)","v":194},0.73764258555133078,{"$f":"SUMIFS(WF_CKD_DATA[[#All],[NIS08-CKD04]],WF_CKD_DATA[[#All],[OrgID]],$D38,WF_CKD_DATA[[#All],[Rel_D]],Locations!$E$17)","v":144},0.54752851711026618]
[null,null,"The Langthorne Sharma Family Practice","F86705","WF-5",{"$f":"SUMIFS(WF_CKD_DATA[[#All],[00-00]],WF_CKD_DATA[[#All],[OrgID]],$D39,WF_CKD_DATA[[#All],[Rel_D]],Locations!$E$17)","v":3507},{"$f":"SUMIFS(WF_CKD_DATA[[#All],[08-CKD]],WF_CKD_DATA[[#All],[OrgID]],$D39,WF_CKD_DATA[[#All],[Rel_D]],Locations!$E$17)","v":59},{"$f":"SUMIFS(WF_CKD_DATA[[#All],[NIS08-CKD01]],WF_CKD_DATA[[#All],[OrgID]],$D39,WF_CKD_DATA[[#All],[Rel_D]],Locations!$E$17)","v":54},0.9152542372881356,{"$f":"SUMIFS(WF_CKD_DATA[[#All],[NIS08-CKD02]],WF_CKD_DATA[[#All],[OrgID]],$D39,WF_CKD_DATA[[#All],[Rel_D]],Locations!$E$17)","v":35},0.59322033898305082,{"$f":"SUMIFS(WF_CKD_DATA[[#All],[NIS08-CKD03]],WF_CKD_DATA[[#All],[OrgID]],$D39,WF_CKD_DATA[[#All],[Rel_D]],Locations!$E$17)","v":42},0.71186440677966101,{"$f":"SUMIFS(WF_CKD_DATA[[#All],[NIS08-CKD04]],WF_CKD_DATA[[#All],[OrgID]],$D39,WF_CKD_DATA[[#All],[Rel_D]],Locations!$E$17)","v":19},0.32203389830508472]
[null,null,"South Leytonstone","WF-5","WF-5",{"$f":"SUM(F34:F39)","v":36685},{"$f":"SUM(G34:G39)","v":762},{"$f":"SUM(H34:H39)","v":697},0.91469816272965876,{"$f":"SUM(J34:J39)","v":459},{"$f":"J40/G40","v":0.60236220472440949},{"$f":"SUM(L34:L39)","v":595},{"$f":"L40/G40","v":0.78083989501312334},{"$f":"SUM(N34:N39)","v":352},{"$f":"N40/G40","v":0.46194225721784776}]
[null,null,"Addison Road Medical Practice","F86607","WF-6",{"$f":"SUMIFS(WF_CKD_DATA[[#All],[00-00]],WF_CKD_DATA[[#All],[OrgID]],$D41,WF_CKD_DATA[[#All],[Rel_D]],Locations!$E$17)","v":15518},{"$f":"SUMIFS(WF_CKD_DATA[[#All],[08-CKD]],WF_CKD_DATA[[#All],[OrgID]],$D41,WF_CKD_DATA[[#All],[Rel_D]],Locations!$E$17)","v":263},{"$f":"SUMIFS(WF_CKD_DATA[[#All],[NIS08-CKD01]],WF_CKD_DATA[[#All],[OrgID]],$D41,WF_CKD_DATA[[#All],[Rel_D]],Locations!$E$17)","v":238},0.90494296577946765,{"$f":"SUMIFS(WF_CKD_DATA[[#All],[NIS08-CKD02]],WF_CKD_DATA[[#All],[OrgID]],$D41,WF_CKD_DATA[[#All],[Rel_D]],Locations!$E$17)","v":138},0.52471482889733845,{"$f":"SUMIFS(WF_CKD_DATA[[#All],[NIS08-CKD03]],WF_CKD_DATA[[#All],[OrgID]],$D41,WF_CKD_DATA[[#All],[Rel_D]],Locations!$E$17)","v":202},{"$f":"L41/G41","v":0.76806083650190116},{"$f":"SUMIFS(WF_CKD_DATA[[#All],[NIS08-CKD04]],WF_CKD_DATA[[#All],[OrgID]],$D41,WF_CKD_DATA[[#All],[Rel_D]],Locations!$E$17)","v":130},0.49429657794676807]
[null,null,"Claremont Medical Centre","F86708","WF-6",{"$f":"SUMIFS(WF_CKD_DATA[[#All],[00-00]],WF_CKD_DATA[[#All],[OrgID]],$D42,WF_CKD_DATA[[#All],[Rel_D]],Locations!$E$17)","v":2782},{"$f":"SUMIFS(WF_CKD_DATA[[#All],[08-CKD]],WF_CKD_DATA[[#All],[OrgID]],$D42,WF_CKD_DATA[[#All],[Rel_D]],Locations!$E$17)","v":56},{"$f":"SUMIFS(WF_CKD_DATA[[#All],[NIS08-CKD01]],WF_CKD_DATA[[#All],[OrgID]],$D42,WF_CKD_DATA[[#All],[Rel_D]],Locations!$E$17)","v":52},0.9285714285714286,{"$f":"SUMIFS(WF_CKD_DATA[[#All],[NIS08-CKD02]],WF_CKD_DATA[[#All],[OrgID]],$D42,WF_CKD_DATA[[#All],[Rel_D]],Locations!$E$17)","v":30},0.5357142857142857,{"$f":"SUMIFS(WF_CKD_DATA[[#All],[NIS08-CKD03]],WF_CKD_DATA[[#All],[OrgID]],$D42,WF_CKD_DATA[[#All],[Rel_D]],Locations!$E$17)","v":42},{"$f":"L42/G42","v":0.75},{"$f":"SUMIFS(WF_CKD_DATA[[#All],[NIS08-CKD04]],WF_CKD_DATA[[#All],[OrgID]],$D42,WF_CKD_DATA[[#All],[Rel_D]],Locations!$E$17)","v":22},0.39285714285714285]
[null,null," The Firs","F86001","WF-6",{"$f":"SUMIFS(WF_CKD_DATA[[#All],[00-00]],WF_CKD_DATA[[#All],[OrgID]],$D43,WF_CKD_DATA[[#All],[Rel_D]],Locations!$E$17)","v":7727},{"$f":"SUMIFS(WF_CKD_DATA[[#All],[08-CKD]],WF_CKD_DATA[[#All],[OrgID]],$D43,WF_CKD_DATA[[#All],[Rel_D]],Locations!$E$17)","v":199},{"$f":"SUMIFS(WF_CKD_DATA[[#All],[NIS08-CKD01]],WF_CKD_DATA[[#All],[OrgID]],$D43,WF_CKD_DATA[[#All],[Rel_D]],Locations!$E$17)","v":179},0.89949748743718594,{"$f":"SUMIFS(WF_CKD_DATA[[#All],[NIS08-CKD02]],WF_CKD_DATA[[#All],[OrgID]],$D43,WF_CKD_DATA[[#All],[Rel_D]],Locations!$E$17)","v":98},0.49246231155778897,{"$f":"SUMIFS(WF_CKD_DATA[[#All],[NIS08-CKD03]],WF_CKD_DATA[[#All],[OrgID]],$D43,WF_CKD_DATA[[#All],[Rel_D]],Locations!$E$17)","v":126},0.63316582914572861,{"$f":"SUMIFS(WF_CKD_DATA[[#All],[NIS08-CKD04]],WF_CKD_DATA[[#All],[OrgID]],$D43,WF_CKD_DATA[[#All],[Rel_D]],Locations!$E$17)","v":42},0.21105527638190955]
[null,null,"Dr Dhital Practice","F86086","WF-6",{"$f":"SUMIFS(WF_CKD_DATA[[#All],[00-00]],WF_CKD_DATA[[#All],[OrgID]],$D44,WF_CKD_DATA[[#All],[Rel_D]],Locations!$E$17)","v":6237},{"$f":"SUMIFS(WF_CKD_DATA[[#All],[08-CKD]],WF_CKD_DATA[[#All],[OrgID]],$D44,WF_CKD_DATA[[#All],[Rel_D]],Locations!$E$17)","v":84},{"$f":"SUMIFS(WF_CKD_DATA[[#All],[NIS08-CKD01]],WF_CKD_DATA[[#All],[OrgID]],$D44,WF_CKD_DATA[[#All],[Rel_D]],Locations!$E$17)","v":63},0.75,{"$f":"SUMIFS(WF_CKD_DATA[[#All],[NIS08-CKD02]],WF_CKD_DATA[[#All],[OrgID]],$D44,WF_CKD_DATA[[#All],[Rel_D]],Locations!$E$17)","v":39},0.4642857142857143,{"$f":"SUMIFS(WF_CKD_DATA[[#All],[NIS08-CKD03]],WF_CKD_DATA[[#All],[OrgID]],$D44,WF_CKD_DATA[[#All],[Rel_D]],Locations!$E$17)","v":52},0.61904761904761907,{"$f":"SUMIFS(WF_CKD_DATA[[#All],[NIS08-CKD04]],WF_CKD_DATA[[#All],[OrgID]],$D44,WF_CKD_DATA[[#All],[Rel_D]],Locations!$E$17)","v":18},0.21428571428571427]
[null,null,"Waltham Forest Community & Family Health Services Ltd","F86644","WF-6",{"$f":"SUMIFS(WF_CKD_DATA[[#All],[00-00]],WF_CKD_DATA[[#All],[OrgID]],$D45,WF_CKD_DATA[[#All],[Rel_D]],Locations!$E$17)","v":9214},{"$f":"SUMIFS(WF_CKD_DATA[[#All],[08-CKD]],WF_CKD_DATA[[#All],[OrgID]],$D45,WF_CKD_DATA[[#All],[Rel_D]],Locations!$E$17)","v":217},{"$f":"SUMIFS(WF_CKD_DATA[[#All],[NIS08-CKD01]],WF_CKD_DATA[[#All],[OrgID]],$D45,WF_CKD_DATA[[#All],[Rel_D]],Locations!$E$17)","v":205},0.9447004608294931,{"$f":"SUMIFS(WF_CKD_DATA[[#All],[NIS08-CKD02]],WF_CKD_DATA[[#All],[OrgID]],$D45,WF_CKD_DATA[[#All],[Rel_D]],Locations!$E$17)","v":101},0.46543778801843316,{"$f":"SUMIFS(WF_CKD_DATA[[#All],[NIS08-CKD03]],WF_CKD_DATA[[#All],[OrgID]],$D45,WF_CKD_DATA[[#All],[Rel_D]],Locations!$E$17)","v":137},0.63133640552995396,{"$f":"SUMIFS(WF_CKD_DATA[[#All],[NIS08-CKD04]],WF_CKD_DATA[[#All],[OrgID]],$D45,WF_CKD_DATA[[#All],[Rel_D]],Locations!$E$17)","v":68},0.31336405529953915]
[null,null,"Central Walthamstow","WF-6","WF-6",{"$f":"SUM(F41:F45)","v":41478},{"$f":"SUM(G41:G45)","v":819},{"$f":"SUM(H41:H45)","v":737},0.8998778998778999,{"$f":"SUM(J41:J45)","v":406},0.49572649572649574,{"$f":"SUM(L41:L45)","v":559},{"$f":"L46/G46","v":0.68253968253968256},{"$f":"SUM(N41:N45)","v":280},{"$f":"N46/G46","v":0.34188034188034189}]
[null,null,"Seymour Medical Centre","F86006","WF-7",{"$f":"SUMIFS(WF_CKD_DATA[[#All],[00-00]],WF_CKD_DATA[[#All],[OrgID]],$D47,WF_CKD_DATA[[#All],[Rel_D]],Locations!$E$17)","v":6812},{"$f":"SUMIFS(WF_CKD_DATA[[#All],[08-CKD]],WF_CKD_DATA[[#All],[OrgID]],$D47,WF_CKD_DATA[[#All],[Rel_D]],Locations!$E$17)","v":144},{"$f":"SUMIFS(WF_CKD_DATA[[#All],[NIS08-CKD01]],WF_CKD_DATA[[#All],[OrgID]],$D47,WF_CKD_DATA[[#All],[Rel_D]],Locations!$E$17)","v":105},0.72916666666666663,{"$f":"SUMIFS(WF_CKD_DATA[[#All],[NIS08-CKD02]],WF_CKD_DATA[[#All],[OrgID]],$D47,WF_CKD_DATA[[#All],[Rel_D]],Locations!$E$17)","v":66},0.45833333333333331,{"$f":"SUMIFS(WF_CKD_DATA[[#All],[NIS08-CKD03]],WF_CKD_DATA[[#All],[OrgID]],$D47,WF_CKD_DATA[[#All],[Rel_D]],Locations!$E$17)","v":91},{"$f":"L47/G47","v":0.63194444444444442},{"$f":"SUMIFS(WF_CKD_DATA[[#All],[NIS08-CKD04]],WF_CKD_DATA[[#All],[OrgID]],$D47,WF_CKD_DATA[[#All],[Rel_D]],Locations!$E$17)","v":47},0.3263888888888889]
[null,null," Queens Road Medical Centre","F86030","WF-7",{"$f":"SUMIFS(WF_CKD_DATA[[#All],[00-00]],WF_CKD_DATA[[#All],[OrgID]],$D48,WF_CKD_DATA[[#All],[Rel_D]],Locations!$E$17)","v":8160},{"$f":"SUMIFS(WF_CKD_DATA[[#All],[08-CKD]],WF_CKD_DATA[[#All],[OrgID]],$D48,WF_CKD_DATA[[#All],[Rel_D]],Locations!$E$17)","v":165},{"$f":"SUMIFS(WF_CKD_DATA[[#All],[NIS08-CKD01]],WF_CKD_DATA[[#All],[OrgID]],$D48,WF_CKD_DATA[[#All],[Rel_D]],Locations!$E$17)","v":140},0.84848484848484851,{"$f":"SUMIFS(WF_CKD_DATA[[#All],[NIS08-CKD02]],WF_CKD_DATA[[#All],[OrgID]],$D48,WF_CKD_DATA[[#All],[Rel_D]],Locations!$E$17)","v":106},0.64242424242424245,{"$f":"SUMIFS(WF_CKD_DATA[[#All],[NIS08-CKD03]],WF_CKD_DATA[[#All],[OrgID]],$D48,WF_CKD_DATA[[#All],[Rel_D]],Locations!$E$17)","v":129},{"$f":"L48/G48","v":0.78181818181818186},{"$f":"SUMIFS(WF_CKD_DATA[[#All],[NIS08-CKD04]],WF_CKD_DATA[[#All],[OrgID]],$D48,WF_CKD_DATA[[#All],[Rel_D]],Locations!$E$17)","v":87},0.52727272727272723]
[null,null,"Grove Surgery","F86062","WF-7",{"$f":"SUMIFS(WF_CKD_DATA[[#All],[00-00]],WF_CKD_DATA[[#All],[OrgID]],$D49,WF_CKD_DATA[[#All],[Rel_D]],Locations!$E$17)","v":7155},{"$f":"SUMIFS(WF_CKD_DATA[[#All],[08-CKD]],WF_CKD_DATA[[#All],[OrgID]],$D49,WF_CKD_DATA[[#All],[Rel_D]],Locations!$E$17)","v":142},{"$f":"SUMIFS(WF_CKD_DATA[[#All],[NIS08-CKD01]],WF_CKD_DATA[[#All],[OrgID]],$D49,WF_CKD_DATA[[#All],[Rel_D]],Locations!$E$17)","v":102},0.71830985915492962,{"$f":"SUMIFS(WF_CKD_DATA[[#All],[NIS08-CKD02]],WF_CKD_DATA[[#All],[OrgID]],$D49,WF_CKD_DATA[[#All],[Rel_D]],Locations!$E$17)","v":63},0.44366197183098594,{"$f":"SUMIFS(WF_CKD_DATA[[#All],[NIS08-CKD03]],WF_CKD_DATA[[#All],[OrgID]],$D49,WF_CKD_DATA[[#All],[Rel_D]],Locations!$E$17)","v":114},0.80281690140845074,{"$f":"SUMIFS(WF_CKD_DATA[[#All],[NIS08-CKD04]],WF_CKD_DATA[[#All],[OrgID]],$D49,WF_CKD_DATA[[#All],[Rel_D]],Locations!$E$17)","v":64},0.45070422535211269]
[null,null,"Higham Hill Medical Centre","F86679","WF-7",{"$f":"SUMIFS(WF_CKD_DATA[[#All],[00-00]],WF_CKD_DATA[[#All],[OrgID]],$D50,WF_CKD_DATA[[#All],[Rel_D]],Locations!$E$17)","v":6371},{"$f":"SUMIFS(WF_CKD_DATA[[#All],[08-CKD]],WF_CKD_DATA[[#All],[OrgID]],$D50,WF_CKD_DATA[[#All],[Rel_D]],Locations!$E$17)","v":74},{"$f":"SUMIFS(WF_CKD_DATA[[#All],[NIS08-CKD01]],WF_CKD_DATA[[#All],[OrgID]],$D50,WF_CKD_DATA[[#All],[Rel_D]],Locations!$E$17)","v":67},0.90540540540540537,{"$f":"SUMIFS(WF_CKD_DATA[[#All],[NIS08-CKD02]],WF_CKD_DATA[[#All],[OrgID]],$D50,WF_CKD_DATA[[#All],[Rel_D]],Locations!$E$17)","v":51},0.68918918918918914,{"$f":"SUMIFS(WF_CKD_DATA[[#All],[NIS08-CKD03]],WF_CKD_DATA[[#All],[OrgID]],$D50,WF_CKD_DATA[[#All],[Rel_D]],Locations!$E$17)","v":58},0.78378378378378377,{"$f":"SUMIFS(WF_CKD_DATA[[#All],[NIS08-CKD04]],WF_CKD_DATA[[#All],[OrgID]],$D50,WF_CKD_DATA[[#All],[Rel_D]],Locations!$E$17)","v":27},0.36486486486486486]
[null,null,"St James Medical Practice Ltd","F86058","WF-7",{"$f":"SUMIFS(WF_CKD_DATA[[#All],[00-00]],WF_CKD_DATA[[#All],[OrgID]],$D51,WF_CKD_DATA[[#All],[Rel_D]],Locations!$E$17)","v":16560},{"$f":"SUMIFS(WF_CKD_DATA[[#All],[08-CKD]],WF_CKD_DATA[[#All],[OrgID]],$D51,WF_CKD_DATA[[#All],[Rel_D]],Locations!$E$17)","v":236},{"$f":"SUMIFS(WF_CKD_DATA[[#All],[NIS08-CKD01]],WF_CKD_DATA[[#All],[OrgID]],$D51,WF_CKD_DATA[[#All],[Rel_D]],Locations!$E$17)","v":200},0.84745762711864403,{"$f":"SUMIFS(WF_CKD_DATA[[#All],[NIS08-CKD02]],WF_CKD_DATA[[#All],[OrgID]],$D51,WF_CKD_DATA[[#All],[Rel_D]],Locations!$E$17)","v":162},0.68644067796610164,{"$f":"SUMIFS(WF_CKD_DATA[[#All],[NIS08-CKD03]],WF_CKD_DATA[[#All],[OrgID]],$D51,WF_CKD_DATA[[#All],[Rel_D]],Locations!$E$17)","v":178},0.75423728813559321,{"$f":"SUMIFS(WF_CKD_DATA[[#All],[NIS08-CKD04]],WF_CKD_DATA[[#All],[OrgID]],$D51,WF_CKD_DATA[[#All],[Rel_D]],Locations!$E$17)","v":113},0.4788135593220339]
[null,null,"Walthamstow West","WF-7","WF-7",{"$f":"SUM(F47:F51)","v":45058},{"$f":"SUM(G47:G51)","v":761},{"$f":"SUM(H47:H51)","v":614},0.80683311432325888,{"$f":"SUM(J47:J51)","v":448},0.58869908015768724,{"$f":"SUM(L47:L51)","v":570},0.74901445466491456,{"$f":"SUM(N47:N51)","v":338},{"$f":"N52/G52","v":0.44415243101182655}]
[null,null,null,"Total",null,{"$f":"SUM(F15,F21,F25, F33, F40, F46, F52)","v":323029},{"$f":"SUM(G15,G21,G25, G33, G40, G46, G52)","v":8222},{"$f":"SUM(H15,H21,H25, H33, H40, H46, H52)","v":6643},0.80795426903429823,{"$f":"SUM(J15,J21,J25, J33, J40, J46, J52)","v":4457},{"$f":"J53/G53","v":0.54208221843833615},{"$f":"SUM(L15,L21,L25, L33, L40, L46, L52)","v":5512},{"$f":"L53/G53","v":0.67039649720262706},{"$f":"SUM(N15,N21,N25, N33, N40, N46, N52)","v":2153},0.26185842860617853]
[null,null,null,"Min Aim",null,null,null,null,null,null,{"$f":"VLOOKUP(J$3,TRENDS!$B$17:$C$19,2,0)","v":0.5},null,{"$f":"VLOOKUP(L$3,TRENDS!$B$17:$C$19,2,0)","v":0.5},null,{"$f":"VLOOKUP(N$3,TRENDS!$B$17:$C$19,2,0)","v":0.5}]
[null,null,null,null,null,null,null,null,{"$f":"VLOOKUP(I$3,INDIRECT(Locations!$B$39),6,0)","v":0},null,{"$f":"VLOOKUP(K$3,INDIRECT(Locations!$B$39),6,0)","v":0},null,{"$f":"VLOOKUP(L$3,INDIRECT(Locations!$B$39),6,0)","v":0}]
[null,null,"CKD v9.0","Target: % of evidence of CKD to have BP below 140/90 by 31/3/2020",null,null,null,"Target: % of evidence of CKD to be prescribed Statins by 31/03/2020",null,null,null,"Target: % of evidence of CKD to have ACR by 31/03/2020"]
[null,null,"Red -","Below 30%",null,null,null,"Red -","Below 30%",null,null,"Red -","Below 30%"]
[null,null,"Brown","Between 30% - 39%",null,null,null,"Brown","Between 30% - 39%",null,null,"Brown","Between 30% - 39%"]
[null,null,"Amber -","Between 40% - 49%",null,null,null,"Amber -","Between 40% - 49%",null,null,"Amber -","Between 40% - 49%"]
[null,null,"Green -","50% - 100% ",null,null,null,"Green -","50% - 100% ",null,null,"Green -","50% - 100% "]
[]
[null,null,null,"**","SystmOne practices : No data available for  evidnce of CKD to have ACR (01/04/2020 - 01/06/2020)"]

{"sheet":"TRENDS","index":4,"n_rows":64,"n_cols":31,"rows_kept":64,"cut":false,"hidden":true,"merged":[[14,0,14,2]]}
["Practice Trend: Trend Chart"]
[{"$f":"B2&\"%\"","v":"NIS08-CKD04%"},{"$f":"CHART!C1","v":"NIS08-CKD04"},{"$f":"Locations!E21","v":"01/04/2022"}]
["Practice","NACS","Locality",null,"Listsize","2021-04-01","2021-05-01","2021-06-01","2021-07-01","2021-08-01","2021-09-01","2021-10-01","2021-11-01","2021-12-01","2022-01-01","2022-02-01","2022-03-01","2022-04-01"]
[{"$f":"PRACTICE!E1","v":"The Microfaculty **"},{"$f":"PRACTICE!E2","v":"F86638"},{"$f":"PRACTICE!E5","v":"WF-1"},null,null,{"$f":"IF(TEXT(F3,0)<=TEXT($C$2,0),VLOOKUP(F3,$E$13:$H$25,3,0)/VLOOKUP(F3,$E$13:$H$25,2,0),#N/A)","v":{"$error":"#N/A"}},{"$error":"#N/A"},{"$error":"#N/A"},{"$error":"#N/A"},{"$error":"#N/A"},{"$error":"#N/A"},0.46570397111913359,0.35272727272727272,0.31636363636363635,0.32472324723247231,0.32600732600732601,{"$f":"IF(TEXT(Q3,0)<=TEXT($C$2,0),VLOOKUP(Q3,$E$13:$H$25,3,0)/VLOOKUP(Q3,$E$13:$H$25,2,0),#N/A)","v":0.32222222222222224},{"$error":"#N/A"}]
["Target",null,null,null,null,{"$f":"VLOOKUP($B$2,$B$16:$C$19,2)","v":0.5},{"$f":"VLOOKUP($B$2,$B$16:$C$19,2)","v":0.5},0.5,0.5,0.5,0.5,0.5,0.5,0.5,0.5,0.5,0.5,0.5]
[]
["Selected"]
["OrgID"]
[]
[null,null,null,null,null,null,null,null,null,null,null,null,null,null,null,null,null,null,null,null,"Practices","OrgID","[08-CKD]","NIS08-CKD01","NIS08-CKD01%","NIS08-CKD02","NIS08-CKD02%","NIS08-CKD03","NIS08-CKD03%","NIS08-CKD04","NIS08-CKD04%"]
[null,null,null,null,null,null,null,null,null,null,null,null,null,null,null,null,null,null,null,null,"Kings Head Medical Practice","F86700",{"$f":"SUMIFS(WF_CKD_DATA[[#All],[08-CKD]],WF_CKD_DATA[[#All],[OrgID]],V11,WF_CKD_DATA[[#All],[Rel_D]],Locations!$E$17)","v":172},{"$f":"SUMIFS(WF_CKD_DATA[[#All],[NIS08-CKD01]],WF_CKD_DATA[[#All],[OrgID]],V11,WF_CKD_DATA[[#All],[Rel_D]],Locations!$E$17)","v":172},{"$f":"X11/W11","v":1},{"$f":"SUMIFS(WF_CKD_DATA[[#All],[NIS08-CKD02]],WF_CKD_DATA[[#All],[OrgID]],V11,WF_CKD_DATA[[#All],[Rel_D]],Locations!$E$17)","v":124},{"$f":"IFERROR(Z11/W11,\"-\")","v":0.72093023255813948},{"$f":"SUMIFS(WF_CKD_DATA[[#All],[NIS08-CKD03]],WF_CKD_DATA[[#All],[OrgID]],V11,WF_CKD_DATA[[#All],[Rel_D]],Locations!$E$17)","v":115},{"$f":"IFERROR(AB11/W11,\"-\")","v":0.66860465116279066},{"$f":"SUMIFS(WF_CKD_DATA[[#All],[NIS08-CKD04]],WF_CKD_DATA[[#All],[OrgID]],V11,WF_CKD_DATA[[#All],[Rel_D]],Locations!$E$17)","v":49},{"$f":"IFERROR(AD11/W11, \"-\")","v":0.28488372093023256}]
[null,null,null,null,"Date","Denominator","Numerator ",null,null,null,null,null,null,null,null,null,null,null,null,null,"Larkshall Medical Centre","F86664",{"$f":"SUMIFS(WF_CKD_DATA[[#All],[08-CKD]],WF_CKD_DATA[[#All],[OrgID]],V12,WF_CKD_DATA[[#All],[Rel_D]],Locations!$E$17)","v":209},{"$f":"SUMIFS(WF_CKD_DATA[[#All],[NIS08-CKD01]],WF_CKD_DATA[[#All],[OrgID]],V12,WF_CKD_DATA[[#All],[Rel_D]],Locations!$E$17)","v":165},{"$f":"X12/W12","v":0.78947368421052633},{"$f":"SUMIFS(WF_CKD_DATA[[#All],[NIS08-CKD02]],WF_CKD_DATA[[#All],[OrgID]],V12,WF_CKD_DATA[[#All],[Rel_D]],Locations!$E$17)","v":105},{"$f":"IFERROR(Z12/W12,\"-\")","v":0.50239234449760761},{"$f":"SUMIFS(WF_CKD_DATA[[#All],[NIS08-CKD03]],WF_CKD_DATA[[#All],[OrgID]],V12,WF_CKD_DATA[[#All],[Rel_D]],Locations!$E$17)","v":148},{"$f":"IFERROR(AB12/W12,\"-\")","v":0.70813397129186606},{"$f":"SUMIFS(WF_CKD_DATA[[#All],[NIS08-CKD04]],WF_CKD_DATA[[#All],[OrgID]],V12,WF_CKD_DATA[[#All],[Rel_D]],Locations!$E$17)","v":38},{"$f":"IFERROR(AD12/W12, \"-\")","v":0.18181818181818182}]
[null,null,null,null,"2021-04-01",{"$f":"IF(SUMIFS(WF_CKD_DATA[[#All],[08-CKD]],WF_CKD_DATA[[#All],[OrgID]],$B$4,WF_CKD_DATA[[#All],[Rel_D]],E13)=0,#N/A,(SUMIFS(WF_CKD_DATA[[#All],[08-CKD]],WF_CKD_DATA[[#All],[OrgID]],$B$4,WF_CKD_DATA[[#All],[Rel_D]],E13)))","v":{"$error":"#N/A"}},{"$f":"IF(SUMIFS(INDIRECT(\"WF_CKD_DATA[[#All],[\"&$B$2&\"]]\"),WF_CKD_DATA[[#All],[OrgID]],$B$4,WF_CKD_DATA[[#All],[Rel_D]],TRENDS!E13)=0,#N/A,(SUMIFS(INDIRECT(\"WF_CKD_DATA[[#All],[\"&$B$2&\"]]\"),WF_CKD_DATA[[#All],[OrgID]],$B$4,WF_CKD_DATA[[#All],[Rel_D]],TRENDS!E13)))","v":{"$error":"#N/A"}},{"$f":"SUMIFS(INDIRECT(\"WF_CKD_DATA[[#All],[\"&$B$2&\"]]\"),#REF!,$B$4,#REF!,TRENDS!C13)","v":{"$error":"#REF!"}},null,null,null,null,null,null,null,null,null,null,null,null,"The Microfaculty","F86638",{"$f":"SUMIFS(WF_CKD_DATA[[#All],[08-CKD]],WF_CKD_DATA[[#All],[OrgID]],V13,WF_CKD_DATA[[#All],[Rel_D]],Locations!$E$17)","v":275},{"$f":"SUMIFS(WF_CKD_DATA[[#All],[NIS08-CKD01]],WF_CKD_DATA[[#All],[OrgID]],V13,WF_CKD_DATA[[#All],[Rel_D]],Locations!$E$17)","v":204},{"$f":"IFERROR(X13/W13,\"-\")","v":0.74181818181818182},{"$f":"SUMIFS(WF_CKD_DATA[[#All],[NIS08-CKD02]],WF_CKD_DATA[[#All],[OrgID]],V13,WF_CKD_DATA[[#All],[Rel_D]],Locations!$E$17)","v":144},0.52363636363636368,{"$f":"SUMIFS(WF_CKD_DATA[[#All],[NIS08-CKD03]],WF_CKD_DATA[[#All],[OrgID]],V13,WF_CKD_DATA[[#All],[Rel_D]],Locations!$E$17)","v":180},{"$f":"IFERROR(AB13/W13,\"-\")","v":0.65454545454545454},{"$f":"SUMIFS(WF_CKD_DATA[[#All],[NIS08-CKD04]],WF_CKD_DATA[[#All],[OrgID]],V13,WF_CKD_DATA[[#All],[Rel_D]],Locations!$E$17)","v":0},0]
[null,null,null,null,"2021-05-01",{"$f":"IF(SUMIFS(WF_CKD_DATA[[#All],[08-CKD]],WF_CKD_DATA[[#All],[OrgID]],$B$4,WF_CKD_DATA[[#All],[Rel_D]],E14)=0,#N/A,(SUMIFS(WF_CKD_DATA[[#All],[08-CKD]],WF_CKD_DATA[[#All],[OrgID]],$B$4,WF_CKD_DATA[[#All],[Rel_D]],E14)))","v":{"$error":"#N/A"}},{"$f":"IF(SUMIFS(INDIRECT(\"WF_CKD_DATA[[#All],[\"&$B$2&\"]]\"),WF_CKD_DATA[[#All],[OrgID]],$B$4,WF_CKD_DATA[[#All],[Rel_D]],TRENDS!E14)=0,#N/A,(SUMIFS(INDIRECT(\"WF_CKD_DATA[[#All],[\"&$B$2&\"]]\"),WF_CKD_DATA[[#All],[OrgID]],$B$4,WF_CKD_DATA[[#All],[Rel_D]],TRENDS!E14)))","v":{"$error":"#N/A"}},{"$f":"SUMIFS(INDIRECT(\"WF_CKD_DATA[[#All],[\"&$B$2&\"]]\"),#REF!,$B$4,#REF!,TRENDS!C14)","v":{"$error":"#REF!"}},null,null,null,null,null,null,null,null,null,null,null,null," The Penryhn Surgery","F86005",{"$f":"SUMIFS(WF_CKD_DATA[[#All],[08-CKD]],WF_CKD_DATA[[#All],[OrgID]],V14,WF_CKD_DATA[[#All],[Rel_D]],Locations!$E$17)","v":185},{"$f":"SUMIFS(WF_CKD_DATA[[#All],[NIS08-CKD01]],WF_CKD_DATA[[#All],[OrgID]],V14,WF_CKD_DATA[[#All],[Rel_D]],Locations!$E$17)","v":171},0.92432432432432432,{"$f":"SUMIFS(WF_CKD_DATA[[#All],[NIS08-CKD02]],WF_CKD_DATA[[#All],[OrgID]],V14,WF_CKD_DATA[[#All],[Rel_D]],Locations!$E$17)","v":90},0.48648648648648651,{"$f":"SUMIFS(WF_CKD_DATA[[#All],[NIS08-CKD03]],WF_CKD_DATA[[#All],[OrgID]],V14,WF_CKD_DATA[[#All],[Rel_D]],Locations!$E$17)","v":124},0.67027027027027031,{"$f":"SUMIFS(WF_CKD_DATA[[#All],[NIS08-CKD04]],WF_CKD_DATA[[#All],[OrgID]],V14,WF_CKD_DATA[[#All],[Rel_D]],Locations!$E$17)","v":52},0.2810810810810811]
["Target table ",null,null,null,"2021-06-01",{"$f":"IF(SUMIFS(WF_CKD_DATA[[#All],[08-CKD]],WF_CKD_DATA[[#All],[OrgID]],$B$4,WF_CKD_DATA[[#All],[Rel_D]],E15)=0,#N/A,(SUMIFS(WF_CKD_DATA[[#All],[08-CKD]],WF_CKD_DATA[[#All],[OrgID]],$B$4,WF_CKD_DATA[[#All],[Rel_D]],E15)))","v":{"$error":"#N/A"}},{"$f":"IF(SUMIFS(INDIRECT(\"WF_CKD_DATA[[#All],[\"&$B$2&\"]]\"),WF_CKD_DATA[[#All],[OrgID]],$B$4,WF_CKD_DATA[[#All],[Rel_D]],TRENDS!E15)=0,#N/A,(SUMIFS(INDIRECT(\"WF_CKD_DATA[[#All],[\"&$B$2&\"]]\"),WF_CKD_DATA[[#All],[OrgID]],$B$4,WF_CKD_DATA[[#All],[Rel_D]],TRENDS!E15)))","v":{"$error":"#N/A"}},{"$f":"SUMIFS(INDIRECT(\"WF_CKD_DATA[[#All],[\"&$B$2&\"]]\"),#REF!,$B$4,#REF!,TRENDS!C15)","v":{"$error":"#REF!"}},null,null,null,null,null,null,null,null,null,null,null,null,"Dr Shantir Practice","F86626",{"$f":"SUMIFS(WF_CKD_DATA[[#All],[08-CKD]],WF_CKD_DATA[[#All],[OrgID]],V15,WF_CKD_DATA[[#All],[Rel_D]],Locations!$E$17)","v":103},{"$f":"SUMIFS(WF_CKD_DATA[[#All],[NIS08-CKD01]],WF_CKD_DATA[[#All],[OrgID]],V15,WF_CKD_DATA[[#All],[Rel_D]],Locations!$E$17)","v":86},0.83495145631067957,{"$f":"SUMIFS(WF_CKD_DATA[[#All],[NIS08-CKD02]],WF_CKD_DATA[[#All],[OrgID]],V15,WF_CKD_DATA[[#All],[Rel_D]],Locations!$E$17)","v":47},0.4563106796116505,{"$f":"SUMIFS(WF_CKD_DATA[[#All],[NIS08-CKD03]],WF_CKD_DATA[[#All],[OrgID]],V15,WF_CKD_DATA[[#All],[Rel_D]],Locations!$E$17)","v":64},0.62135922330097082,{"$f":"SUMIFS(WF_CKD_DATA[[#All],[NIS08-CKD04]],WF_CKD_DATA[[#All],[OrgID]],V15,WF_CKD_DATA[[#All],[Rel_D]],Locations!$E$17)","v":20},0.1941747572815534]
[null,null,"Targets",null,"2021-07-01",{"$f":"IF(SUMIFS(WF_CKD_DATA[[#All],[08-CKD]],WF_CKD_DATA[[#All],[OrgID]],$B$4,WF_CKD_DATA[[#All],[Rel_D]],E16)=0,#N/A,(SUMIFS(WF_CKD_DATA[[#All],[08-CKD]],WF_CKD_DATA[[#All],[OrgID]],$B$4,WF_CKD_DATA[[#All],[Rel_D]],E16)))","v":{"$error":"#N/A"}},{"$f":"IF(SUMIFS(INDIRECT(\"WF_CKD_DATA[[#All],[\"&$B$2&\"]]\"),WF_CKD_DATA[[#All],[OrgID]],$B$4,WF_CKD_DATA[[#All],[Rel_D]],TRENDS!E16)=0,#N/A,(SUMIFS(INDIRECT(\"WF_CKD_DATA[[#All],[\"&$B$2&\"]]\"),WF_CKD_DATA[[#All],[OrgID]],$B$4,WF_CKD_DATA[[#All],[Rel_D]],TRENDS!E16)))","v":{"$error":"#N/A"}},{"$f":"SUMIFS(INDIRECT(\"WF_CKD_DATA[[#All],[\"&$B$2&\"]]\"),#REF!,$B$4,#REF!,TRENDS!C16)","v":{"$error":"#REF!"}},null,null,null,null,null,null,null,null,null,null,null,null,"Lime Tree & Sinnott Healthcare Ltd","Y01839",{"$f":"SUMIFS(WF_CKD_DATA[[#All],[08-CKD]],WF_CKD_DATA[[#All],[OrgID]],V16,WF_CKD_DATA[[#All],[Rel_D]],Locations!$E$17)","v":151},{"$f":"SUMIFS(WF_CKD_DATA[[#All],[NIS08-CKD01]],WF_CKD_DATA[[#All],[OrgID]],V16,WF_CKD_DATA[[#All],[Rel_D]],Locations!$E$17)","v":129},0.85430463576158944,{"$f":"SUMIFS(WF_CKD_DATA[[#All],[NIS08-CKD02]],WF_CKD_DATA[[#All],[OrgID]],V16,WF_CKD_DATA[[#All],[Rel_D]],Locations!$E$17)","v":70},0.46357615894039733,{"$f":"SUMIFS(WF_CKD_DATA[[#All],[NIS08-CKD03]],WF_CKD_DATA[[#All],[OrgID]],V16,WF_CKD_DATA[[#All],[Rel_D]],Locations!$E$17)","v":111},0.73509933774834435,{"$f":"SUMIFS(WF_CKD_DATA[[#All],[NIS08-CKD04]],WF_CKD_DATA[[#All],[OrgID]],V16,WF_CKD_DATA[[#All],[Rel_D]],Locations!$E$17)","v":41},0.27152317880794702]
["evidence of CKD with BP below 140/90","NIS08-CKD02",0.5,null,"2021-08-01",{"$f":"IF(SUMIFS(WF_CKD_DATA[[#All],[08-CKD]],WF_CKD_DATA[[#All],[OrgID]],$B$4,WF_CKD_DATA[[#All],[Rel_D]],E17)=0,#N/A,(SUMIFS(WF_CKD_DATA[[#All],[08-CKD]],WF_CKD_DATA[[#All],[OrgID]],$B$4,WF_CKD_DATA[[#All],[Rel_D]],E17)))","v":{"$error":"#N/A"}},{"$f":"IF(SUMIFS(INDIRECT(\"WF_CKD_DATA[[#All],[\"&$B$2&\"]]\"),WF_CKD_DATA[[#All],[OrgID]],$B$4,WF_CKD_DATA[[#All],[Rel_D]],TRENDS!E17)=0,#N/A,(SUMIFS(INDIRECT(\"WF_CKD_DATA[[#All],[\"&$B$2&\"]]\"),WF_CKD_DATA[[#All],[OrgID]],$B$4,WF_CKD_DATA[[#All],[Rel_D]],TRENDS!E17)))","v":{"$error":"#N/A"}},{"$f":"SUMIFS(INDIRECT(\"WF_CKD_DATA[[#All],[\"&$B$2&\"]]\"),#REF!,$B$4,#REF!,TRENDS!C17)","v":{"$error":"#REF!"}},null,null,null,null,null,null,null,null,null,null,null,null,"The Bailey Practice","F86689",{"$f":"SUMIFS(WF_CKD_DATA[[#All],[08-CKD]],WF_CKD_DATA[[#All],[OrgID]],V17,WF_CKD_DATA[[#All],[Rel_D]],Locations!$E$17)","v":82},{"$f":"SUMIFS(WF_CKD_DATA[[#All],[NIS08-CKD01]],WF_CKD_DATA[[#All],[OrgID]],V17,WF_CKD_DATA[[#All],[Rel_D]],Locations!$E$17)","v":70},0.85365853658536583,{"$f":"SUMIFS(WF_CKD_DATA[[#All],[NIS08-CKD02]],WF_CKD_DATA[[#All],[OrgID]],V17,WF_CKD_DATA[[#All],[Rel_D]],Locations!$E$17)","v":41},0.5,{"$f":"SUMIFS(WF_CKD_DATA[[#All],[NIS08-CKD03]],WF_CKD_DATA[[#All],[OrgID]],V17,WF_CKD_DATA[[#All],[Rel_D]],Locations!$E$17)","v":56},0.68292682926829273,{"$f":"SUMIFS(WF_CKD_DATA[[#All],[NIS08-CKD04]],WF_CKD_DATA[[#All],[OrgID]],V17,WF_CKD_DATA[[#All],[Rel_D]],Locations!$E$17)","v":14},0.17073170731707318]
["evidence of CKD on Statins","NIS08-CKD03",0.5,null,"2021-09-01",{"$f":"IF(SUMIFS(WF_CKD_DATA[[#All],[08-CKD]],WF_CKD_DATA[[#All],[OrgID]],$B$4,WF_CKD_DATA[[#All],[Rel_D]],E18)=0,#N/A,(SUMIFS(WF_CKD_DATA[[#All],[08-CKD]],WF_CKD_DATA[[#All],[OrgID]],$B$4,WF_CKD_DATA[[#All],[Rel_D]],E18)))","v":{"$error":"#N/A"}},{"$f":"IF(SUMIFS(INDIRECT(\"WF_CKD_DATA[[#All],[\"&$B$2&\"]]\"),WF_CKD_DATA[[#All],[OrgID]],$B$4,WF_CKD_DATA[[#All],[Rel_D]],TRENDS!E18)=0,#N/A,(SUMIFS(INDIRECT(\"WF_CKD_DATA[[#All],[\"&$B$2&\"]]\"),WF_CKD_DATA[[#All],[OrgID]],$B$4,WF_CKD_DATA[[#All],[Rel_D]],TRENDS!E18)))","v":{"$error":"#N/A"}},{"$f":"SUMIFS(INDIRECT(\"WF_CKD_DATA[[#All],[\"&$B$2&\"]]\"),#REF!,$B$4,#REF!,TRENDS!C18)","v":{"$error":"#REF!"}},null,null,null,null,null,null,null,null,null,null,null,null,"Forest Surgery","F86026",{"$f":"SUMIFS(WF_CKD_DATA[[#All],[08-CKD]],WF_CKD_DATA[[#All],[OrgID]],V18,WF_CKD_DATA[[#All],[Rel_D]],Locations!$E$17)","v":276},{"$f":"SUMIFS(WF_CKD_DATA[[#All],[NIS08-CKD01]],WF_CKD_DATA[[#All],[OrgID]],V18,WF_CKD_DATA[[#All],[Rel_D]],Locations!$E$17)","v":194},{"$f":"IFERROR(X18/W18,\"-\")","v":0.70289855072463769},{"$f":"SUMIFS(WF_CKD_DATA[[#All],[NIS08-CKD02]],WF_CKD_DATA[[#All],[OrgID]],V18,WF_CKD_DATA[[#All],[Rel_D]],Locations!$E$17)","v":166},0.60144927536231885,{"$f":"SUMIFS(WF_CKD_DATA[[#All],[NIS08-CKD03]],WF_CKD_DATA[[#All],[OrgID]],V18,WF_CKD_DATA[[#All],[Rel_D]],Locations!$E$17)","v":157},0.5688405797101449,{"$f":"SUMIFS(WF_CKD_DATA[[#All],[NIS08-CKD04]],WF_CKD_DATA[[#All],[OrgID]],V18,WF_CKD_DATA[[#All],[Rel_D]],Locations!$E$17)","v":0},0]
["evidence of CKD with ACR","NIS08-CKD04",0.5,null,"2021-10-01",{"$f":"IF(SUMIFS(WF_CKD_DATA[[#All],[08-CKD]],WF_CKD_DATA[[#All],[OrgID]],$B$4,WF_CKD_DATA[[#All],[Rel_D]],E19)=0,#N/A,(SUMIFS(WF_CKD_DATA[[#All],[08-CKD]],WF_CKD_DATA[[#All],[OrgID]],$B$4,WF_CKD_DATA[[#All],[Rel_D]],E19)))","v":277},{"$f":"IF(SUMIFS(INDIRECT(\"WF_CKD_DATA[[#All],[\"&$B$2&\"]]\"),WF_CKD_DATA[[#All],[OrgID]],$B$4,WF_CKD_DATA[[#All],[Rel_D]],TRENDS!E19)=0,#N/A,(SUMIFS(INDIRECT(\"WF_CKD_DATA[[#All],[\"&$B$2&\"]]\"),WF_CKD_DATA[[#All],[OrgID]],$B$4,WF_CKD_DATA[[#All],[Rel_D]],TRENDS!E19)))","v":129},{"$f":"SUMIFS(INDIRECT(\"WF_CKD_DATA[[#All],[\"&$B$2&\"]]\"),#REF!,$B$4,#REF!,TRENDS!C19)","v":{"$error":"#REF!"}},null,null,null,null,null,null,null,null,null,null,null,null,"Handsworth Medical Centre","F86004",{"$f":"SUMIFS(WF_CKD_DATA[[#All],[08-CKD]],WF_CKD_DATA[[#All],[OrgID]],V19,WF_CKD_DATA[[#All],[Rel_D]],Locations!$E$17)","v":809},{"$f":"SUMIFS(WF_CKD_DATA[[#All],[NIS08-CKD01]],WF_CKD_DATA[[#All],[OrgID]],V19,WF_CKD_DATA[[#All],[Rel_D]],Locations!$E$17)","v":570},{"$f":"IFERROR(X19/W19,\"-\")","v":0.70457354758961677},{"$f":"SUMIFS(WF_CKD_DATA[[#All],[NIS08-CKD02]],WF_CKD_DATA[[#All],[OrgID]],V19,WF_CKD_DATA[[#All],[Rel_D]],Locations!$E$17)","v":410},0.50679851668726827,{"$f":"SUMIFS(WF_CKD_DATA[[#All],[NIS08-CKD03]],WF_CKD_DATA[[#All],[OrgID]],V19,WF_CKD_DATA[[#All],[Rel_D]],Locations!$E$17)","v":456},0.56365883807169348,{"$f":"SUMIFS(WF_CKD_DATA[[#All],[NIS08-CKD04]],WF_CKD_DATA[[#All],[OrgID]],V19,WF_CKD_DATA[[#All],[Rel_D]],Locations!$E$17)","v":0},0]
[null,null,null,null,"2021-11-01",{"$f":"IF(SUMIFS(WF_CKD_DATA[[#All],[08-CKD]],WF_CKD_DATA[[#All],[OrgID]],$B$4,WF_CKD_DATA[[#All],[Rel_D]],E20)=0,#N/A,(SUMIFS(WF_CKD_DATA[[#All],[08-CKD]],WF_CKD_DATA[[#All],[OrgID]],$B$4,WF_CKD_DATA[[#All],[Rel_D]],E20)))","v":275},{"$f":"IF(SUMIFS(INDIRECT(\"WF_CKD_DATA[[#All],[\"&$B$2&\"]]\"),WF_CKD_DATA[[#All],[OrgID]],$B$4,WF_CKD_DATA[[#All],[Rel_D]],TRENDS!E20)=0,#N/A,(SUMIFS(INDIRECT(\"WF_CKD_DATA[[#All],[\"&$B$2&\"]]\"),WF_CKD_DATA[[#All],[OrgID]],$B$4,WF_CKD_DATA[[#All],[Rel_D]],TRENDS!E20)))","v":97},{"$f":"SUMIFS(INDIRECT(\"WF_CKD_DATA[[#All],[\"&$B$2&\"]]\"),#REF!,$B$4,#REF!,TRENDS!C20)","v":{"$error":"#REF!"}},null,null,null,null,null,null,null,null,null,null,null,null,"Chingford Medical Practice","Y01291",{"$f":"SUMIFS(WF_CKD_DATA[[#All],[08-CKD]],WF_CKD_DATA[[#All],[OrgID]],V20,WF_CKD_DATA[[#All],[Rel_D]],Locations!$E$17)","v":368},{"$f":"SUMIFS(WF_CKD_DATA[[#All],[NIS08-CKD01]],WF_CKD_DATA[[#All],[OrgID]],V20,WF_CKD_DATA[[#All],[Rel_D]],Locations!$E$17)","v":357},0.97010869565217395,{"$f":"SUMIFS(WF_CKD_DATA[[#All],[NIS08-CKD02]],WF_CKD_DATA[[#All],[OrgID]],V20,WF_CKD_DATA[[#All],[Rel_D]],Locations!$E$17)","v":225},0.61141304347826086,{"$f":"SUMIFS(WF_CKD_DATA[[#All],[NIS08-CKD03]],WF_CKD_DATA[[#All],[OrgID]],V20,WF_CKD_DATA[[#All],[Rel_D]],Locations!$E$17)","v":247},0.67119565217391308,{"$f":"SUMIFS(WF_CKD_DATA[[#All],[NIS08-CKD04]],WF_CKD_DATA[[#All],[OrgID]],V20,WF_CKD_DATA[[#All],[Rel_D]],Locations!$E$17)","v":206},0.55978260869565222]
[null,null,null,null,"2021-12-01",{"$f":"IF(SUMIFS(WF_CKD_DATA[[#All],[08-CKD]],WF_CKD_DATA[[#All],[OrgID]],$B$4,WF_CKD_DATA[[#All],[Rel_D]],E21)=0,#N/A,(SUMIFS(WF_CKD_DATA[[#All],[08-CKD]],WF_CKD_DATA[[#All],[OrgID]],$B$4,WF_CKD_DATA[[#All],[Rel_D]],E21)))","v":275},{"$f":"IF(SUMIFS(INDIRECT(\"WF_CKD_DATA[[#All],[\"&$B$2&\"]]\"),WF_CKD_DATA[[#All],[OrgID]],$B$4,WF_CKD_DATA[[#All],[Rel_D]],TRENDS!E21)=0,#N/A,(SUMIFS(INDIRECT(\"WF_CKD_DATA[[#All],[\"&$B$2&\"]]\"),WF_CKD_DATA[[#All],[OrgID]],$B$4,WF_CKD_DATA[[#All],[Rel_D]],TRENDS!E21)))","v":87},{"$f":"SUMIFS(INDIRECT(\"WF_CKD_DATA[[#All],[\"&$B$2&\"]]\"),#REF!,$B$4,#REF!,TRENDS!C21)","v":{"$error":"#REF!"}},null,null,null,null,null,null,null,null,null,null,null,null,"Churchill Medical Centre","F86627",{"$f":"SUMIFS(WF_CKD_DATA[[#All],[08-CKD]],WF_CKD_DATA[[#All],[OrgID]],V21,WF_CKD_DATA[[#All],[Rel_D]],Locations!$E$17)","v":531},{"$f":"SUMIFS(WF_CKD_DATA[[#All],[NIS08-CKD01]],WF_CKD_DATA[[#All],[OrgID]],V21,WF_CKD_DATA[[#All],[Rel_D]],Locations!$E$17)","v":447},{"$f":"X21/W21","v":0.84180790960451979},{"$f":"SUMIFS(WF_CKD_DATA[[#All],[NIS08-CKD02]],WF_CKD_DATA[[#All],[OrgID]],V21,WF_CKD_DATA[[#All],[Rel_D]],Locations!$E$17)","v":265},0.49905838041431261,{"$f":"SUMIFS(WF_CKD_DATA[[#All],[NIS08-CKD03]],WF_CKD_DATA[[#All],[OrgID]],V21,WF_CKD_DATA[[#All],[Rel_D]],Locations!$E$17)","v":350},0.6591337099811676,{"$f":"SUMIFS(WF_CKD_DATA[[#All],[NIS08-CKD04]],WF_CKD_DATA[[#All],[OrgID]],V21,WF_CKD_DATA[[#All],[Rel_D]],Locations!$E$17)","v":120},0.22598870056497175]
[null,null,null,null,"2022-01-01",{"$f":"IF(SUMIFS(WF_CKD_DATA[[#All],[08-CKD]],WF_CKD_DATA[[#All],[OrgID]],$B$4,WF_CKD_DATA[[#All],[Rel_D]],E22)=0,#N/A,(SUMIFS(WF_CKD_DATA[[#All],[08-CKD]],WF_CKD_DATA[[#All],[OrgID]],$B$4,WF_CKD_DATA[[#All],[Rel_D]],E22)))","v":271},{"$f":"IF(SUMIFS(INDIRECT(\"WF_CKD_DATA[[#All],[\"&$B$2&\"]]\"),WF_CKD_DATA[[#All],[OrgID]],$B$4,WF_CKD_DATA[[#All],[Rel_D]],TRENDS!E22)=0,#N/A,(SUMIFS(INDIRECT(\"WF_CKD_DATA[[#All],[\"&$B$2&\"]]\"),WF_CKD_DATA[[#All],[OrgID]],$B$4,WF_CKD_DATA[[#All],[Rel_D]],TRENDS!E22)))","v":88},{"$f":"SUMIFS(INDIRECT(\"WF_CKD_DATA[[#All],[\"&$B$2&\"]]\"),#REF!,$B$4,#REF!,TRENDS!C22)","v":{"$error":"#REF!"}},null,null,null,null,null,null,null,null,null,null,null,null,"The Ridgeway Surgery","F86078",{"$f":"SUMIFS(WF_CKD_DATA[[#All],[08-CKD]],WF_CKD_DATA[[#All],[OrgID]],V22,WF_CKD_DATA[[#All],[Rel_D]],Locations!$E$17)","v":316},{"$f":"SUMIFS(WF_CKD_DATA[[#All],[NIS08-CKD01]],WF_CKD_DATA[[#All],[OrgID]],V22,WF_CKD_DATA[[#All],[Rel_D]],Locations!$E$17)","v":113},0.35759493670886078,{"$f":"SUMIFS(WF_CKD_DATA[[#All],[NIS08-CKD02]],WF_CKD_DATA[[#All],[OrgID]],V22,WF_CKD_DATA[[#All],[Rel_D]],Locations!$E$17)","v":128},0.4050632911392405,{"$f":"SUMIFS(WF_CKD_DATA[[#All],[NIS08-CKD03]],WF_CKD_DATA[[#All],[OrgID]],V22,WF_CKD_DATA[[#All],[Rel_D]],Locations!$E$17)","v":190},0.60126582278481011,{"$f":"SUMIFS(WF_CKD_DATA[[#All],[NIS08-CKD04]],WF_CKD_DATA[[#All],[OrgID]],V22,WF_CKD_DATA[[#All],[Rel_D]],Locations!$E$17)","v":49},0.1550632911392405]
[null,null,null,null,"2022-02-01",{"$f":"IF(SUMIFS(WF_CKD_DATA[[#All],[08-CKD]],WF_CKD_DATA[[#All],[OrgID]],$B$4,WF_CKD_DATA[[#All],[Rel_D]],E23)=0,#N/A,(SUMIFS(WF_CKD_DATA[[#All],[08-CKD]],WF_CKD_DATA[[#All],[OrgID]],$B$4,WF_CKD_DATA[[#All],[Rel_D]],E23)))","v":273},{"$f":"IF(SUMIFS(INDIRECT(\"WF_CKD_DATA[[#All],[\"&$B$2&\"]]\"),WF_CKD_DATA[[#All],[OrgID]],$B$4,WF_CKD_DATA[[#All],[Rel_D]],TRENDS!E23)=0,#N/A,(SUMIFS(INDIRECT(\"WF_CKD_DATA[[#All],[\"&$B$2&\"]]\"),WF_CKD_DATA[[#All],[OrgID]],$B$4,WF_CKD_DATA[[#All],[Rel_D]],TRENDS!E23)))","v":89},{"$f":"SUMIFS(INDIRECT(\"WF_CKD_DATA[[#All],[\"&$B$2&\"]]\"),#REF!,$B$4,#REF!,TRENDS!C23)","v":{"$error":"#REF!"}},null,null,null,null,null,null,null,null,null,null,null,null,"Old Church Surgery","F86616",{"$f":"SUMIFS(WF_CKD_DATA[[#All],[08-CKD]],WF_CKD_DATA[[#All],[OrgID]],V23,WF_CKD_DATA[[#All],[Rel_D]],Locations!$E$17)","v":268},{"$f":"SUMIFS(WF_CKD_DATA[[#All],[NIS08-CKD01]],WF_CKD_DATA[[#All],[OrgID]],V23,WF_CKD_DATA[[#All],[Rel_D]],Locations!$E$17)","v":232},0.86567164179104472,{"$f":"SUMIFS(WF_CKD_DATA[[#All],[NIS08-CKD02]],WF_CKD_DATA[[#All],[OrgID]],V23,WF_CKD_DATA[[#All],[Rel_D]],Locations!$E$17)","v":187},0.69776119402985071,{"$f":"SUMIFS(WF_CKD_DATA[[#All],[NIS08-CKD03]],WF_CKD_DATA[[#All],[OrgID]],V23,WF_CKD_DATA[[#All],[Rel_D]],Locations!$E$17)","v":164},0.61194029850746268,{"$f":"SUMIFS(WF_CKD_DATA[[#All],[NIS08-CKD04]],WF_CKD_DATA[[#All],[OrgID]],V23,WF_CKD_DATA[[#All],[Rel_D]],Locations!$E$17)","v":90},0.33582089552238809]
[null,null,null,null,"2022-03-01",{"$f":"IF(SUMIFS(WF_CKD_DATA[[#All],[08-CKD]],WF_CKD_DATA[[#All],[OrgID]],$B$4,WF_CKD_DATA[[#All],[Rel_D]],E24)=0,#N/A,(SUMIFS(WF_CKD_DATA[[#All],[08-CKD]],WF_CKD_DATA[[#All],[OrgID]],$B$4,WF_CKD_DATA[[#All],[Rel_D]],E24)))","v":270},{"$f":"IF(SUMIFS(INDIRECT(\"WF_CKD_DATA[[#All],[\"&$B$2&\"]]\"),WF_CKD_DATA[[#All],[OrgID]],$B$4,WF_CKD_DATA[[#All],[Rel_D]],TRENDS!E24)=0,#N/A,(SUMIFS(INDIRECT(\"WF_CKD_DATA[[#All],[\"&$B$2&\"]]\"),WF_CKD_DATA[[#All],[OrgID]],$B$4,WF_CKD_DATA[[#All],[Rel_D]],TRENDS!E24)))","v":87},{"$f":"SUMIFS(INDIRECT(\"WF_CKD_DATA[[#All],[\"&$B$2&\"]]\"),#REF!,$B$4,#REF!,TRENDS!C24)","v":{"$error":"#REF!"}},null,null,null,null,null,null,null,null,null,null,null,null,"The Manor Practice","F86011",{"$f":"SUMIFS(WF_CKD_DATA[[#All],[08-CKD]],WF_CKD_DATA[[#All],[OrgID]],V24,WF_CKD_DATA[[#All],[Rel_D]],Locations!$E$17)","v":217},{"$f":"SUMIFS(WF_CKD_DATA[[#All],[NIS08-CKD01]],WF_CKD_DATA[[#All],[OrgID]],V24,WF_CKD_DATA[[#All],[Rel_D]],Locations!$E$17)","v":169},0.77880184331797231,{"$f":"SUMIFS(WF_CKD_DATA[[#All],[NIS08-CKD02]],WF_CKD_DATA[[#All],[OrgID]],V24,WF_CKD_DATA[[#All],[Rel_D]],Locations!$E$17)","v":110},0.50691244239631339,{"$f":"SUMIFS(WF_CKD_DATA[[#All],[NIS08-CKD03]],WF_CKD_DATA[[#All],[OrgID]],V24,WF_CKD_DATA[[#All],[Rel_D]],Locations!$E$17)","v":144},0.66359447004608296,{"$f":"SUMIFS(WF_CKD_DATA[[#All],[NIS08-CKD04]],WF_CKD_DATA[[#All],[OrgID]],V24,WF_CKD_DATA[[#All],[Rel_D]],Locations!$E$17)","v":56},0.25806451612903225]
[null,null,null,null,"2022-04-01",{"$f":"IF(SUMIFS(WF_CKD_DATA[[#All],[08-CKD]],WF_CKD_DATA[[#All],[OrgID]],$B$4,WF_CKD_DATA[[#All],[Rel_D]],E25)=0,#N/A,(SUMIFS(WF_CKD_DATA[[#All],[08-CKD]],WF_CKD_DATA[[#All],[OrgID]],$B$4,WF_CKD_DATA[[#All],[Rel_D]],E25)))","v":275},{"$f":"IF(SUMIFS(INDIRECT(\"WF_CKD_DATA[[#All],[\"&$B$2&\"]]\"),WF_CKD_DATA[[#All],[OrgID]],$B$4,WF_CKD_DATA[[#All],[Rel_D]],TRENDS!E25)=0,#N/A,(SUMIFS(INDIRECT(\"WF_CKD_DATA[[#All],[\"&$B$2&\"]]\"),WF_CKD_DATA[[#All],[OrgID]],$B$4,WF_CKD_DATA[[#All],[Rel_D]],TRENDS!E25)))","v":{"$error":"#N/A"}},{"$f":"SUMIFS(INDIRECT(\"WF_CKD_DATA[[#All],[\"&$B$2&\"]]\"),#REF!,$B$4,#REF!,TRENDS!C25)","v":{"$error":"#REF!"}},null,null,null,null,null,null,null,null,null,null,null,null,"Sma Medical Centre","F86038",{"$f":"SUMIFS(WF_CKD_DATA[[#All],[08-CKD]],WF_CKD_DATA[[#All],[OrgID]],V25,WF_CKD_DATA[[#All],[Rel_D]],Locations!$E$17)","v":190},{"$f":"SUMIFS(WF_CKD_DATA[[#All],[NIS08-CKD01]],WF_CKD_DATA[[#All],[OrgID]],V25,WF_CKD_DATA[[#All],[Rel_D]],Locations!$E$17)","v":152},0.8,{"$f":"SUMIFS(WF_CKD_DATA[[#All],[NIS08-CKD02]],WF_CKD_DATA[[#All],[OrgID]],V25,WF_CKD_DATA[[#All],[Rel_D]],Locations!$E$17)","v":150},0.78947368421052633,{"$f":"SUMIFS(WF_CKD_DATA[[#All],[NIS08-CKD03]],WF_CKD_DATA[[#All],[OrgID]],V25,WF_CKD_DATA[[#All],[Rel_D]],Locations!$E$17)","v":145},{"$f":"IFERROR(AB25/W25,\"-\")","v":0.76315789473684215},{"$f":"SUMIFS(WF_CKD_DATA[[#All],[NIS08-CKD04]],WF_CKD_DATA[[#All],[OrgID]],V25,WF_CKD_DATA[[#All],[Rel_D]],Locations!$E$17)","v":100},0.52631578947368418]
[null,null,null,null,null,null,null,null,null,null,null,null,null,null,null,null,null,null,null,null,null,null,{"$f":"SUMIFS(WF_CKD_DATA[[#All],[08-CKD]],WF_CKD_DATA[[#All],[OrgID]],V26,WF_CKD_DATA[[#All],[Rel_D]],Locations!$E$17)","v":0},{"$f":"SUMIFS(WF_CKD_DATA[[#All],[NIS08-CKD01]],WF_CKD_DATA[[#All],[OrgID]],V26,WF_CKD_DATA[[#All],[Rel_D]],Locations!$E$17)","v":0},null,{"$f":"SUMIFS(WF_CKD_DATA[[#All],[NIS08-CKD02]],WF_CKD_DATA[[#All],[OrgID]],V26,WF_CKD_DATA[[#All],[Rel_D]],Locations!$E$17)","v":0},"-",{"$f":"SUMIFS(WF_CKD_DATA[[#All],[NIS08-CKD03]],WF_CKD_DATA[[#All],[OrgID]],V26,WF_CKD_DATA[[#All],[Rel_D]],Locations!$E$17)","v":0},null,{"$f":"SUMIFS(WF_CKD_DATA[[#All],[NIS08-CKD04]],WF_CKD_DATA[[#All],[OrgID]],V26,WF_CKD_DATA[[#All],[Rel_D]],Locations!$E$17)","v":0},"-"]
[null,null,null,null,null,null,null,null,null,null,null,null,null,null,null,null,null,null,null,null,"Leyton Healthcare (Oliver Road)","F86074",{"$f":"SUMIFS(WF_CKD_DATA[[#All],[08-CKD]],WF_CKD_DATA[[#All],[OrgID]],V27,WF_CKD_DATA[[#All],[Rel_D]],Locations!$E$17)","v":372},{"$f":"SUMIFS(WF_CKD_DATA[[#All],[NIS08-CKD01]],WF_CKD_DATA[[#All],[OrgID]],V27,WF_CKD_DATA[[#All],[Rel_D]],Locations!$E$17)","v":260},{"$f":"IFERROR(X27/W27,\"-\")","v":0.69892473118279574},{"$f":"SUMIFS(WF_CKD_DATA[[#All],[NIS08-CKD02]],WF_CKD_DATA[[#All],[OrgID]],V27,WF_CKD_DATA[[#All],[Rel_D]],Locations!$E$17)","v":189},0.50806451612903225,{"$f":"SUMIFS(WF_CKD_DATA[[#All],[NIS08-CKD03]],WF_CKD_DATA[[#All],[OrgID]],V27,WF_CKD_DATA[[#All],[Rel_D]],Locations!$E$17)","v":242},0.65053763440860213,{"$f":"SUMIFS(WF_CKD_DATA[[#All],[NIS08-CKD04]],WF_CKD_DATA[[#All],[OrgID]],V27,WF_CKD_DATA[[#All],[Rel_D]],Locations!$E$17)","v":0},0]
[null,null,null,null,null,null,null,null,null,null,null,null,null,null,null,null,null,null,null,null,"The Allum Medical Centre","F86036",{"$f":"SUMIFS(WF_CKD_DATA[[#All],[08-CKD]],WF_CKD_DATA[[#All],[OrgID]],V28,WF_CKD_DATA[[#All],[Rel_D]],Locations!$E$17)","v":305},{"$f":"SUMIFS(WF_CKD_DATA[[#All],[NIS08-CKD01]],WF_CKD_DATA[[#All],[OrgID]],V28,WF_CKD_DATA[[#All],[Rel_D]],Locations!$E$17)","v":224},{"$f":"X28/W28","v":0.73442622950819669},{"$f":"SUMIFS(WF_CKD_DATA[[#All],[NIS08-CKD02]],WF_CKD_DATA[[#All],[OrgID]],V28,WF_CKD_DATA[[#All],[Rel_D]],Locations!$E$17)","v":167},0.54754098360655734,{"$f":"SUMIFS(WF_CKD_DATA[[#All],[NIS08-CKD03]],WF_CKD_DATA[[#All],[OrgID]],V28,WF_CKD_DATA[[#All],[Rel_D]],Locations!$E$17)","v":206},0.67540983606557381,{"$f":"SUMIFS(WF_CKD_DATA[[#All],[NIS08-CKD04]],WF_CKD_DATA[[#All],[OrgID]],V28,WF_CKD_DATA[[#All],[Rel_D]],Locations!$E$17)","v":98},0.32131147540983607]
[null,null,null,null,null,null,null,null,null,null,null,null,null,null,null,null,null,null,null,null," Crawley Road Medical Centre","F86044",{"$f":"SUMIFS(WF_CKD_DATA[[#All],[08-CKD]],WF_CKD_DATA[[#All],[OrgID]],V29,WF_CKD_DATA[[#All],[Rel_D]],Locations!$E$17)","v":117},{"$f":"SUMIFS(WF_CKD_DATA[[#All],[NIS08-CKD01]],WF_CKD_DATA[[#All],[OrgID]],V29,WF_CKD_DATA[[#All],[Rel_D]],Locations!$E$17)","v":105},0.89743589743589747,{"$f":"SUMIFS(WF_CKD_DATA[[#All],[NIS08-CKD02]],WF_CKD_DATA[[#All],[OrgID]],V29,WF_CKD_DATA[[#All],[Rel_D]],Locations!$E$17)","v":56},0.47863247863247865,{"$f":"SUMIFS(WF_CKD_DATA[[#All],[NIS08-CKD03]],WF_CKD_DATA[[#All],[OrgID]],V29,WF_CKD_DATA[[#All],[Rel_D]],Locations!$E$17)","v":83},0.70940170940170943,{"$f":"SUMIFS(WF_CKD_DATA[[#All],[NIS08-CKD04]],WF_CKD_DATA[[#All],[OrgID]],V29,WF_CKD_DATA[[#All],[Rel_D]],Locations!$E$17)","v":28},0.23931623931623933]
[null,null,null,null,null,null,null,null,null,null,null,null,null,null,null,null,null,null,null,null,"Francis Road Medical Centre","F86696",{"$f":"SUMIFS(WF_CKD_DATA[[#All],[08-CKD]],WF_CKD_DATA[[#All],[OrgID]],V30,WF_CKD_DATA[[#All],[Rel_D]],Locations!$E$17)","v":117},{"$f":"SUMIFS(WF_CKD_DATA[[#All],[NIS08-CKD01]],WF_CKD_DATA[[#All],[OrgID]],V30,WF_CKD_DATA[[#All],[Rel_D]],Locations!$E$17)","v":109},0.93162393162393164,{"$f":"SUMIFS(WF_CKD_DATA[[#All],[NIS08-CKD02]],WF_CKD_DATA[[#All],[OrgID]],V30,WF_CKD_DATA[[#All],[Rel_D]],Locations!$E$17)","v":62},0.52991452991452992,{"$f":"SUMIFS(WF_CKD_DATA[[#All],[NIS08-CKD03]],WF_CKD_DATA[[#All],[OrgID]],V30,WF_CKD_DATA[[#All],[Rel_D]],Locations!$E$17)","v":92},0.78632478632478631,{"$f":"SUMIFS(WF_CKD_DATA[[#All],[NIS08-CKD04]],WF_CKD_DATA[[#All],[OrgID]],V30,WF_CKD_DATA[[#All],[Rel_D]],Locations!$E$17)","v":50},0.42735042735042733]
[null,null,null,null,null,null,null,null,null,null,null,null,null,null,null,null,null,null,null,null,"Hampton Medical Centre","F86712",{"$f":"SUMIFS(WF_CKD_DATA[[#All],[08-CKD]],WF_CKD_DATA[[#All],[OrgID]],V31,WF_CKD_DATA[[#All],[Rel_D]],Locations!$E$17)","v":74},{"$f":"SUMIFS(WF_CKD_DATA[[#All],[NIS08-CKD01]],WF_CKD_DATA[[#All],[OrgID]],V31,WF_CKD_DATA[[#All],[Rel_D]],Locations!$E$17)","v":73},0.98648648648648651,{"$f":"SUMIFS(WF_CKD_DATA[[#All],[NIS08-CKD02]],WF_CKD_DATA[[#All],[OrgID]],V31,WF_CKD_DATA[[#All],[Rel_D]],Locations!$E$17)","v":40},0.54054054054054057,{"$f":"SUMIFS(WF_CKD_DATA[[#All],[NIS08-CKD03]],WF_CKD_DATA[[#All],[OrgID]],V31,WF_CKD_DATA[[#All],[Rel_D]],Locations!$E$17)","v":64},0.86486486486486491,{"$f":"SUMIFS(WF_CKD_DATA[[#All],[NIS08-CKD04]],WF_CKD_DATA[[#All],[OrgID]],V31,WF_CKD_DATA[[#All],[Rel_D]],Locations!$E$17)","v":16},0.21621621621621623]
[null,null,null,null,null,null,null,null,null,null,null,null,null,null,null,null,null,null,null,null,"Lime Tree Surgery","F86650",{"$f":"SUMIFS(WF_CKD_DATA[[#All],[08-CKD]],WF_CKD_DATA[[#All],[OrgID]],V32,WF_CKD_DATA[[#All],[Rel_D]],Locations!$E$17)","v":144},{"$f":"SUMIFS(WF_CKD_DATA[[#All],[NIS08-CKD01]],WF_CKD_DATA[[#All],[OrgID]],V32,WF_CKD_DATA[[#All],[Rel_D]],Locations!$E$17)","v":131},0.90972222222222221,{"$f":"SUMIFS(WF_CKD_DATA[[#All],[NIS08-CKD02]],WF_CKD_DATA[[#All],[OrgID]],V32,WF_CKD_DATA[[#All],[Rel_D]],Locations!$E$17)","v":67},0.46527777777777779,{"$f":"SUMIFS(WF_CKD_DATA[[#All],[NIS08-CKD03]],WF_CKD_DATA[[#All],[OrgID]],V32,WF_CKD_DATA[[#All],[Rel_D]],Locations!$E$17)","v":96},0.66666666666666663,{"$f":"SUMIFS(WF_CKD_DATA[[#All],[NIS08-CKD04]],WF_CKD_DATA[[#All],[OrgID]],V32,WF_CKD_DATA[[#All],[Rel_D]],Locations!$E$17)","v":100},0.69444444444444442]
[null,null,null,null,null,null,null,null,null,null,null,null,null,null,null,null,null,null,null,null,"The Lyndhurst Surgery","F86088",{"$f":"SUMIFS(WF_CKD_DATA[[#All],[08-CKD]],WF_CKD_DATA[[#All],[OrgID]],V33,WF_CKD_DATA[[#All],[Rel_D]],Locations!$E$17)","v":109},{"$f":"SUMIFS(WF_CKD_DATA[[#All],[NIS08-CKD01]],WF_CKD_DATA[[#All],[OrgID]],V33,WF_CKD_DATA[[#All],[Rel_D]],Locations!$E$17)","v":93},0.85321100917431192,{"$f":"SUMIFS(WF_CKD_DATA[[#All],[NIS08-CKD02]],WF_CKD_DATA[[#All],[OrgID]],V33,WF_CKD_DATA[[#All],[Rel_D]],Locations!$E$17)","v":46},0.42201834862385323,{"$f":"SUMIFS(WF_CKD_DATA[[#All],[NIS08-CKD03]],WF_CKD_DATA[[#All],[OrgID]],V33,WF_CKD_DATA[[#All],[Rel_D]],Locations!$E$17)","v":86},0.78899082568807344,{"$f":"SUMIFS(WF_CKD_DATA[[#All],[NIS08-CKD04]],WF_CKD_DATA[[#All],[OrgID]],V33,WF_CKD_DATA[[#All],[Rel_D]],Locations!$E$17)","v":56},0.51376146788990829]
[null,null,null,null,null,null,null,null,null,null,null,null,null,null,null,null,null,null,null,null,"The Ecclesbourne Practice","F86018",{"$f":"SUMIFS(WF_CKD_DATA[[#All],[08-CKD]],WF_CKD_DATA[[#All],[OrgID]],V34,WF_CKD_DATA[[#All],[Rel_D]],Locations!$E$17)","v":490},{"$f":"SUMIFS(WF_CKD_DATA[[#All],[NIS08-CKD01]],WF_CKD_DATA[[#All],[OrgID]],V34,WF_CKD_DATA[[#All],[Rel_D]],Locations!$E$17)","v":369},{"$f":"IFERROR(X34/W34,\"-\")","v":0.75306122448979596},{"$f":"SUMIFS(WF_CKD_DATA[[#All],[NIS08-CKD02]],WF_CKD_DATA[[#All],[OrgID]],V34,WF_CKD_DATA[[#All],[Rel_D]],Locations!$E$17)","v":255},0.52040816326530615,{"$f":"SUMIFS(WF_CKD_DATA[[#All],[NIS08-CKD03]],WF_CKD_DATA[[#All],[OrgID]],V34,WF_CKD_DATA[[#All],[Rel_D]],Locations!$E$17)","v":268},0.54693877551020409,{"$f":"SUMIFS(WF_CKD_DATA[[#All],[NIS08-CKD04]],WF_CKD_DATA[[#All],[OrgID]],V34,WF_CKD_DATA[[#All],[Rel_D]],Locations!$E$17)","v":0},0]
[null,null,null,null,null,null,null,null,null,null,null,null,null,null,null,null,null,null,null,null,"Green Man Medical Centre","F86621",{"$f":"SUMIFS(WF_CKD_DATA[[#All],[08-CKD]],WF_CKD_DATA[[#All],[OrgID]],V35,WF_CKD_DATA[[#All],[Rel_D]],Locations!$E$17)","v":158},{"$f":"SUMIFS(WF_CKD_DATA[[#All],[NIS08-CKD01]],WF_CKD_DATA[[#All],[OrgID]],V35,WF_CKD_DATA[[#All],[Rel_D]],Locations!$E$17)","v":138},{"$f":"X35/W35","v":0.87341772151898733},{"$f":"SUMIFS(WF_CKD_DATA[[#All],[NIS08-CKD02]],WF_CKD_DATA[[#All],[OrgID]],V35,WF_CKD_DATA[[#All],[Rel_D]],Locations!$E$17)","v":88},0.55696202531645567,{"$f":"SUMIFS(WF_CKD_DATA[[#All],[NIS08-CKD03]],WF_CKD_DATA[[#All],[OrgID]],V35,WF_CKD_DATA[[#All],[Rel_D]],Locations!$E$17)","v":131},0.82911392405063289,{"$f":"SUMIFS(WF_CKD_DATA[[#All],[NIS08-CKD04]],WF_CKD_DATA[[#All],[OrgID]],V35,WF_CKD_DATA[[#All],[Rel_D]],Locations!$E$17)","v":50},0.31645569620253167]
[null,null,null,null,null,null,null,null,null,null,null,null,null,null,null,null,null,null,null,null,"High Road Surgery","F86045",{"$f":"SUMIFS(WF_CKD_DATA[[#All],[08-CKD]],WF_CKD_DATA[[#All],[OrgID]],V36,WF_CKD_DATA[[#All],[Rel_D]],Locations!$E$17)","v":50},{"$f":"SUMIFS(WF_CKD_DATA[[#All],[NIS08-CKD01]],WF_CKD_DATA[[#All],[OrgID]],V36,WF_CKD_DATA[[#All],[Rel_D]],Locations!$E$17)","v":45},0.9,{"$f":"SUMIFS(WF_CKD_DATA[[#All],[NIS08-CKD02]],WF_CKD_DATA[[#All],[OrgID]],V36,WF_CKD_DATA[[#All],[Rel_D]],Locations!$E$17)","v":35},0.7,{"$f":"SUMIFS(WF_CKD_DATA[[#All],[NIS08-CKD03]],WF_CKD_DATA[[#All],[OrgID]],V36,WF_CKD_DATA[[#All],[Rel_D]],Locations!$E$17)","v":39},0.78,{"$f":"SUMIFS(WF_CKD_DATA[[#All],[NIS08-CKD04]],WF_CKD_DATA[[#All],[OrgID]],V36,WF_CKD_DATA[[#All],[Rel_D]],Locations!$E$17)","v":37},0.74]
[null,null,null,null,null,null,null,null,null,null,null,null,null,null,null,null,null,null,null,null,"Kiyani Medical Practice","F86701",{"$f":"SUMIFS(WF_CKD_DATA[[#All],[08-CKD]],WF_CKD_DATA[[#All],[OrgID]],V37,WF_CKD_DATA[[#All],[Rel_D]],Locations!$E$17)","v":84},{"$f":"SUMIFS(WF_CKD_DATA[[#All],[NIS08-CKD01]],WF_CKD_DATA[[#All],[OrgID]],V37,WF_CKD_DATA[[#All],[Rel_D]],Locations!$E$17)","v":80},0.95238095238095233,{"$f":"SUMIFS(WF_CKD_DATA[[#All],[NIS08-CKD02]],WF_CKD_DATA[[#All],[OrgID]],V37,WF_CKD_DATA[[#All],[Rel_D]],Locations!$E$17)","v":53},0.63095238095238093,{"$f":"SUMIFS(WF_CKD_DATA[[#All],[NIS08-CKD03]],WF_CKD_DATA[[#All],[OrgID]],V37,WF_CKD_DATA[[#All],[Rel_D]],Locations!$E$17)","v":77},0.91666666666666663,{"$f":"SUMIFS(WF_CKD_DATA[[#All],[NIS08-CKD04]],WF_CKD_DATA[[#All],[OrgID]],V37,WF_CKD_DATA[[#All],[Rel_D]],Locations!$E$17)","v":55},0.65476190476190477]
[null,null,null,null,null,null,null,null,null,null,null,null,null,null,null,null,null,null,null,null,"LL Medical Care (Agarwal & Agrwal Practice)","F86625",{"$f":"SUMIFS(WF_CKD_DATA[[#All],[08-CKD]],WF_CKD_DATA[[#All],[OrgID]],V38,WF_CKD_DATA[[#All],[Rel_D]],Locations!$E$17)","v":148},{"$f":"SUMIFS(WF_CKD_DATA[[#All],[NIS08-CKD01]],WF_CKD_DATA[[#All],[OrgID]],V38,WF_CKD_DATA[[#All],[Rel_D]],Locations!$E$17)","v":129},0.8716216216216216,{"$f":"SUMIFS(WF_CKD_DATA[[#All],[NIS08-CKD02]],WF_CKD_DATA[[#All],[OrgID]],V38,WF_CKD_DATA[[#All],[Rel_D]],Locations!$E$17)","v":76},0.51351351351351349,{"$f":"SUMIFS(WF_CKD_DATA[[#All],[NIS08-CKD03]],WF_CKD_DATA[[#All],[OrgID]],V38,WF_CKD_DATA[[#All],[Rel_D]],Locations!$E$17)","v":112},0.7567567567567568,{"$f":"SUMIFS(WF_CKD_DATA[[#All],[NIS08-CKD04]],WF_CKD_DATA[[#All],[OrgID]],V38,WF_CKD_DATA[[#All],[Rel_D]],Locations!$E$17)","v":47},0.31756756756756754]
[null,null,null,null,null,null,null,null,null,null,null,null,null,null,null,null,null,null,null,null,"The Harrow Road Surgery","F86666",{"$f":"SUMIFS(WF_CKD_DATA[[#All],[08-CKD]],WF_CKD_DATA[[#All],[OrgID]],V39,WF_CKD_DATA[[#All],[Rel_D]],Locations!$E$17)","v":263},{"$f":"SUMIFS(WF_CKD_DATA[[#All],[NIS08-CKD01]],WF_CKD_DATA[[#All],[OrgID]],V39,WF_CKD_DATA[[#All],[Rel_D]],Locations!$E$17)","v":251},0.95437262357414454,{"$f":"SUMIFS(WF_CKD_DATA[[#All],[NIS08-CKD02]],WF_CKD_DATA[[#All],[OrgID]],V39,WF_CKD_DATA[[#All],[Rel_D]],Locations!$E$17)","v":172},0.6539923954372624,{"$f":"SUMIFS(WF_CKD_DATA[[#All],[NIS08-CKD03]],WF_CKD_DATA[[#All],[OrgID]],V39,WF_CKD_DATA[[#All],[Rel_D]],Locations!$E$17)","v":194},0.73764258555133078,{"$f":"SUMIFS(WF_CKD_DATA[[#All],[NIS08-CKD04]],WF_CKD_DATA[[#All],[OrgID]],V39,WF_CKD_DATA[[#All],[Rel_D]],Locations!$E$17)","v":144},0.54752851711026618]
[null,null,null,null,null,null,null,null,null,null,null,null,null,null,null,null,null,null,null,null,"The Langthorne Sharma Family Practice","F86705",{"$f":"SUMIFS(WF_CKD_DATA[[#All],[08-CKD]],WF_CKD_DATA[[#All],[OrgID]],V40,WF_CKD_DATA[[#All],[Rel_D]],Locations!$E$17)","v":59},{"$f":"SUMIFS(WF_CKD_DATA[[#All],[NIS08-CKD01]],WF_CKD_DATA[[#All],[OrgID]],V40,WF_CKD_DATA[[#All],[Rel_D]],Locations!$E$17)","v":54},0.9152542372881356,{"$f":"SUMIFS(WF_CKD_DATA[[#All],[NIS08-CKD02]],WF_CKD_DATA[[#All],[OrgID]],V40,WF_CKD_DATA[[#All],[Rel_D]],Locations!$E$17)","v":35},0.59322033898305082,{"$f":"SUMIFS(WF_CKD_DATA[[#All],[NIS08-CKD03]],WF_CKD_DATA[[#All],[OrgID]],V40,WF_CKD_DATA[[#All],[Rel_D]],Locations!$E$17)","v":42},0.71186440677966101,{"$f":"SUMIFS(WF_CKD_DATA[[#All],[NIS08-CKD04]],WF_CKD_DATA[[#All],[OrgID]],V40,WF_CKD_DATA[[#All],[Rel_D]],Locations!$E$17)","v":19},0.32203389830508472]
[null,null,null,null,null,null,null,null,null,null,null,null,null,null,null,null,null,null,null,null,"Addison Road Medical Practice","F86607",{"$f":"SUMIFS(WF_CKD_DATA[[#All],[08-CKD]],WF_CKD_DATA[[#All],[OrgID]],V41,WF_CKD_DATA[[#All],[Rel_D]],Locations!$E$17)","v":263},{"$f":"SUMIFS(WF_CKD_DATA[[#All],[NIS08-CKD01]],WF_CKD_DATA[[#All],[OrgID]],V41,WF_CKD_DATA[[#All],[Rel_D]],Locations!$E$17)","v":238},0.90494296577946765,{"$f":"SUMIFS(WF_CKD_DATA[[#All],[NIS08-CKD02]],WF_CKD_DATA[[#All],[OrgID]],V41,WF_CKD_DATA[[#All],[Rel_D]],Locations!$E$17)","v":138},0.52471482889733845,{"$f":"SUMIFS(WF_CKD_DATA[[#All],[NIS08-CKD03]],WF_CKD_DATA[[#All],[OrgID]],V41,WF_CKD_DATA[[#All],[Rel_D]],Locations!$E$17)","v":202},0.76806083650190116,{"$f":"SUMIFS(WF_CKD_DATA[[#All],[NIS08-CKD04]],WF_CKD_DATA[[#All],[OrgID]],V41,WF_CKD_DATA[[#All],[Rel_D]],Locations!$E$17)","v":130},0.49429657794676807]
[null,null,null,null,null,null,null,null,null,null,null,null,null,null,null,null,null,null,null,null,"Claremont Medical Centre","F86708",{"$f":"SUMIFS(WF_CKD_DATA[[#All],[08-CKD]],WF_CKD_DATA[[#All],[OrgID]],V42,WF_CKD_DATA[[#All],[Rel_D]],Locations!$E$17)","v":56},{"$f":"SUMIFS(WF_CKD_DATA[[#All],[NIS08-CKD01]],WF_CKD_DATA[[#All],[OrgID]],V42,WF_CKD_DATA[[#All],[Rel_D]],Locations!$E$17)","v":52},0.9285714285714286,{"$f":"SUMIFS(WF_CKD_DATA[[#All],[NIS08-CKD02]],WF_CKD_DATA[[#All],[OrgID]],V42,WF_CKD_DATA[[#All],[Rel_D]],Locations!$E$17)","v":30},0.5357142857142857,{"$f":"SUMIFS(WF_CKD_DATA[[#All],[NIS08-CKD03]],WF_CKD_DATA[[#All],[OrgID]],V42,WF_CKD_DATA[[#All],[Rel_D]],Locations!$E$17)","v":42},0.75,{"$f":"SUMIFS(WF_CKD_DATA[[#All],[NIS08-CKD04]],WF_CKD_DATA[[#All],[OrgID]],V42,WF_CKD_DATA[[#All],[Rel_D]],Locations!$E$17)","v":22},0.39285714285714285]
[null,null,null,null,null,null,null,null,null,null,null,null,null,null,null,null,null,null,null,null," The Firs","F86001",{"$f":"SUMIFS(WF_CKD_DATA[[#All],[08-CKD]],WF_CKD_DATA[[#All],[OrgID]],V43,WF_CKD_DATA[[#All],[Rel_D]],Locations!$E$17)","v":199},{"$f":"SUMIFS(WF_CKD_DATA[[#All],[NIS08-CKD01]],WF_CKD_DATA[[#All],[OrgID]],V43,WF_CKD_DATA[[#All],[Rel_D]],Locations!$E$17)","v":179},0.89949748743718594,{"$f":"SUMIFS(WF_CKD_DATA[[#All],[NIS08-CKD02]],WF_CKD_DATA[[#All],[OrgID]],V43,WF_CKD_DATA[[#All],[Rel_D]],Locations!$E$17)","v":98},0.49246231155778897,{"$f":"SUMIFS(WF_CKD_DATA[[#All],[NIS08-CKD03]],WF_CKD_DATA[[#All],[OrgID]],V43,WF_CKD_DATA[[#All],[Rel_D]],Locations!$E$17)","v":126},0.63316582914572861,{"$f":"SUMIFS(WF_CKD_DATA[[#All],[NIS08-CKD04]],WF_CKD_DATA[[#All],[OrgID]],V43,WF_CKD_DATA[[#All],[Rel_D]],Locations!$E$17)","v":42},0.21105527638190955]
[null,null,null,null,null,null,null,null,null,null,null,null,null,null,null,null,null,null,null,null,"Dr Dhital Practice","F86086",{"$f":"SUMIFS(WF_CKD_DATA[[#All],[08-CKD]],WF_CKD_DATA[[#All],[OrgID]],V44,WF_CKD_DATA[[#All],[Rel_D]],Locations!$E$17)","v":84},{"$f":"SUMIFS(WF_CKD_DATA[[#All],[NIS08-CKD01]],WF_CKD_DATA[[#All],[OrgID]],V44,WF_CKD_DATA[[#All],[Rel_D]],Locations!$E$17)","v":63},0.75,{"$f":"SUMIFS(WF_CKD_DATA[[#All],[NIS08-CKD02]],WF_CKD_DATA[[#All],[OrgID]],V44,WF_CKD_DATA[[#All],[Rel_D]],Locations!$E$17)","v":39},0.4642857142857143,{"$f":"SUMIFS(WF_CKD_DATA[[#All],[NIS08-CKD03]],WF_CKD_DATA[[#All],[OrgID]],V44,WF_CKD_DATA[[#All],[Rel_D]],Locations!$E$17)","v":52},0.61904761904761907,{"$f":"SUMIFS(WF_CKD_DATA[[#All],[NIS08-CKD04]],WF_CKD_DATA[[#All],[OrgID]],V44,WF_CKD_DATA[[#All],[Rel_D]],Locations!$E$17)","v":18},0.21428571428571427]
[null,null,null,null,null,null,null,null,null,null,null,null,null,null,null,null,null,null,null,null,"Waltham Forest Community & Family Health Services Ltd","F86644",{"$f":"SUMIFS(WF_CKD_DATA[[#All],[08-CKD]],WF_CKD_DATA[[#All],[OrgID]],V45,WF_CKD_DATA[[#All],[Rel_D]],Locations!$E$17)","v":217},{"$f":"SUMIFS(WF_CKD_DATA[[#All],[NIS08-CKD01]],WF_CKD_DATA[[#All],[OrgID]],V45,WF_CKD_DATA[[#All],[Rel_D]],Locations!$E$17)","v":205},0.9447004608294931,{"$f":"SUMIFS(WF_CKD_DATA[[#All],[NIS08-CKD02]],WF_CKD_DATA[[#All],[OrgID]],V45,WF_CKD_DATA[[#All],[Rel_D]],Locations!$E$17)","v":101},0.46543778801843316,{"$f":"SUMIFS(WF_CKD_DATA[[#All],[NIS08-CKD03]],WF_CKD_DATA[[#All],[OrgID]],V45,WF_CKD_DATA[[#All],[Rel_D]],Locations!$E$17)","v":137},0.63133640552995396,{"$f":"SUMIFS(WF_CKD_DATA[[#All],[NIS08-CKD04]],WF_CKD_DATA[[#All],[OrgID]],V45,WF_CKD_DATA[[#All],[Rel_D]],Locations!$E$17)","v":68},0.31336405529953915]
[null,null,null,null,null,null,null,null,null,null,null,null,null,null,null,null,null,null,null,null,"Seymour Medical Centre","F86006",{"$f":"SUMIFS(WF_CKD_DATA[[#All],[08-CKD]],WF_CKD_DATA[[#All],[OrgID]],V46,WF_CKD_DATA[[#All],[Rel_D]],Locations!$E$17)","v":144},{"$f":"SUMIFS(WF_CKD_DATA[[#All],[NIS08-CKD01]],WF_CKD_DATA[[#All],[OrgID]],V46,WF_CKD_DATA[[#All],[Rel_D]],Locations!$E$17)","v":105},0.72916666666666663,{"$f":"SUMIFS(WF_CKD_DATA[[#All],[NIS08-CKD02]],WF_CKD_DATA[[#All],[OrgID]],V46,WF_CKD_DATA[[#All],[Rel_D]],Locations!$E$17)","v":66},0.45833333333333331,{"$f":"SUMIFS(WF_CKD_DATA[[#All],[NIS08-CKD03]],WF_CKD_DATA[[#All],[OrgID]],V46,WF_CKD_DATA[[#All],[Rel_D]],Locations!$E$17)","v":91},0.63194444444444442,{"$f":"SUMIFS(WF_CKD_DATA[[#All],[NIS08-CKD04]],WF_CKD_DATA[[#All],[OrgID]],V46,WF_CKD_DATA[[#All],[Rel_D]],Locations!$E$17)","v":47},0.3263888888888889]
[null,null,null,null,null,null,null,null,null,null,null,null,null,null,null,null,null,null,null,null," Queens Road Medical Centre","F86030",{"$f":"SUMIFS(WF_CKD_DATA[[#All],[08-CKD]],WF_CKD_DATA[[#All],[OrgID]],V47,WF_CKD_DATA[[#All],[Rel_D]],Locations!$E$17)","v":165},{"$f":"SUMIFS(WF_CKD_DATA[[#All],[NIS08-CKD01]],WF_CKD_DATA[[#All],[OrgID]],V47,WF_CKD_DATA[[#All],[Rel_D]],Locations!$E$17)","v":140},0.84848484848484851,{"$f":"SUMIFS(WF_CKD_DATA[[#All],[NIS08-CKD02]],WF_CKD_DATA[[#All],[OrgID]],V47,WF_CKD_DATA[[#All],[Rel_D]],Locations!$E$17)","v":106},0.64242424242424245,{"$f":"SUMIFS(WF_CKD_DATA[[#All],[NIS08-CKD03]],WF_CKD_DATA[[#All],[OrgID]],V47,WF_CKD_DATA[[#All],[Rel_D]],Locations!$E$17)","v":129},0.78181818181818186,{"$f":"SUMIFS(WF_CKD_DATA[[#All],[NIS08-CKD04]],WF_CKD_DATA[[#All],[OrgID]],V47,WF_CKD_DATA[[#All],[Rel_D]],Locations!$E$17)","v":87},0.52727272727272723]
[null,null,null,null,null,null,null,null,null,null,null,null,null,null,null,null,null,null,null,null,"Grove Surgery","F86062",{"$f":"SUMIFS(WF_CKD_DATA[[#All],[08-CKD]],WF_CKD_DATA[[#All],[OrgID]],V48,WF_CKD_DATA[[#All],[Rel_D]],Locations!$E$17)","v":142},{"$f":"SUMIFS(WF_CKD_DATA[[#All],[NIS08-CKD01]],WF_CKD_DATA[[#All],[OrgID]],V48,WF_CKD_DATA[[#All],[Rel_D]],Locations!$E$17)","v":102},0.71830985915492962,{"$f":"SUMIFS(WF_CKD_DATA[[#All],[NIS08-CKD02]],WF_CKD_DATA[[#All],[OrgID]],V48,WF_CKD_DATA[[#All],[Rel_D]],Locations!$E$17)","v":63},0.44366197183098594,{"$f":"SUMIFS(WF_CKD_DATA[[#All],[NIS08-CKD03]],WF_CKD_DATA[[#All],[OrgID]],V48,WF_CKD_DATA[[#All],[Rel_D]],Locations!$E$17)","v":114},0.80281690140845074,{"$f":"SUMIFS(WF_CKD_DATA[[#All],[NIS08-CKD04]],WF_CKD_DATA[[#All],[OrgID]],V48,WF_CKD_DATA[[#All],[Rel_D]],Locations!$E$17)","v":64},0.45070422535211269]
[null,null,null,null,null,null,null,null,null,null,null,null,null,null,null,null,null,null,null,null,"Higham Hill Medical Centre","F86679",{"$f":"SUMIFS(WF_CKD_DATA[[#All],[08-CKD]],WF_CKD_DATA[[#All],[OrgID]],V49,WF_CKD_DATA[[#All],[Rel_D]],Locations!$E$17)","v":74},{"$f":"SUMIFS(WF_CKD_DATA[[#All],[NIS08-CKD01]],WF_CKD_DATA[[#All],[OrgID]],V49,WF_CKD_DATA[[#All],[Rel_D]],Locations!$E$17)","v":67},0.90540540540540537,{"$f":"SUMIFS(WF_CKD_DATA[[#All],[NIS08-CKD02]],WF_CKD_DATA[[#All],[OrgID]],V49,WF_CKD_DATA[[#All],[Rel_D]],Locations!$E$17)","v":51},0.68918918918918914,{"$f":"SUMIFS(WF_CKD_DATA[[#All],[NIS08-CKD03]],WF_CKD_DATA[[#All],[OrgID]],V49,WF_CKD_DATA[[#All],[Rel_D]],Locations!$E$17)","v":58},0.78378378378378377,{"$f":"SUMIFS(WF_CKD_DATA[[#All],[NIS08-CKD04]],WF_CKD_DATA[[#All],[OrgID]],V49,WF_CKD_DATA[[#All],[Rel_D]],Locations!$E$17)","v":27},0.36486486486486486]
[null,null,null,null,null,null,null,null,null,null,null,null,null,null,null,null,null,null,null,null,"St James Medical Practice Ltd","F86058",{"$f":"SUMIFS(WF_CKD_DATA[[#All],[08-CKD]],WF_CKD_DATA[[#All],[OrgID]],V50,WF_CKD_DATA[[#All],[Rel_D]],Locations!$E$17)","v":236},{"$f":"SUMIFS(WF_CKD_DATA[[#All],[NIS08-CKD01]],WF_CKD_DATA[[#All],[OrgID]],V50,WF_CKD_DATA[[#All],[Rel_D]],Locations!$E$17)","v":200},0.84745762711864403,{"$f":"SUMIFS(WF_CKD_DATA[[#All],[NIS08-CKD02]],WF_CKD_DATA[[#All],[OrgID]],V50,WF_CKD_DATA[[#All],[Rel_D]],Locations!$E$17)","v":162},0.68644067796610164,{"$f":"SUMIFS(WF_CKD_DATA[[#All],[NIS08-CKD03]],WF_CKD_DATA[[#All],[OrgID]],V50,WF_CKD_DATA[[#All],[Rel_D]],Locations!$E$17)","v":178},0.75423728813559321,{"$f":"SUMIFS(WF_CKD_DATA[[#All],[NIS08-CKD04]],WF_CKD_DATA[[#All],[OrgID]],V50,WF_CKD_DATA[[#All],[Rel_D]],Locations!$E$17)","v":113},0.4788135593220339]
[null,null,null,null,null,null,null,null,null,null,null,null,null,null,null,null,null,null,null,null,"Average",null,null,null,{"$f":"AVERAGE(Y11:Y50)","v":0.83919137390653953},null,{"$f":"AVERAGE(AA11:AA50)","v":0.54705036998356105},null,{"$f":"AVERAGE(AC11:AC50)","v":0.70310558287567415},null,{"$f":"AVERAGE(AE11:AE50)","v":0.32127946963608123}]
[]
[]
[]
[]
["Numerator"]
[]
[{"$f":"IF(A47=\"NIS08-CKD01\",SUMIFS(#REF!,#REF!,A49),IF(A47=\"NIS08-CKD02\",SUMIFS(#REF!,#REF!,A49 ),IF(A47=\"08-CKD\", SUMIFS(#REF!,#REF!,A49),0)))","v":0}]
[{"$f":"IF(A48=\"NIS08-CKD01\",SUMIFS(#REF!,#REF!,A50),IF(A48=\"NIS08-CKD02\",SUMIFS(#REF!,#REF!,A50 ),IF(A48=\"08-CKD\", SUMIFS(#REF!,#REF!,A50),0)))","v":0}]
[]
[]
[]
["Numerator "]
[{"$f":"SUMIFS(INDIRECT(\"WF_CKD_DATA[[#All],[\"&$B$2&\"]]\"),#REF!,TRENDS!$B$4,#REF!,TRENDS!C61)","v":{"$error":"#REF!"}}]

{"sheet":"PRACTICE","index":5,"n_rows":40,"n_cols":14,"rows_kept":40,"cut":false,"hidden":true,"merged":[]}
[" -","Select Practice","Area","Locality","The Microfaculty **"]
["Y01291","Chingford Medical Practice","Chingford E4","WF-2",{"$f":"INDEX($A$1:$D$45,MATCH($E$1,$B$1:$B$45,0),1)","v":"F86638"},null,null,null,"Y01291","Chingford Medical Practice","Chingford E4",{"$f":"IF($K2=$M$2,$N$2,IF($K2=$M$3,$N$3,$N$4))","v":"WF-2"},"Chingford/ Walthamstow","WF-1"]
["F86627","Churchill Medical Centre","Chingford E4","WF-2",9,null,null,null,"F86627","Churchill Medical Centre","Chingford E4","WF-2","Chingford E4","WF-2"]
["F86078","The Ridgeway Surgery","Chingford E4","WF-2",{"$f":"\"'TRENDTABLE'!$A$\"&E3&\":$T$\"&E3","v":"'TRENDTABLE'!$A$9:$T$9"},null,null,null,"F86078","The Ridgeway Surgery","Chingford E4","WF-2","Leyton Collaborative","WF-3"]
["F86700","Kings Head Medical Practice","Chingford/ Walthamstow","WF-1",{"$f":"VLOOKUP(E2,A1:D41, 4, 0)","v":"WF-1"},null,null,null,"F86700","Kings Head Medical Practice","Chingford/ Walthamstow","WF-1","Forest Integrated Health","WF-4"]
["F86664","Larkshall Medical Centre","Chingford/ Walthamstow","WF-1",null,null,null,null,"F86664","Larkshall Medical Centre","Chingford/ Walthamstow","WF-1","South Leytonstone","WF-5"]
["F86616","Old Church Surgery","Chingford E4","WF-2",null,null,null,null,"F86616","Old Church Surgery","Chingford E4","WF-2","Central Walthamstow","WF-6"]
["F86638","The Microfaculty **","Chingford/ Walthamstow","WF-1",null,null,null,null,"F86638","The Microfaculty","Chingford/ Walthamstow","WF-1","Walthamstow West","WF-7"]
["F86011","The Manor Practice","Leyton Collaborative","WF-3",null,null,null,null,"F86011","The Manor Practice","Leyton Collaborative","WF-3"]
["F86036","The Allum Medical Centre","Forest Integrated Health","WF-4",null,null,null,null,"F86036","The Allum Medical Centre","Forest Integrated Health","WF-3"]
["F86038","Sma Medical Centre","Leyton Collaborative","WF-3",{"$f":"VLOOKUP(Summary!C6,PRACTICE!$B$2:$B$40,1,0)","v":"Leyton Healthcare (Oliver Road) **"},{"$f":"INDEX($A$2:$A$40,MATCH($E$11,$B$2:$B$40,0))","v":"F86074"},null,null,"F86038","Sma Medical Centre","Leyton Collaborative","WF-3"]
["F86044"," Crawley Road Medical Centre","Forest Integrated Health","WF-4",null,null,null,null,"F86044"," Crawley Road Medical Centre","Forest Integrated Health","WF-3"]
["F86696","Francis Road Medical Centre","Forest Integrated Health","WF-4",null,null,null,null,"F86696","Francis Road Medical Centre","Forest Integrated Health","WF-3"]
["F86621","Green Man Medical Centre","South Leytonstone","WF-5",null,null,null,null,"F86621","Green Man Medical Centre","South Leytonstone","WF-3"]
["F86712","Hampton Medical Centre","Forest Integrated Health","WF-4",null,null,null,null,"F86712","Hampton Medical Centre","Forest Integrated Health","WF-3"]
["F86045","High Road Surgery","South Leytonstone","WF-5",null,null,null,null,"F86045","High Road Surgery","South Leytonstone","WF-3"]
["F86701","Kiyani Medical Practice","South Leytonstone","WF-5",null,null,null,null,"F86701","Kiyani Medical Practice","South Leytonstone","WF-3"]
["F86650","Lime Tree Surgery","Forest Integrated Health","WF-4",null,null,null,null,"F86650","Lime Tree Surgery","Forest Integrated Health","WF-3"]
["F86625","LL Medical Care (Agarwal & Agrwal Practice)","South Leytonstone","WF-5",null,null,null,null,"F86625","LL Medical Care (Agarwal & Agrwal Practice)","South Leytonstone","WF-3"]
["F86666","The Harrow Road Surgery","South Leytonstone","WF-5",null,null,null,null,"F86666","The Harrow Road Surgery","South Leytonstone","WF-3"]
["F86705","The Langthorne Sharma Family Practice","South Leytonstone","WF-5",null,null,null,null,"F86705","The Langthorne Sharma Family Practice","South Leytonstone","WF-3"]
["F86088","The Lyndhurst Surgery","Forest Integrated Health","WF-4",null,null,null,null,"F86088","The Lyndhurst Surgery","Forest Integrated Health","WF-3"]
["F86074","Leyton Healthcare (Oliver Road) **","Leyton Collaborative","WF-3",null,null,null,null,"F86074","Leyton Healthcare (Oliver Road)","Leyton Collaborative","WF-3"]
["F86018","The Ecclesbourne Practice **","Forest Integrated Health","WF-4",null,null,null,null,"F86018","The Ecclesbourne Practice","Forest Integrated Health","WF-3"]
["F86607","Addison Road Medical Practice","Central Walthamstow","WF-6",null,null,null,null,"F86607","Addison Road Medical Practice","Central Walthamstow","WF-3"]
["F86708","Claremont Medical Centre","Central Walthamstow","WF-6",null,null,null,null,"F86708","Claremont Medical Centre","Central Walthamstow","WF-3"]
["F86001"," The Firs","Central Walthamstow","WF-6",null,null,null,null,"F86001"," The Firs","Central Walthamstow","WF-3"]
["F86005"," The Penryhn Surgery","Chingford/ Walthamstow","WF-1",null,null,null,null,"F86005"," The Penryhn Surgery","Chingford/ Walthamstow","WF-1"]
["F86086","Dr Dhital Practice","Central Walthamstow","WF-6",null,null,null,null,"F86086","Dr Dhital Practice","Central Walthamstow","WF-3"]
["F86006","Seymour Medical Centre","Walthamstow West","WF-7",null,null,null,null,"F86006","Seymour Medical Centre","Walthamstow West","WF-3"]
["F86626","Dr Shantir Practice","Chingford/ Walthamstow","WF-1",null,null,null,null,"F86626","Dr Shantir Practice","Chingford/ Walthamstow","WF-1"]
["F86030"," Queens Road Medical Centre","Walthamstow West","WF-7",null,null,null,null,"F86030"," Queens Road Medical Centre","Walthamstow West","WF-3"]
["F86062","Grove Surgery","Walthamstow West","WF-7",null,null,null,null,"F86062","Grove Surgery","Walthamstow West","WF-3"]
["F86679","Higham Hill Medical Centre","Walthamstow West","WF-7",null,null,null,null,"F86679","Higham Hill Medical Centre","Walthamstow West","WF-3"]
["Y01839","Lime Tree & Sinnott Healthcare Ltd","Chingford/ Walthamstow","WF-1",null,null,null,null,"Y01839","Lime Tree & Sinnott Healthcare Ltd","Chingford/ Walthamstow","LC1"]
["F86058","St James Medical Practice Ltd","Walthamstow West","WF-7",null,null,null,null,"F86058","St James Medical Practice Ltd","Walthamstow West"]
["F86689","The Bailey Practice","Chingford/ Walthamstow","WF-1",null,null,null,null,"F86689","The Bailey Practice","Chingford/ Walthamstow"]
["F86644","Waltham Forest Community & Family Health Services Ltd","Central Walthamstow","WF-6",null,null,null,null,"F86644","Waltham Forest Community & Family Health Services Ltd","Central Walthamstow"]
["F86026","Forest Surgery **","Chingford/ Walthamstow","WF-1",null,null,null,null,"F86026","Forest Surgery","Chingford/ Walthamstow"]
["F86004","Handsworth Medical Centre **","Chingford/ Walthamstow","WF-1",null,null,null,null,"F86004","Handsworth Medical Centre","Chingford E4"]

{"sheet":"HEADERTOGGLE","index":6,"n_rows":40,"n_cols":10,"rows_kept":40,"cut":false,"hidden":true,"merged":[]}
["Condition","Indicator Type",true,"Condition","Indicator Type",false,"Alphabetical","Quadrant",true,false]
["iLTC01-RV01","iLTC10-RA01",null,"Complex Care","COPD",null,"F86607","Y01291",null,{"$f":"IF(J1,\"Y\",\"\")","v":""}]
["iLTC03-CP04","iLTC10-RA02",null,"IC101-ICC01","IC205-COPD01",null,"Y01291","F86627",null,{"$f":"IF(J1,\"in financial year\",\"in last 12 months\")","v":"in last 12 months"}]
["iLTC03-PS03","iLTC05-AS01",null,"IC101-ICC02","IC205-COPD02",null,"F86627","F86700"]
["iLTC03-RV04","iLTC01-RV01",null,"IC101-ICC03","IC205-COPD03",null,"F86708","F86664"]
["iLTC04-CP05","iLTC05-RV02",null,"IC101-ICC04","Cancer",null,"F86044","F86616"]
["iLTC04-RV05","iLTC06-RV03",null,"IC101-ICC05","IC206-CAN01",null,"F86086","F86078"]
["iLTC05-CP01","iLTC03-RV04",null,"IC101-ICC06","IC206-CAN02",null,"F86626","LC1"]
["iLTC05-CP02","iLTC04-RV05",null,"IC101-ICC07","IC206-CAN03",null,"F86696","F86044"]
["iLTC05-CP03","iLTC05-CP01",null,"Hypertension","AUA",null,"F86621","F86696"]
["iLTC05-PS01","iLTC05-CP02",null,"IC201-HYP01","IC301-AUA03",null,"F86712","F86621"]
["iLTC05-RV02","iLTC05-CP03",null,"IC201-HYP02","IC301-AUA04",null,"F86045","F86712"]
["iLTC05-Tb05","iLTC03-CP04",null,"IC201-HYP03","Complex Care",null,"F86679","F86045"]
["iLTC05-Tb06","iLTC04-CP05",null,"IC201-HYP04","IC101-ICC01",null,"F86700","F86701"]
["iLTC05-Tc04","iLTC07-Tb01",null,"CVD","IC101-ICC02",null,"F86701","F86625"]
["iLTC05-Th01","iLTC12-Tb02",null,"IC202-CVD02","IC101-ICC03",null,"F86625","F86705"]
["iLTC05-AS01","iLTC08-Tb03",null,"IC202-CVD03","IC101-ICC04",null,"F86705","F86073"]
["iLTC06-RV03","iLTC09-Tb04",null,"IC202-CVD04","IC101-ICC05",null,"F86664","F86650"]
["iLTC07-Tb01","iLTC05-Tb05",null,"ECG","IC101-ICC06",null,"F86073","F86038"]
["iLTC08-Tb03","iLTC05-Tb06",null,"IC203-ECG01","IC101-ICC07",null,"Y01839","F86036"]
["iLTC09-Tb04","iLTC11-Tb07",null,"Diabetes","Hypertension",null,"F86650","F86666"]
["iLTC09-Tc02","iLTC12-Tc01",null,"IC204-DM01","IC201-HYP01",null,"F86005","F86088"]
["iLTC10-RA01","iLTC09-Tc02",null,"IC204-DM02","IC201-HYP02",null,"F86030","F86011"]
["iLTC10-RA02","iLTC11-Tc03",null,"IC204-DM03","IC201-HYP03",null,"F86006","Y02585"]
["iLTC10-TA01","iLTC05-Tc04",null,"IC204-DM04","IC201-HYP04",null,"F86038","LC2"]
["iLTC11-Tb07","iLTC05-Th01",null,"IC204-DM05","CVD",null,"F86058","F86607"]
["iLTC11-Tc03","iLTC10-TA01",null,"COPD","IC202-CVD02",null,"F86036","F86708"]
["iLTC12-Tb02","iLTC05-PS01",null,"IC205-COPD01","IC202-CVD03",null,"F86689","F86086"]
["iLTC12-Tc01","iLTC03-PS03",null,"IC205-COPD02","IC202-CVD04",null,"F86001","F86626"]
[null,null,null,"IC205-COPD03","ECG",null,"F86062","F86679"]
[null,null,null,"Cancer","IC203-ECG01",null,"F86666","Y01839"]
[null,null,null,"IC206-CAN01","Diabetes",null,"F86088","F86005"]
[null,null,null,"IC206-CAN02","IC204-DM01",null,"F86011","F86030"]
[null,null,null,"IC206-CAN03","IC204-DM02",null,"F86616","F86006"]
[null,null,null,"AUA","IC204-DM03",null,"Y02585","F86058"]
[null,null,null,"IC301-AUA03","IC204-DM04",null,"F86078","F86689"]
[null,null,null,"IC301-AUA04","IC204-DM05",null,"F86644","F86001"]
[null,null,null,null,null,null,"LC1","F86062"]
[null,null,null,null,null,null,"LC2","F86644"]
[null,null,null,null,null,null,"LC3","LC3"]

{"sheet":"HEADERINFO2","index":7,"n_rows":88,"n_cols":9,"rows_kept":88,"cut":false,"hidden":true,"merged":[]}
["SearchID","FieldID","LTC","Type","Search Title","Target1","Target2","Pay1","Pay2"]
["[00-00]","[00-00]","Listsize",null,"Listsize"]
["[08-CKD]","[08-CKD]","Complex Care","A","eGFR evidence of CKD"]
["NIS08-CKD01","NIS08-CKD01","Complex Care","A","evidence of CKD coded CKD"]
["NIS08-CKD01%","NIS08-CKD01%","Complex Care","A","% evidence of CKD coded CKD",0.7,null,0.4]
["NIS08-CKD02","NIS08-CKD02","Complex Care","A","evidence of CKD with BP below 140/90"]
["NIS08-CKD02%","NIS08-CKD02%","Complex Care","A","% evidence of CKD with BP below 140/90",0.7,null,0.1]
["NIS08-CKD03","NIS08-CKD03","Complex Care","A","evidence of CKD on Statins"]
["NIS08-CKD03%","NIS08-CKD03%","Complex Care","A","% evidence of CKD on Statins",0.7,null,0.1]
["NIS08-CKD04","NIS08-CKD04","Complex Care","A","evidence of CKD to have ACR"]
["NIS08-CKD04%","NIS08-CKD04%",null,null,"% evidence of CKD to have ACR"]
["NIS08-CKD08","NIS08-CKD08","Complex Care","A","Referred to community renal clinic",null,null,20]
[]
[]
[]
[]
[]
[]
["[01-IC2]","[01-IC2]","Hypertension","B","Hypertension IC-LTC"]
["01-HYP01","01-HYP01","Hypertension","B","eligible for ACR/PCR"]
["IC201-HYP01","IC201-HYP01","Hypertension","B","Proteinuria ACR/PCR 15m"]
["IC201-HYP01%","IC201-HYP01%","Hypertension","B","% Proteinuria ACR/PCR 15m",0.7,null,0.1]
["01-HYP02","01-HYP02","Hypertension","B","eligible for BP"]
["IC201-HYP02","IC201-HYP02","Hypertension","B","On Target - BP <140/90 12m"]
["IC201-HYP02%","IC201-HYP02%","Hypertension","B","% On Target - BP <140/90 12m",0.7,null,0.15]
["01-HYP03","01-HYP03","Hypertension","B","eligible for Pulse Check"]
["IC201-HYP03","IC201-HYP03","Hypertension","B","65+ yrs with Pulse Checck 15m"]
["IC201-HYP03%","IC201-HYP03%","Hypertension","B","% 65+ yrs with Pulse Check 15m",0.7,null,0.05]
["01-HYP04","01-HYP04","Hypertension","B","eligible for Statin prescription"]
["IC201-HYP04","IC201-HYP04","Hypertension","B","High risk CVD with Statins prescribed 12m"]
["IC201-HYP04%","IC201-HYP04%","Hypertension","B","% High risk CVD with Statins prescribed 12m",0.7,null,0.05]
["[02-IC2]","[02-IC2]","CVD","C","CVD IC-LTC"]
["02-CVD02","02-CVD02","CVD","C","eligible for CVD Statins"]
["IC202-CVD02","IC202-CVD02","CVD","C","On Target CVD"]
["IC202-CVD02%","IC202-CVD02%","CVD","C","% On Target CVD",0.7,0.3,0.05,0.15]
["02-CVD03","02-CVD03","CVD","C","eligible for CVD care plan"]
["IC202-CVD03","IC202-CVD03","CVD","C","CHD/ Stroke/ TIA patients with Annual care plan 15m"]
["IC202-CVD03%","IC202-CVD03%","CVD","C","% CHD/ Stroke/ TIA patients with Annual care plan 15m",0.7,null,0.05]
["02-CVD04","02-CVD04","CVD","C","eligible for AF Anticoagulation"]
["IC202-CVD04","IC202-CVD04","CVD","C","AF patients on Anticoagulants"]
["IC202-CVD04%","IC202-CVD04%","CVD","C","% AF patients on Anticoagulants",0.7,0.7,0.05,0.1]
["IC203-ECG01","IC203-ECG01","ECG","D","ECG Tests 2016-2017",null,null,12.5]
["[04-IC2]","[04-IC2]","Diabetes","E","Diabetes IC-LTC"]
["04-DM01","04-DM01","Diabetes","E","eligible for care plan"]
["IC204-DM01","IC204-DM01","Diabetes","E","Care plan agreed with pulse check >=65 15m"]
["IC204-DM01%","IC204-DM01%","Diabetes","E","% Care plan agreed with pulse check >=65 15m",0.7,0.9,0.02,0.05]
["04-DM02","04-DM02","Diabetes","E","eligible for BP control"]
["IC204-DM02","IC204-DM02","Diabetes","E","BP control (>140/80) and statins**"]
["IC204-DM02%","IC204-DM02%","Diabetes","E","% BP control (>140/80) and statins**",0.7,null,0.15]
["04-DM03","04-DM03","Diabetes","E","eligible for Digital Retinal Screening"]
["IC204-DM03","IC204-DM03","Diabetes","E","Digital Retinal Screening"]
["IC204-DM03%","IC204-DM03%","Diabetes","E","% Digital Retinal Screening",0.7,0.8,0.02,0.05]
["04-DM04","04-DM04","Diabetes","E","eligible for HbA1c"]
["IC204-DM04","IC204-DM04","Diabetes","E","18-64 yrs + HbA1C <59mmol/mol "]
["IC204-DM04%","IC204-DM04%","Diabetes","E","% 18-64 yrs + HbA1C <59mmol/mol ",0.7,0.65,0.02,0.05]
["04-DM05","04-DM05","Diabetes","E","Eligible for Diabetes Medication Reviews"]
["IC204-DM05","IC204-DM05","Diabetes","E","Medication Reviews"]
["IC204-DM05%","IC204-DM05%","Diabetes","E","Medication Reviews (hypoglycaemia prevention)","NT",null,null,0.05]
["[05-IC2]","[05-IC2]","COPD","F","COPD IC-LTC"]
["05-COPD01","05-COPD01","COPD","F","Eligible for COPD Review"]
["IC205-COPD01","IC205-COPD01","COPD","F","COPD review with SMP"]
["IC205-COPD01%","IC205-COPD01%","COPD","F","% COPD review with SMP",0.7,null,0.2]
["05-COPD02","05-COPD02","COPD","F","eligible for Pul Rehab (MRC 3+)"]
["IC205-COPD02","IC205-COPD02","COPD","F","COPD MRC 3+ + Ref to Pulmonary Rehab"]
["IC205-COPD02%","IC205-COPD02%","COPD","F","% COPD MRC 3+ + Ref to Pulmonary Rehab",0.7,null,0.1]
["05-COPD03","05-COPD03","COPD","F","eligible for reduced steriod inhalers"]
["IC205-COPD03","IC205-COPD03","COPD","F","Reduced Steriod Inhalers"]
["IC205-COPD03%","IC205-COPD03%","COPD","F","% Reduced Steriod Inhalers","-",null,0.05]
["[06-IC2]","[06-IC2]","Cancer","G","Cancer IC-LTC"]
["IC206-CAN01","IC206-CAN01","Cancer","G","RCGP Tool",null,null,70]
["IC206-CAN02","IC206-CAN02","Cancer","G","Cancer Care Review",null,null,40]
["IC206-CAN03","IC206-CAN03","Cancer","G","Zoladex/Prostap injections",null,null,43.5]
["IC301-AUA03","IC301-AUA03","AUA","H","Post-Admission Review",null,null,1.1499999999999999]
["IC301-AUA04","IC301-AUA04","AUA","H","Newly Consented LTC 2016-2017",null,null,0.28999999999999998]
["IC101-S01","IC101-S01",null,null,"IC Complex - Mandatory"]
["IC101-S02","IC101-S02",null,null,"IC Complex - Discretionary"]
["IC201-S01","IC201-S01",null,null,"Hypertension - On Target"]
["IC201-S02","IC201-S02",null,null,"Hypertension - Off Target"]
["IC202-S01","IC202-S01",null,null,"CVD - Newly Diagnosed"]
["IC202-S02","IC202-S02",null,null,"CVD - On Target"]
["IC204-S01","IC204-S01",null,null,"Diabetes - Newly Diagnosed"]
["IC204-S02","IC204-S02",null,null,"Diabetes - Controlled"]
["IC204-S03","IC204-S03",null,null,"Diabetes - Off Target"]
["IC204-S04","IC204-S04",null,null,"Diabetes - Off Target Complex"]
["IC204-S05","IC204-S05",null,null,"Diabetes - Off Target Non-Complex"]
["IC205-S01","IC205-S01",null,null,"COPD - Mild /Moderate/Severe"]
["IC205-S02","IC205-S02",null,null,"COPD - Very Severe"]
["IC205-S03","IC205-S03",null,null,"COPD - Housebound"]

{"sheet":"Locations","index":8,"n_rows":40,"n_cols":16,"rows_kept":40,"cut":false,"hidden":true,"merged":[]}
["Blank","01/04/2019","2019-05-01","2019-06-01","2019-07-01","2019-08-01","2019-09-01","2019-10-01","2019-11-01","2019-12-01","2020-01-01","2020-02-01","2020-03-01","2020-04-01","BLANK"]
["Data (Y/N)","Y","Y","Y","Y","Y","Y","Y","Y","Y","Y","Y","Y","Y"]
["File Name"]
["Q Work Sheet","Compiled_04_2018","Compiled_05_2018","Compiled_06_2018","Compiled_07_2018","Compiled_08_2018","Compiled_09_2018","Compiled_10_2018","Compiled_11_2018","Compiled_12_2018","Compiled_01_2019","Compiled_02_2019","Compiled_03_2019","Compiled_04_2019","BLANK",{"$f":"COUNTA(B4:N4)","v":13}]
["Sheet Address",{"$f":"\"'\"&IF(B3<>\"\",\"[\"&B3&\".xlsx]\",\"\")&IF(B2=\"N\",$O$5,B4)&\"'!\"","v":"'Compiled_04_2018'!"},"'Compiled_05_2018'!","'Compiled_06_2018'!","'Compiled_07_2018'!","'Compiled_08_2018'!","'Compiled_09_2018'!","'Compiled_10_2018'!","'Compiled_11_2018'!","'Compiled_12_2018'!","'Compiled_01_2019'!","'Compiled_02_2019'!","'Compiled_03_2019'!","'Compiled_04_2019'!",{"$f":"IF(O3<>\"\",\"[\"&O3&\".xlsx]\",\"\")&IF(O2=\"N\",\"\",O4)","v":"BLANK"}]
["Sheet Check",{"$f":"IF(ISREF(INDIRECT(B5&\"A1\")),\"OK\",\"WORKSHEET NOT FOUND\")","v":"OK"},"OK","OK","OK","OK","OK","OK","OK","OK","OK","OK","OK","OK"]
["Rows",{"$f":"MAX(IF(NOT(ISBLANK(INDIRECT(B5&\"A1:A500\"))),ROW($A$1:$A$500),0))","v":500},{"$f":"MAX(IF(NOT(ISBLANK(INDIRECT(C5&\"A1:A500\"))),ROW($A$1:$A$500),0))","v":500},{"$f":"MAX(IF(NOT(ISBLANK(INDIRECT(D5&\"A1:A500\"))),ROW($A$1:$A$500),0))","v":62},{"$f":"MAX(IF(NOT(ISBLANK(INDIRECT(E5&\"A1:A500\"))),ROW($A$1:$A$500),0))","v":500},{"$f":"MAX(IF(NOT(ISBLANK(INDIRECT(F5&\"A1:A500\"))),ROW($A$1:$A$500),0))","v":500},{"$f":"MAX(IF(NOT(ISBLANK(INDIRECT(G5&\"A1:A500\"))),ROW($A$1:$A$500),0))","v":500},{"$f":"MAX(IF(NOT(ISBLANK(INDIRECT(H5&\"A1:A500\"))),ROW($A$1:$A$500),0))","v":500},{"$f":"MAX(IF(NOT(ISBLANK(INDIRECT(I5&\"A1:A500\"))),ROW($A$1:$A$500),0))","v":500},{"$f":"MAX(IF(NOT(ISBLANK(INDIRECT(J5&\"A1:A500\"))),ROW($A$1:$A$500),0))","v":500},{"$f":"MAX(IF(NOT(ISBLANK(INDIRECT(K5&\"A1:A500\"))),ROW($A$1:$A$500),0))","v":500},{"$f":"MAX(IF(NOT(ISBLANK(INDIRECT(L5&\"A1:A500\"))),ROW($A$1:$A$500),0))","v":500},{"$f":"MAX(IF(NOT(ISBLANK(INDIRECT(M5&\"A1:A500\"))),ROW($A$1:$A$500),0))","v":500},{"$f":"MAX(IF(NOT(ISBLANK(INDIRECT(N5&\"A1:A500\"))),ROW($A$1:$A$500),0))","v":500}]
["Columns",{"$f":"COUNTA(INDIRECT(B5&\"1:1\"))","v":0},{"$f":"COUNTA(INDIRECT(C5&\"1:1\"))","v":0},{"$f":"COUNTA(INDIRECT(D5&\"1:1\"))","v":13},{"$f":"COUNTA(INDIRECT(E5&\"1:1\"))","v":0},{"$f":"COUNTA(INDIRECT(F5&\"1:1\"))","v":0},0,0,0,0,0,0,0,0]
["Data End",{"$f":"ADDRESS(B7,B8)","v":{"$error":"#VALUE!"}},{"$error":"#VALUE!"},"$M$62",{"$error":"#VALUE!"},{"$error":"#VALUE!"},{"$error":"#VALUE!"},{"$error":"#VALUE!"},{"$error":"#VALUE!"},{"$error":"#VALUE!"},{"$error":"#VALUE!"},{"$error":"#VALUE!"},{"$error":"#VALUE!"},{"$error":"#VALUE!"}]
["NACS",{"$f":"ADDRESS(1,MATCH($A$10,INDIRECT(Locations!$B$5&\"A1:BZ1\"),0))","v":{"$error":"#N/A"}},{"$f":"ADDRESS(1,MATCH($A$10,INDIRECT(Locations!$B$5&\"A1:BZ1\"),0))","v":{"$error":"#N/A"}},{"$f":"ADDRESS(1,MATCH($A$10,INDIRECT(Locations!$B$5&\"A1:BZ1\"),0))","v":{"$error":"#N/A"}},{"$f":"ADDRESS(1,MATCH($A$10,INDIRECT(Locations!$B$5&\"A1:BZ1\"),0))","v":{"$error":"#N/A"}},{"$f":"ADDRESS(1,MATCH($A$10,INDIRECT(Locations!$B$5&\"A1:BZ1\"),0))","v":{"$error":"#N/A"}},{"$f":"ADDRESS(1,MATCH($A$10,INDIRECT(Locations!$B$5&\"A1:BZ1\"),0))","v":{"$error":"#N/A"}},{"$f":"ADDRESS(1,MATCH($A$10,INDIRECT(Locations!$B$5&\"A1:BZ1\"),0))","v":{"$error":"#N/A"}},{"$f":"ADDRESS(1,MATCH($A$10,INDIRECT(Locations!$B$5&\"A1:BZ1\"),0))","v":{"$error":"#N/A"}},{"$f":"ADDRESS(1,MATCH($A$10,INDIRECT(Locations!$B$5&\"A1:BZ1\"),0))","v":{"$error":"#N/A"}},{"$f":"ADDRESS(1,MATCH($A$10,INDIRECT(Locations!$B$5&\"A1:BZ1\"),0))","v":{"$error":"#N/A"}},{"$f":"ADDRESS(1,MATCH($A$10,INDIRECT(Locations!$B$5&\"A1:BZ1\"),0))","v":{"$error":"#N/A"}},{"$f":"ADDRESS(1,MATCH($A$10,INDIRECT(Locations!$B$5&\"A1:BZ1\"),0))","v":{"$error":"#N/A"}},{"$f":"ADDRESS(1,MATCH($A$10,INDIRECT(Locations!$B$5&\"A1:BZ1\"),0))","v":{"$error":"#N/A"}}]
["NACS Range",{"$f":"B5&B10&\":\"&ADDRESS(B7,COLUMN(INDIRECT(B10)))","v":{"$error":"#N/A"}},{"$error":"#N/A"},{"$error":"#N/A"},{"$error":"#N/A"},{"$error":"#N/A"},{"$error":"#N/A"},{"$error":"#N/A"},{"$error":"#N/A"},{"$error":"#N/A"},{"$error":"#N/A"},{"$error":"#N/A"},{"$error":"#N/A"},{"$error":"#N/A"}]
["Header Range",{"$f":"B$5&B10&\":\"&ADDRESS(1,B8)","v":{"$error":"#N/A"}},{"$error":"#N/A"},{"$error":"#N/A"},{"$error":"#N/A"},{"$error":"#N/A"},{"$error":"#N/A"},{"$error":"#N/A"},{"$error":"#N/A"},{"$error":"#N/A"},{"$error":"#N/A"},{"$error":"#N/A"},{"$error":"#N/A"},{"$error":"#N/A"}]
["Data Range",{"$f":"B$5&B10&\":\"&B9","v":{"$error":"#N/A"}},{"$error":"#N/A"},{"$error":"#N/A"},{"$error":"#N/A"},{"$error":"#N/A"},{"$error":"#N/A"},{"$error":"#N/A"},{"$error":"#N/A"},{"$error":"#N/A"},{"$error":"#N/A"},{"$error":"#N/A"},{"$error":"#N/A"},{"$error":"#N/A"}]
[]
["Data Run","01/12/2018"]
[null,null,null,null,null,null,"01/04/2021","2021-04-01"]
["Payment Month ",{"$f":"INDEX(B1:M1,1,B21)","v":{"$error":"#REF!"}},null,"Audit Select ",{"$f":"VLOOKUP(E21,G16:H28,2,0)","v":"2022-04-01"},null,"01/05/2021","2021-05-01"]
["NACS Range",{"$f":"OFFSET($A$1,MATCH($A18,Locations!$A$1:$A$13,0)-1,MATCH($B$17,$A$1:$O$1,0)-1)","v":{"$error":"#REF!"}},null,"NACS Range",{"$f":"OFFSET($A$1,MATCH($A18,Locations!$A$1:$A$13,0)-1,MATCH($E$17,$A$1:$O$1,0)-1)","v":{"$error":"#N/A"}},null,"01/06/2021","2021-06-01"]
["Header Range",{"$f":"OFFSET($A$1,MATCH($A19,Locations!$A$1:$A$13,0)-1,MATCH($B$17,$A$1:$O$1,0)-1)","v":{"$error":"#REF!"}},null,"Header Range",{"$f":"OFFSET($A$1,MATCH($A19,Locations!$A$1:$A$13,0)-1,MATCH($E$17,$A$1:$O$1,0)-1)","v":{"$error":"#N/A"}},null,"01/07/2021","2021-07-01"]
["Data Range",{"$f":"OFFSET($A$1,MATCH($A20,Locations!$A$1:$A$13,0)-1,MATCH($B$17,$A$1:$O$1,0)-1)","v":{"$error":"#REF!"}},null,"Data Range",{"$f":"SUMIFS(#REF!,Locations!E17,#REF!)","v":{"$error":"#REF!"}},null,"01/08/2021","2021-08-01"]
["Current Month #",{"$f":"COUNTA($B$4:$N$4)","v":13},null,"Selection ","01/04/2022",null,"01/09/2021","2021-09-01"]
[null,null,null,null,null,null,"01/10/2021","2021-10-01"]
["Listsize","2018-12-01",null,null,null,null,"01/11/2021","2021-11-01"]
["NACS Range",{"$f":"OFFSET($A$1,MATCH($A24,Locations!$A$1:$A$13,0)-1,MATCH($B$23,$A$1:$O$1,0)-1)","v":{"$error":"#N/A"}},null,null,null,null,"01/12/2021","2021-12-01"]
["Header Range",{"$f":"OFFSET($A$1,MATCH($A25,Locations!$A$1:$A$13,0)-1,MATCH($B$23,$A$1:$O$1,0)-1)","v":{"$error":"#N/A"}},null,null,null,null,"01/01/2022","2022-01-01"]
["Data Range",{"$f":"OFFSET($A$1,MATCH($A26,Locations!$A$1:$A$13,0)-1,MATCH($B$23,$A$1:$O$1,0)-1)","v":{"$error":"#N/A"}},null,null,null,null,"01/02/2022","2022-02-01"]
[null,null,null,null,null,null,"01/03/2022","2022-03-01"]
["Version","CKD v5.0.5",null,null,null,null,"01/04/2022","2022-04-01"]
[null,"Header Info:"]
["File Name"]
["Work Sheet","HEADERINFO2"]
["Rows",{"$f":"MAX(IF(NOT(ISBLANK(INDIRECT(B34&\"B1:B500\"))),ROW(A3:A501),0))","v":90}]
["Columns",{"$f":"COUNTA(INDIRECT(B34&\"A1:NZ1\"))","v":9}]
["Sheet Address",{"$f":"\"'\"&B31&\"'!\"","v":"'HEADERINFO2'!"}]
["Data End",{"$f":"ADDRESS(B32,B33)","v":"$I$90"}]
["FieldID","$B$1"]
["FieldID Range",{"$f":"B34&B36&\":\"&ADDRESS(B32,COLUMN(INDIRECT(B36)))","v":"'HEADERINFO2'!$B$1:$B$90"}]
["Header Range",{"$f":"B34&B36&\":\"&ADDRESS(1,B33)","v":"'HEADERINFO2'!$B$1:$I$1"}]
["Data Range",{"$f":"B34&B36&\":\"&B35","v":"'HEADERINFO2'!$B$1:$I$90"}]
["Search Title","$E$1"]

{"sheet":"BLANK","index":9,"n_rows":61,"n_cols":12,"rows_kept":61,"cut":false,"hidden":true,"merged":[]}
["PracName","NW","NACS","Worksheet","[00-00]","[08-CKD]","NIS08-CKD01","NIS08-CKD01%","NIS08-CKD02","NIS08-CKD02%","NIS08-CKD03","NIS08-CKD03%"]
[null,null,null,"Seach Code:","[00-00]","[08-CKD]","NIS08-CKD01","NIS08-CKD01%","NIS08-CKD02","NIS08-CKD02%","NIS08-CKD03","NIS08-CKD03%"]
["BLANK",null,null,"Found EMISweb Search:","[00-00] Listsize","[08-CKD] eGFR evidence of CKD","NIS08-CKD01: evidence of CKD coded CKD (QOF v33)",null,"NIS08-CKD02: evidence of CKD with appropriate BP",null,"NIS08-CKD03: evidence of CKD on Statins"]
[null,null,null,"Top Left EMISweb Data:","$A$1","$A$46","$A$92",null,"$A$137",null,"$A$183"]
[null,null,null,"EMISweb Array Start:","$B$1","$B$46","$B$92",null,"$B$137",null,"$B$183"]
["2016-07-01",null,null,"EMISweb Array End:","$C$45","$C$91","$C$136",null,"$C$182",null,"$C$227"]
["Payment",null,"Payment"]
["Bethnal Green Health Centre","NW1","F84083",null,"-","-","-","-","-","-","-","-"]
["The Mission Practice","NW1","F84016",null,"-","-","-","-","-","-","-","-"]
["Globe Town Surgery","NW1","F84123",null,"-","-","-","-","-","-","-","-"]
["Pollard Row Surgery","NW1","Y00212",null,"-","-","-","-","-","-","-","-"]
["Strouts Place Medical Centre","NW1","F84051",null,"-","-","-","-","-","-","-","-"]
["Spitalfields Practice","NW2","F84081",null,"-","-","-","-","-","-","-","-"]
["Blithehale Medical Centre","NW2","F84718",null,"-","-","-","-","-","-","-","-"]
["Health E1","NW2","F84733",null,"-","-","-","-","-","-","-","-"]
["Albion Health Centre","NW2","F84012",null,"-","-","-","-","-","-","-","-"]
["Harford Health Centre","NW3","F84087",null,"-","-","-","-","-","-","-","-"]
["Brayford Square (Dr Varma)","NW3","F84046",null,"-","-","-","-","-","-","-","-"]
["Whitechapel Health (Shah Jalal)","NW3","F84039",null,"-","-","-","-","-","-","-","-"]
["City Wellbeing Practice (Tower Medical)","NW3","F84114",null,"-","-","-","-","-","-","-","-"]
["Wapping Group Practice","NW4","F84079",null,"-","-","-","-","-","-","-","-"]
["Jubilee Street Practice","NW4","F84031",null,"-","-","-","-","-","-","-","-"]
["St Katharine Docks Practice","NW4","F84731",null,"-","-","-","-","-","-","-","-"]
["East One Health","NW4","F84682",null,"-","-","-","-","-","-","-","-"]
["Harley Grove Medical Centre","NW5","F84044",null,"-","-","-","-","-","-","-","-"]
["St Stephens Health Centre","NW5","F84034",null,"-","-","-","-","-","-","-","-"]
["Ruston Street Clinic (Dr Amin)","NW5","F84030",null,"-","-","-","-","-","-","-","-"]
["Grove Road Surgery (Dr Shah)","NW5","F84055",null,"-","-","-","-","-","-","-","-"]
["The Tredegar Practice","NW5","F84696",null,"-","-","-","-","-","-","-","-"]
["Stroudley Walk Centre","NW6","F84676",null,"-","-","-","-","-","-","-","-"]
["St Andrews Health Centre","NW6","Y03023",null,"-","-","-","-","-","-","-","-"]
["Merchant Street (Dr Rana)","NW6","F84118",null,"-","-","-","-","-","-","-","-"]
["St Pauls Way Medical Centre","NW6","F84714",null,"-","-","-","-","-","-","-","-"]
["Limehouse Practice (Gill Street)","NW7","F84054",null,"-","-","-","-","-","-","-","-"]
["Chrisp Street Health Centre","NW7","F84062",null,"-","-","-","-","-","-","-","-"]
["Aberfeldy Practice","NW7","F84698",null,"-","-","-","-","-","-","-","-"]
["All Saints Practice","NW7","F84702",null,"-","-","-","-","-","-","-","-"]
["Gough Walk (Dr Selvan)","NW7","F84025",null,"-","-","-","-","-","-","-","-"]
["Island Health","NW8","F84710",null,"-","-","-","-","-","-","-","-"]
["Docklands Medical Centre","NW8","F84656",null,"-","-","-","-","-","-","-","-"]
["Island Medical Centre","NW8","F84647",null,"-","-","-","-","-","-","-","-"]
["Barkantine Practice","NW8","F84747",null,"-","-","-","-","-","-","-","-"]
["Bromley-By-Bow Health Centre","NW6","F841229B1G",null,"-","-","-","-","-","-","-","-"]
["XX Place Surgery","NW2","F841229B1F",null,"-","-","-","-","-","-","-","-"]
[null,null,null,"Found EMISweb Search:","-","-","-","-","-","-","-","-"]
[null,null,null,"Top Left EMISweb Data:","-","-","-","-","-","-","-","-"]
[null,null,null,"EMISweb Array Start:","-","-","-","-","-","-","-","-"]
[null,null,null,"EMISweb Array End:","-","-","-","-","-","-","-","-"]
["The One Network",null,"NW1",null,"-","-","-","-","-","-","-","-"]
["East End Health Network",null,"NW2",null,"-","-","-","-","-","-","-","-"]
["Stepney and Whitechapel Network",null,"NW3",null,"-","-","-","-","-","-","-","-"]
["The Highway Network",null,"NW4",null,"-","-","-","-","-","-","-","-"]
["Bow Health Network",null,"NW5",null,"-","-","-","-","-","-","-","-"]
["Mile End East and Bromley by Bow Network",null,"NW6",null,"-","-","-","-","-","-","-","-"]
["Poplar and Limehouse Network",null,"NW7",null,"-","-","-","-","-","-","-","-"]
["Healthy Island Network",null,"NW8",null,"-","-","-","-","-","-","-","-"]
[null,null,"Total","Networks","-","-","-","-","-","-","-","-"]
[null,null,null,"Practices","-","-","-","-","-","-","-","-"]
[null,null," -"," -"," -"," -"," -"," -"," -",{"$error":"#VALUE!"}," -"," -"]
["Target3",null,"Target3"]
["Target4",null,"Target4"]

{"sheet":"CHART","index":10,"n_rows":46,"n_cols":6,"rows_kept":46,"cut":false,"hidden":true,"merged":[[45,1,46,2],[45,3,46,3],[39,1,40,2],[39,3,40,3],[41,1,42,2],[41,3,42,3],[43,1,44,2],[43,3,44,3],[33,1,34,2],[33,3,34,3],[35,1,36,2],[35,3,36,3],[37,1,38,2],[37,3,38,3]]}
["Chart Selection ","evidence of CKD with ACR",{"$f":"VLOOKUP(B1,B2:C4,2,0)","v":"NIS08-CKD04"}]
["Chart List ","evidence of CKD with BP below 140/90","NIS08-CKD02","evidence of CKD not coded CKD","NIS08-CKD02%",{"$f":"IFERROR(TRENDS!AA51,#N/A)","v":0.54705036998356105}]
[null,"evidence of CKD on Statins","NIS08-CKD03","evidence of CKD with BP below 140/90","NIS08-CKD03%",{"$f":"IFERROR(TRENDS!AC51,#N/A)","v":0.70310558287567415}]
[null,"evidence of CKD with ACR","NIS08-CKD04","evidence of CKD not on Statins","NIS08-CKD04%",{"$f":"IFERROR(TRENDS!AE51,#N/A)","v":0.32127946963608123}]
[]
[]
[{"$f":"PRACTICE!E2","v":"F86638"},null,"Completed","< Min","Remain to min"]
["[08-CKD]",{"$f":"Detail!G6","v":"eGFR evidence of CKD"},{"$f":"IF(SUMIFS(WF_CKD_DATA[[#All],[08-CKD]],WF_CKD_DATA[[#All],[OrgID]],CHART!A7,WF_CKD_DATA[[#All],[Rel_D]],Locations!E17)=0,\"-\",(SUMIFS(WF_CKD_DATA[[#All],[08-CKD]],WF_CKD_DATA[[#All],[OrgID]],CHART!A7,WF_CKD_DATA[[#All],[Rel_D]],Locations!E17)))","v":275},{"$f":"C8","v":275}]
[{"$f":"C1","v":"NIS08-CKD04"},{"$f":"INDIRECT(\"B\"&(MATCH(A9,C2:C4)+1))","v":"evidence of CKD with ACR"},{"$f":"IF(SUMIFS(INDIRECT(\"WF_CKD_DATA[[#All],[\"&$A$9&\"]]\"),WF_CKD_DATA[[#All],[OrgID]],$A$7,WF_CKD_DATA[[#All],[Rel_D]],Locations!$E$17)=0,\"-\",(SUMIFS(INDIRECT(\"WF_CKD_DATA[[#All],[\"&$A$9&\"]]\"),WF_CKD_DATA[[#All],[OrgID]],$A$7,WF_CKD_DATA[[#All],[Rel_D]],Locations!$E$17)))","v":"-"},{"$f":"IFERROR(C8*D12,\"-\")","v":137.5},{"$f":"IFERROR(ROUND(MAX(D9-C9,0),0),\"-\")","v":"-"}]
["xx",{"$f":"VLOOKUP(A9,C2:D4,2,0)","v":"evidence of CKD not on Statins"},{"$f":"IFERROR(C8-C9,\"-\")","v":"-"},{"$f":"IFERROR(D8-D9,\"-\")","v":137.5}]
[]
[{"$f":"A9&\"%\"","v":"NIS08-CKD04%"},null,{"$f":"IFERROR(C9/C8,\"-\")","v":"-"},{"$f":"VLOOKUP(A9,TRENDS!$B$16:$C$19,2,0)","v":0.5},{"$f":"IFERROR(D12-C12,\"-\")","v":"-"}]
["not%",null,{"$f":"IFERROR(1-C12,\"-\")","v":"-"},{"$f":"1-D12","v":0.5}]
["Ave",{"$f":"VLOOKUP(A12,E2:F4,2,0)","v":0.32127946963608123}]
[]
[]
[]
[]
[null,null,null,{"$f":"IFERROR(D9/D8,\"-\")","v":0.5}]
[]
[]
[]
[]
[]
[]
[]
[]
[]
[]
[]
[]
[]
[]
[null,"ELIGIBLE",null,{"$f":"_xlfn.IFNA( CHART!B35, \"-\")","v":0}]
[]
[null,"AIM%",null,{"$f":"_xlfn.IFNA(CHART!C39,\"-\")","v":0}]
[]
[null,"TOTAL REMAINING",null,{"$f":"_xlfn.IFNA(CHART!B37,\"-\")","v":0}]
[]
[null,"MIN REMAINING",null,{"$f":"_xlfn.IFNA(CHART!D36,\"-\")","v":0}]
[]
[null,"COMPLETED",null,{"$f":"_xlfn.IFNA(CHART!B36,\"-\")","v":"AIM%"}]
[]
[null,"ACHIEVED%",null,{"$f":"_xlfn.IFNA(CHART!B39,\"-\")","v":0}]
[]
[null,"WF AVERAGE%",null,{"$f":"_xlfn.IFNA(CHART!A41, \"-\")","v":0}]

{"sheet":"Sheet2","index":11,"n_rows":5,"n_cols":7,"rows_kept":5,"cut":false,"hidden":true,"merged":[]}
["Column1","Column2","Column3","Column4","Column5","Column6","Column7"]
["Column8","Column10","Column11","Column12","Column13","Column14","Column15"]
["Search","{00-00} Listsize","{08-CKD} eGFR evidence of CKD","{NIS08-CKD01}: evidence of CKD coded CKD (QOF v46)","{NIS08-CKD02}: evidence of CKD with BP below 140/90","{NIS08-CKD03}: evidence of CKD on Statins","NIS08-CKD04: evidence of CKD has ACR"]
["OrgID","00-00","08-CKD","NIS08-CKD01","NIS08-CKD02","NIS08-CKD03","NIS08-CKD04"]
["OrgID","Listsize","eGFR evidence of CKD"," evidence of CKD coded CKD (QOF v33","evidence of CKD with BP below 140/90","evidence of CKD on Statins","evidence of CKD has ACR"]

{"sheet":"Sheet3","index":12,"n_rows":10,"n_cols":4,"rows_kept":10,"cut":false,"hidden":true,"merged":[]}
["Metric","MetricID","Target1","Target2"]
["MHA Depression Review + Activity (12M)",1,0.35]
["MHA Depression Review + Activity (IN YEAR)",2,0.35]
["Anti-Psych non-SMI Review + Activity (12M)",3,0.7]
["Anti-Psych non-SMI Review + Activity (IN YEAR)",4,0.7]
["SMI Review + Activity (12M)",5,0.7]
["SMI Review + Activity (IN YEAR)",6,0.7]
["EPC Action Plan (FY)",7]
["EPC Post-Discharge Review (FY) + EPC (2FY)",8]
["Neuroleptic Injection Patients (Q1-Q4 Total)",9]

{"sheet":"Sheet4","index":13,"n_rows":273,"n_cols":18,"rows_kept":273,"cut":false,"hidden":true,"merged":[]}
["Status","Practice ID","Practice","Locality ID","Locality","SubLocality ID","SubLocality","PCN/Network","PCN code","Clinical System","Address 1","Address 2","Postcode","Grid Reference","X (easting)","Y (northing)","Latitude","Longitude"]
["Active","F82001","Halbutt Street Surgery","BK","Barking and Dagenham","BK-1","East","Network East","U86966","EMISweb","2 Halbutt Street","Dagenham","RM9 5AS","TQ 48956 85305",548956,185305,51.546982999999997,0.14681208000000001]
["Active","F82005","Church Elm Lane Medical Practice","BK","Barking and Dagenham","BK-1","East","Network East","U86967","EMISweb","Church Elm Lane","Dagenham","RM10 9RR","TQ 49667 84556",549667,184556,51.540066000000003,0.15673988]
["Active","Y01719","Broad Street Medical Centre","BK","Barking and Dagenham","BK-1","East","Network East","U86968","EMISweb","Broad Street Resource Centre","Dagenham","RM10 9HU","TQ 49367 83962",549367,183962,51.534807999999998,0.15216547999999999]
["Active","Y02575","Porters Avenue Doctors Surgery","BK","Barking and Dagenham","BK-1","East","Network East","U86969","EMISweb","234 Porters Avenue","Dagenham","RM8 2EQ","TQ 47283 85077",547283,185077,51.545372999999998,0.12260706]
["Active","F82003","First Avenue Surgery","BK","Barking and Dagenham","BK-2","East One","Network East One","U27362","EMISweb","2 First Avenue","Dagenham","RM10 9AT","TQ 49762 83388",549762,183388,51.529546000000003,0.15761231000000001]
["Active","F82015","Hedgemans Surgery","BK","Barking and Dagenham","BK-2","East One","Network East One","U27362","EMISweb","92 Hedgemans Road","Dagenham","RM9 6HT","TQ 48734 84495",548734,184495,51.539763999999998,0.14327081999999999]
["Active","F82017","St Albans Surgery ","BK","Barking and Dagenham","BK-2","East One","Network East One","U27362","EMISweb","Urswick Road","Dagenham","RM9 6EA","TQ 48052 84181",548052,184181,51.537121999999997,0.13331214999999999]
["Active","F82621","The Surgery (Dr Ola)","BK","Barking and Dagenham","BK-2","East One","Network East One","U27362","EMISweb","36 Dewey Road","Dagenham","RM10 8AR","TQ 50141 84824",550141,184824,51.542347999999997,0.16368373999999999]
["Active","F82634","Heathway Medical Centre","BK","Barking and Dagenham","BK-2","East One","Network East One","U27362","EMISweb","Morland Road ","Dagenham","RM10 9HU","TQ 49367 83962",549367,183962,51.534807999999998,0.15216547999999999]
["Active","F82678","Dr Alkaisy Surgery ","BK","Barking and Dagenham","BK-2","East One","Network East One","U27362","EMISweb","Urswick Road","Dagenham","RM9 6EA","TQ 48052 84181",548052,184181,51.537121999999997,0.13331214999999999]
["Active","F82679","Parkview Medical Practice","BK","Barking and Dagenham","BK-2","East One","Network East One","U27362","EMISweb","199 Reede Road","Dagenham","RM10 8EJ","TQ 49877 85126",549877,185126,51.545130999999998,0.16000821000000001]
["Active","F82034","Victoria Medical Centre","BK","Barking and Dagenham","BK-3","West","Network West","U26744","EMISweb","1 Queens Road","Barking","IG11 8GD","TQ 44085 84494",544085,184494,51.540959999999998,7.6282445000000004E-2]
["Active","F82042","Aurora Medcare","BK","Barking and Dagenham","BK-3","West","Network West","U26744","EMISweb","1 King Edwards Road","Barking","IG11 7TB","TQ 44643 83708",544643,183708,51.533754999999999,8.4000310999999994E-2]
["Active","F82625","Abbey Medical centre","BK","Barking and Dagenham","BK-3","West","Network West","U26744","EMISweb","1 Harpour Road","Barking","IG11 8RJ","TQ 44215 84642",544215,184642,51.542256000000002,7.8216283999999997E-2]
["Active","Y01280","Shifa Medical Practice","BK","Barking and Dagenham","BK-3","West","Network West","U26744","EMISweb","Gasgoine Road","Barking","IG11 7RS","TQ 44478 83438",544478,183438,51.531371,8.1512427999999998E-2]
["Active","F82018","Barking Medical  Group Practice","BK","Barking and Dagenham","BK-4","West One","Network West One","U11211","EMISweb","130 Upney lane","Barking","IG11 9LT","TQ 45536 84574",545536,184574,51.541307000000003,9.7223614999999999E-2]
["Active","F82040","John Smith House","BK","Barking and Dagenham","BK-4","West One","Network West One","U11211","EMISweb","145-207 Bevan Avenue","Barking","IG11 9NS","TQ 46496 84245",546496,184245,51.538102000000002,0.11091985]
["Active","F82612","The White House","BK","Barking and Dagenham","BK-4","West One","Network West One","U11211","EMISweb","12 Movers Lane","Barking","IG11 7UN","TQ 44930 83744",544930,183744,51.534005000000001,8.8149991999999996E-2]
["Active","F82647","Dr Gupta & Partner","BK","Barking and Dagenham","BK-4","West One","Network West One","U11211","EMISweb","7 Salisbury Avenue","Barking","IG11 9XQ","TQ 44605 84272",544605,184272,51.538831999999999,8.3684289999999995E-2]
["Active","F82650","Ripple Road Medical Centre","BK","Barking and Dagenham","BK-4","West One","Network West One","U11211","EMISweb","343 Ripple Road","Barking","IG11 7RJ","TQ 45217 83938",545217,183938,51.535674,9.2364823999999998E-2]
["Active","F82680","Highgrove Surgery","BK","Barking and Dagenham","BK-4","West One","Network West One","U11211","SystmOne","Upney Lane ","Barking","IG11 9LX","TQ 45644 84306",545644,184306,51.538871,9.8669044999999997E-2]
["Active","F82027","Faircross Health Centre","BK","Barking and Dagenham","BK-5","North","Network North","U55387","EMISweb","51 Upney Lane","Barking","IG11 9LP","TQ 45367 84850",545367,184850,51.54383,9.4902305000000006E-2]
["Active","F82012","Five Elms","BK","Barking and Dagenham","BK-5","North","Network North","U55387","EMISweb","Five Elms Road","Dagenham","RM9 5TT","TQ 48622 86004",548622,186004,51.553351999999997,0.14229391]
["Active","F82025","Julia Engwell Surgery","BK","Barking and Dagenham","BK-5","North","Network North","U55387","EMISweb","Woodward Road","Dagenham","RM9 4SR","TQ 47520 84362",547520,184362,51.538887000000003,0.12572291999999999]
["Active","F82051","Laburnum Health centre","BK","Barking and Dagenham","BK-5","North","Network North","U55387","EMISweb","11 Althorne Way","Dagenham","RM10 7DF","TQ 49234 86817",549234,186817,51.560495000000003,0.15145929999999999]
["Active","F82642","Gables Surgery","BK","Barking and Dagenham","BK-5","North","Network North","U55387","EMISweb","Markyate Road","Dagenham","RM8 2LD","TQ 46953 85105",546953,185105,51.545710999999997,0.11786323999999999]
["Active","F82661","Green Lane Surgery","BK","Barking and Dagenham","BK-5","North","Network North","U55387","EMISweb","872 Green Lane","Dagenham","RM8 1BX","TQ 48005 86869",548005,186869,51.561286000000003,0.13376487000000001]
["Active","F86040","The Surgery","BK","Barking and Dagenham","BK-5","North","Network North","U55387","EMISweb","620 Longbridge Road","Dagenham","RM8 2AJ","TQ 46755 85732",546755,185732,51.551395999999997,0.11527123]
["Active","Y01795","Oval Road Practice","BK","Barking and Dagenham","BK-5","North","Network North","U55388","EMISweb","69 Oval Road North","Dagenham","RM10 9ET","TQ 49697 83763",549697,183763,51.532933,0.15683522999999999]
["Active","F82038","Valence Medical Centre","BK","Barking and Dagenham","BK-5","North","Network North","U55389","EMISweb","563 Valence Avenue","Dagenham","RM8 3RH","TQ 47822 85951",547822,185951,51.553086,0.13074125]
["Active","F82604","Marks Gate Medical Practice","BK","Barking and Dagenham","BK-6","Central","Network Central","U92874","EMISweb","Lawn Farm Grove","Dagenham","RM6 5LL","TQ 48155 89472",548155,189472,51.584634999999999,0.13702396999999999]
["Active","F82660","Tulasi Medical Centre","BK","Barking and Dagenham","BK-6","Central","Network Central","U92874","EMISweb","10 Bennetts Castle Lane","Dagenham","RM8 3XU","TQ 47363 86819",547363,186819,51.561005000000002,0.12448914]
["Active","F82677","Becontree Medical Centre","BK","Barking and Dagenham","BK-6","Central","Network Central","U92874","EMISweb","645 Becontree Avenue","Dagenham","RM8 3HP","TQ 48516 86671",548516,186671,51.559373000000001,0.1410476]
["Active","F84013","Stamford Hill Surgery ","CH","City & Hackney","CH-NE1","Springfield Park (NE1)","Springfield Park (NE1)","U89154","EMISweb","2 Egerton Road","Stamford Hill","N16 6UA","TQ 33741 87885",533741,187885,51.573976000000002,-7.1492951999999999E-2]
["Active","F84686","Cranwich Road Surgery ","CH","City & Hackney","CH-NE1","Springfield Park (NE1)","Springfield Park (NE1)","U89154","EMISweb","62 Cranwich Road",null,"N16 5JF","TQ 33045 87827",533045,187827,51.573619000000001,-8.1552204000000003E-2]
["Active","Y03049","Spring Hill Practice","CH","City & Hackney","CH-NE1","Springfield Park (NE1)","Springfield Park (NE1)","U89154","EMISweb","19-21 Oldhill Street",null,"N16 6LU","TQ 34202 87381",534202,187381,51.569336999999997,-6.5037069000000003E-2]
["Active","F84018","The Nightingale Practice","CH","City & Hackney","CH-NE2","Hackney Downs (NE2)","Hackney Downs (NE2)","U21268","EMISweb","10 Kenninghall Rd","Clapton","E5 8BY","TQ 34412 86145",534412,186145,51.55818,-6.2481117000000003E-2]
["Active","F84080","The Gadvhi Practice","CH","City & Hackney","CH-NE2","Hackney Downs (NE2)","Hackney Downs (NE2)","U21268","EMISweb","1a Fountayne Road",null,"N16 7EA","TQ 34209 86834",534209,186834,51.564419999999998,-6.5144830000000001E-2]
["Active","F84619","The Riverside Practice","CH","City & Hackney","CH-NE2","Hackney Downs (NE2)","Hackney Downs (NE2)","U21268","EMISweb","14 Urban Hive, Theydon Rd",null,"E5 9BQ","TQ 35164 86953",535164,186953,51.565261999999997,-5.1329751999999999E-2]
["Active","F84668","Clapton Surgery","CH","City & Hackney","CH-NE2","Hackney Downs (NE2)","Hackney Downs (NE2)","U21268","EMISweb","14 Theydon Road",null,"E5 9BQ","TQ 35164 86953",535164,186953,51.565261999999997,-5.1329751999999999E-2]
["Active","F84685","Elm Practice","CH","City & Hackney","CH-NE2","Hackney Downs (NE2)","Hackney Downs (NE2)","U21268","EMISweb","1a Fountayne Road",null,"N16 7EA","TQ 34209 86834",534209,186834,51.564419999999998,-6.5144830000000001E-2]
["Active","F84711","Rosewood Practice","CH","City & Hackney","CH-NE2","Hackney Downs (NE2)","Hackney Downs (NE2)","U21268","EMISweb","1a Fountayne Road",null,"N16 7EA","TQ 34209 86834",534209,186834,51.564419999999998,-6.5144830000000001E-2]
["Active","F84720","Healy Medical Centre","CH","City & Hackney","CH-NE2","Hackney Downs (NE2)","Hackney Downs (NE2)","U21268","EMISweb","200 Upper Clapton Road",null,"E5 9HD","TQ 35028 87268",535028,187268,51.568125000000002,-5.3169741999999999E-2]
["Active","F84036","Cedar Practice ","CH","City & Hackney","CH-NW1","Woodberry Wetlands (NW1)","Woodberry Wetlands (NW1)","U46293","EMISweb","John Scott Health Centre","Green Lanes","N4 2NU","TQ 32221 87203",532221,187203,51.568204999999999,-9.3670042999999995E-2]
["Active","F84115","Statham Grove Surgery","CH","City & Hackney","CH-NW1","Woodberry Wetlands (NW1)","Woodberry Wetlands (NW1)","U46293","EMISweb","Statham Grove",null,"N16 9DP","TQ 32544 86016",532544,186016,51.557462999999998,-8.9459644000000005E-2]
["Active","F84119","The Heron Practice","CH","City & Hackney","CH-NW1","Woodberry Wetlands (NW1)","Woodberry Wetlands (NW1)","U46293","EMISweb","John Scott Health Centre","Green Lanes","N4 2NU","TQ 32221 87203",532221,187203,51.568204999999999,-9.3670042999999995E-2]
["Active","F84716","Allerton Road Medical Centre","CH","City & Hackney","CH-NW1","Woodberry Wetlands (NW1)","Woodberry Wetlands (NW1)","U46293","EMISweb","34a Allerton Road",null,"N16 5UF","TQ 32456 86933",532456,186933,51.565724000000003,-9.0383086000000001E-2]
["Active","F84008","Barton House Health Centre","CH","City & Hackney","CH-NW2","Clissold Park (NW2)","Clissold Park (NW2)","U51492","EMISweb","233 Albion Road","Stoke Newington","N16 9JT","TQ 32926 86369",532926,186369,51.560544999999998,-8.3819307999999995E-2]
["Active","F84033","Somerford Grove Practice","CH","City & Hackney","CH-NW2","Clissold Park (NW2)","Clissold Park (NW2)","U51492","EMISweb","Somerford Grove",null,"N16 7UA","TQ 33722 85639",533722,185639,51.553797000000003,-7.2620630000000005E-2]
["Active","F84636","Barretts Grove Surgery","CH","City & Hackney","CH-NW2","Clissold Park (NW2)","Clissold Park (NW2)","U51492","EMISweb","6 Barretts Grove",null,"N16 8AR","TQ 33334 85451",533334,185451,51.552199999999999,-7.8284858999999998E-2]
["Active","F84694","Brooke Road Surgery","CH","City & Hackney","CH-NW2","Clissold Park (NW2)","Clissold Park (NW2)","U51492","EMISweb","40-42 Brooke Road",null,"N16 7LR","TQ 33833 86338",533833,186338,51.560051999999999,-7.0754775000000006E-2]
["Active","F84003","Lower Clapton Group Practice","CH","City & Hackney","CH-SE1","Hackney Marshes (SE1)","Hackney Marshes (SE1)","U05451","EMISweb","36 Lower Clapton Road",null,"E5 0PD","TQ 35145 85320",535145,185320,51.550592000000002,-5.2230775E-2]
["Active","F84015","Kingsmead Healthcare","CH","City & Hackney","CH-SE1","Hackney Marshes (SE1)","Hackney Marshes (SE1)","U05451","EMISweb","4 Kingsmead Way",null,"E9 5QG","TQ 36351 85487",536351,185487,51.551803,-3.4783215999999999E-2]
["Active","F84060","Athena Medical Centre","CH","City & Hackney","CH-SE1","Hackney Marshes (SE1)","Hackney Marshes (SE1)","U05451","EMISweb","21 Atherden Road","Clapton","E5 0QP","TQ 35057 85799",535057,185799,51.554917000000003,-5.3315426999999999E-2]
["Active","F84105","The Lea Surgery","CH","City & Hackney","CH-SE1","Hackney Marshes (SE1)","Hackney Marshes (SE1)","U05451","EMISweb","186 Homerton High Street",null,"E9 6AG","TQ 35784 85079",535784,185079,51.548273000000002,-4.311334E-2]
["Active","F84719","Latimer Health Centre","CH","City & Hackney","CH-SE1","Hackney Marshes (SE1)","Hackney Marshes (SE1)","U05451","EMISweb","4 Homerton Terrace",null,"E9 6RT","TQ 35346 84880",535346,184880,51.546590000000002,-4.9502727000000003E-2]
["Active","F84069","The Well Street Surgery","CH","City & Hackney","CH-SE2","Well Street Common (SE2)","Well Street Common (SE2)","U58256","EMISweb","28 Shore Road",null,"E9 7TA","TQ 35138 84055",535138,184055,51.539225999999999,-5.2817041000000002E-2]
["Active","F84601","Elsdale Street Surgery ","CH","City & Hackney","CH-SE2","Well Street Common (SE2)","Well Street Common (SE2)","U58256","EMISweb","28 Elsdale Street",null,"E9 6QY","TQ 35380 84483",535380,184483,51.543013999999999,-4.9165300000000002E-2]
["Active","F84620","The Wick Health Centre","CH","City & Hackney","CH-SE2","Well Street Common (SE2)","Well Street Common (SE2)","U58256","EMISweb","200 Wick Rd",null,"E9 5AN","TQ 36085 84711",536085,184711,51.544893999999999,-3.8917245000000003E-2]
["Active","F84632","The Greenhouse","CH","City & Hackney","CH-SE2","Well Street Common (SE2)","Well Street Common (SE2)","U58256","EMISweb","19 Tudor Road",null,"E9 7SN","TQ 34985 83975",534985,183975,51.538544000000002,-5.5052455E-2]
["Active","Y00403","Trowbridge Surgery ","CH","City & Hackney","CH-SE2","Well Street Common (SE2)","Well Street Common (SE2)","U58256","EMISweb","18 Merriam Avenue",null,"E9 5NE","TQ 36747 84792",536747,184792,51.545462000000001,-2.9345178999999999E-2]
["Active","F84021","London Fields Medical Centre","CH","City & Hackney","CH-SW1","London Fields (SW1)","London Fields (SW1)","U40100","EMISweb","38-44 Broadway Market",null,"E8 4QJ","TQ 34536 83745",534536,183745,51.536583999999998,-6.1610386000000003E-2]
["Active","F84035","Richmond Road Medical Centre","CH","City & Hackney","CH-SW1","London Fields (SW1)","London Fields (SW1)","U40100","EMISweb","136 Richmond Road",null,"E8 3HN","TQ 34245 84457",534245,184457,51.543050999999998,-6.5532240000000005E-2]
["Active","F84038","Beechwood Medical Centre","CH","City & Hackney","CH-SW1","London Fields (SW1)","London Fields (SW1)","U40100","EMISweb","86-86a Dalston Lane",null,"E8 3AH","TQ 33890 84780",533890,184780,51.546038000000003,-7.0525556000000003E-2]
["Active","F84063","Dalston Practice","CH","City & Hackney","CH-SW1","London Fields (SW1)","London Fields (SW1)","U40100","EMISweb","1b Madinah Road",null,"E8 1PG","TQ 34111 84978",534111,184978,51.547764999999998,-6.7264995999999994E-2]
["Active","F84117","Queensbridge Group Practice","CH","City & Hackney","CH-SW1","London Fields (SW1)","London Fields (SW1)","U40100","EMISweb","24, Holly Street",null,"E8 3XP","TQ 33838 84271",533838,184271,51.541476000000003,-7.1468413999999994E-2]
["Active","F84621","The Sandringham Practice","CH","City & Hackney","CH-SW1","London Fields (SW1)","London Fields (SW1)","U40100","EMISweb","1a Madinah Road",null,"E8 1PG","TQ 34111 84978",534111,184978,51.547764999999998,-6.7264995999999994E-2]
["Active","F84640","The Neaman Practice","CH","City & Hackney","CH-SW2","Shoreditch Park & City (SW2)","Shoreditch Park & City (SW2)","U07169","EMISweb","15 Half Moon Court",null,"EC1A 7HF","TQ 32048 81725",532048,181725,51.519018000000003,-9.8218282000000004E-2]
["Active","F84072","De Beauvoir Surgery","CH","City & Hackney","CH-SW2","Shoreditch Park & City (SW2)","Shoreditch Park & City (SW2)","U07169","EMISweb","30 Hertford Road",null,"N1 5QT","TQ 33377 83922",533377,183922,51.538449,-7.8244064000000002E-2]
["Active","F84096","The Lawson Practice","CH","City & Hackney","CH-SW2","Shoreditch Park & City (SW2)","Shoreditch Park & City (SW2)","U07169","EMISweb","St Leonard's Hospital, Nuttall St","Nuttall Street","N1 5HZ","TQ 33302 83395",533302,183395,51.533731000000003,-7.9524182999999998E-2]
["Active","F84635","Shoreditch Park Surgery","CH","City & Hackney","CH-SW2","Shoreditch Park & City (SW2)","Shoreditch Park & City (SW2)","U07169","EMISweb","10 Rushton Street",null,"N1 5DR","TQ 32796 83359",532796,183359,51.533526999999999,-8.6828572000000007E-2]
["Active","F84692","The Hoxton Surgery","CH","City & Hackney","CH-SW2","Shoreditch Park & City (SW2)","Shoreditch Park & City (SW2)","U07169","EMISweb","12 Rushton Street",null,"N1 5DR","TQ 32796 83359",532796,183359,51.533526999999999,-8.6828572000000007E-2]
["Active","F82011","St Edwards Surgery","HV","Havering","HV-1","Havering Crest","Havering Crest Network","U29424","EMISweb","7 St Edwards Way","Romford","RM1 3DQ","TQ 51307 89056",551307,189056,51.580061000000001,0.18230462]
["Active","F82019","Chadwell Heath Health Centre - The Upstairs Surgery (Dr Hamilton-Smith)","HV","Havering","HV-1","Havering Crest","Havering Crest Network","U29424","EMISweb","Ashton Garden","Chadwell Heath","RM6 6RT","TQ 48405 88264",548405,188264,51.573715,0.14011965000000001]
["Active","F82638","The Modern Medical Centre","HV","Havering","HV-1","Havering Crest","Havering Crest Network","U29424","EMISweb","195 Rush Green Road","Rush Green","RM7 0PX","TQ 51030 87418",551030,187418,51.565418000000001,0.17760643000000001]
["Active","F82039","Rush Green Medical Centre (Dr Poologanathan & Partners)","HV","Havering","HV-1","Havering Crest","Havering Crest Network","U29424","EMISweb","261 Dagenham Road","Rush Green","RM7 0XR","TQ 50932 86893",550932,186893,51.560727,0.1759684]
["Active","F82031","Rush Green Medical Centre (Dr Sanomi)","HV","Havering","HV-1","Havering Crest","Havering Crest Network","U29424","EMISweb","261 Dagenham Road","Rush Green","RM7 0XR","TQ 50932 86893",550932,186893,51.560727,0.1759684]
["Active","F82023","High Street Surgery (Dr Pervez)","HV","Havering","HV-1","Havering Crest","Havering Crest Network","U29424","EMISweb","219 High Street","Hornchurch","RM11 3XT","TQ 54233 87089",554233,187089,51.561596000000002,0.22363675]
["Active","F82675","Billet Lane Medical Centre","HV","Havering","HV-1","Havering Crest","Havering Crest Network","U29424","EMISweb","58b Billet Lane","Hornchurch","RM11 1XA","TQ 53895 87670",553895,187670,51.566907999999998,0.21901872]
["Active","F82663","Brentwood Road Surgery (Dr Marks)","HV","Havering","HV-1","Havering Crest","Havering Crest Network","U29424","EMISweb","107 Brentwood Road","Romford","RM1 2SB","TQ 52030 88243",552030,188243,51.572561999999998,0.19237934000000001]
["Active","F82013","Western Road Medical Centre ","HV","Havering","HV-2","Havering Marshall","Marshall Network","U50107","EMISweb","99 Western Road","Romford","RM1 3LS","TQ 51671 88948",551671,188948,51.578992,0.18750723]
["Active","F82021","The New Medical Centre","HV","Havering","HV-2","Havering Marshall","Marshall Network","U50107","EMISweb","264 Brentwood Road","Romford","RM2 5SU","TQ 52819 88475",552819,188475,51.574432999999999,0.20385631000000001]
["Active","F82009","North Street Medical Care","HV","Havering","HV-2","Havering Marshall","Marshall Network","U50107","EMISweb","274 North Street","Romford","RM1 4QJ","TQ 50672 89720",550672,189720,51.586196000000001,0.17343195]
["Active","F82686","Chadwell Heath Health Centre (Dr A Patel)","HV","Havering","HV-3","Havering North","North Network","U55939","EMISweb","Ashton Gardens","Chadwell Heath","RM6 6RT","TQ 48405 88264",548405,188264,51.573715,0.14011965000000001]
["Active","F82010","Petersfield Surgery","HV","Havering","HV-3","Havering North","North Network","U55939","EMISweb","70 Petersfield Ave","Harold Hill","RM3 9PD","TQ 54717 92014",554717,192014,51.605711999999997,0.23278188999999999]
["Active","F82648","Ingrebourne Medical Centre","HV","Havering","HV-3","Havering North","North Network","U55939","EMISweb","135 Straight Road","Harold Hill","RM3 7JJ","TQ 53197 91366",553197,191366,51.600304999999999,0.21056731000000001]
["Active","F82671","Straight Road Doctors Surgery (Dr Prasad)","HV","Havering","HV-3","Havering North","North Network","U55939","EMISweb","137 Straight Road","Harold Hill","RM3 7JJ","TQ 53197 91366",553197,191366,51.600304999999999,0.21056731000000001]
["Active","F82670","AbbaMoor Surgery","HV","Havering","HV-3","Havering North","North Network","U55939","EMISweb","Gooshays Drive","Harold Hill","RM3 9SU","TQ 54169 92056",554169,192056,51.606239000000002,0.22489343000000001]
["Active","F82014","Harold Hill Health Centre (Dr Kuchhai)","HV","Havering","HV-3","Havering North","North Network","U55939","EMISweb","Gooshays Drive","Harold Hill","RM3 9SU","TQ 54169 92056",554169,192056,51.606239000000002,0.22489343000000001]
["Active","F82016","Central Park Surgery (Dr Kakad)","HV","Havering","HV-3","Havering North","North Network","U55939","EMISweb","Gooshays Drive","Harold Hill","RM3 9SU","TQ 54169 92056",554169,192056,51.606239000000002,0.22489343000000001]
["Active","Y00312","The Robins Surgery","HV","Havering","HV-3","Havering North","North Network","U55939","EMISweb","Gooshays Drive","Harold Hill","RM3 9SU","TQ 54169 92056",554169,192056,51.606239000000002,0.22489343000000001]
["Active","F82007","The Greenwood Practice","HV","Havering","HV-3","Havering North","North Network","U55939","EMISweb","89 Gubbins Lane","Harold Wood","RM3 0DR","TQ 54748 90860",554748,190860,51.595334999999999,0.23272048000000001]
["Active","F82045","Oak Lodge Surgery (Dr Chowdhury)","HV","Havering","HV-3","Havering North","North Network","U55939","EMISweb","6 Oak Road","Harold Wood","RM3 0PT","TQ 54849 90533",554849,190533,51.592370000000003,0.23403325]
["Active","Y02973","Kings Park Surgery","HV","Havering","HV-3","Havering North","North Network","U55939","EMISweb","St Clements Avenue","Harold Wood","RM3 0FE","TQ 54268 90605",554268,190605,51.593176,0.22568427999999999]
["Active","F82030","Lynwood Medical Centre","HV","Havering","HV-3","Havering North","North Network","U55939","EMISweb","4 Lynwood Drive","Collier Row","RM5 3QL","TQ 49970 91426",549970,191426,51.601711999999999,0.16403546999999999]
["Active","F82630","Chase Cross Medical Centre (Dr Kulendran)","HV","Havering","HV-3","Havering North","North Network","U55939","EMISweb","Chase Cross Road","Collier Row","RM5 3PJ","TQ 50027 91251",550027,191251,51.600124000000001,0.16478307]
["Active","F82610","Dr N K Gupta Surgery","HV","Havering","HV-3","Havering North","North Network","U55939","EMISweb","206 Mawney Road","Romford","RM7 8BU","TQ 50077 89338",550077,189338,51.582923000000001,0.16468706999999999]
["Active","F82055","Hornchurch Healthcare","HV","Havering","HV-4","Havering South","South Network","U00367","EMISweb","58b Billet Lane","Hornchurch","RM11 1XA","TQ 53895 87670",553895,187670,51.566907999999998,0.21901872]
["Active","F82609","Sutton Ave surgery (P M Patel)","HV","Havering","HV-4","Havering South","South Network","U00367","EMISweb","24 Suttons Ave","Hornchurch","RM12 4LF","TQ 53941 86488",553941,186488,51.556274999999999,0.21916472000000001]
["Active","F82002","Haiderian Medical Centre","HV","Havering","HV-4","Havering South","South Network","U00367","EMISweb","181 Corbets Tey Road","Upminster","RM14 2YN","TQ 55913 85795",555913,185795,51.549508000000003,0.24727998000000001]
["Active","F82008","Maylands Health Care","HV","Havering","HV-4","Havering South","South Network","U00367","EMISweb","300 Upper Rainham Road","Elm Park","RM12 4EQ","TQ 51980 86056",551980,186056,51.552925000000002,0.19071367]
["Active","F82028","Wood Lane Medical Centre","HV","Havering","HV-4","Havering South","South Network","U00367","EMISweb","39 Wood Lane","Elm Park","RM12 5HX","TQ 52375 85087",552375,185087,51.544113000000003,0.19598719000000001]
["Active","F82666","The Surgery (Dr Rahman)","HV","Havering","HV-4","Havering South","South Network","U00367","EMISweb","482 South End Road","Elm Park","RM12 5PA","TQ 52924 85456",552924,185456,51.547280000000001,0.20405819]
["Active","F82022","The Rosewood Medical Centre","HV","Havering","HV-4","Havering South","South Network","U00367","EMISweb","30 Astra Close","Hornchurch","RM12 5NJ","TQ 52722 84935",552722,184935,51.542653000000001,0.20092135999999999]
["Active","F82619","Harlow Road Surgery (Dr N Tariq)","HV","Havering","HV-4","Havering South","South Network","U00367","EMISweb","1 Harlow Road","Rainham","RM13 7UP","TQ 51752 83712",551752,183712,51.531925999999999,0.18641779999999999]
["Active","F82627","Rainham Health Centre","HV","Havering","HV-4","Havering South","South Network","U00367","EMISweb","Upminster Road South","Rainham","RM13 9AB","TQ 52533 82337",552533,182337,51.519362000000001,0.19707374999999999]
["Active","F82649","Berwick Surgery","HV","Havering","HV-4","Havering South","South Network","U00367","EMISweb","17 Berwick Road","Rainham","RM13 9QU","TQ 53679 83242",553679,183242,51.527183000000001,0.21397231999999999]
["Active","F82607","South Hornchurch Medical Practice","HV","Havering","HV-4","Havering South","South Network","U00367","EMISweb","382 Upminster Road North","North Rainham","RM13 9RZ","TQ 53703 82663",553703,182663,51.521974,0.21406560999999999]
["Active","F82674","Avon Road Surgery (Cranham Health Centre)","HV","Havering","HV-4","Havering South","South Network","U00367","EMISweb","Avon Road","Cranham","RM14 1RG","TQ 57095 87988",557095,187988,51.568883,0.26529226]
["Active","F82006","Cranham Village Surgery (Dr C Dahs & Dr IP Humberstone Surgery)","HV","Havering","HV-4","Havering South","South Network","U00367","EMISweb","143 Ingrebourne Gardens","Cranham","RM14 1BJ","TQ 56984 87288",556984,187288,51.562624999999997,0.26337961999999998]
["Active","F82053","Upminster Medical Centre","HV","Havering","HV-4","Havering South","South Network","U00367","EMISweb","226 St Mary's Lane","Upminster","RM14 3DH","TQ 56440 86625",556440,186625,51.556818999999997,0.25524323999999998]
["Active","F82624","The Upminster Bridge Surgery (Dr O'Moore)","HV","Havering","HV-4","Havering South","South Network","U00367","EMISweb","126 Upminster Road","Upminster","RM12 6PL","TQ 55046 86819",555046,186819,51.558947000000003,0.23523689]
["Active","F82033","Dr V M Patel Surgery","HV","Havering","HV-4","Havering South","South Network","U00367","VISION","9 Glanville Drive","Hornchurch","RM11 3SZ","TQ 54586 87037",554586,187037,51.561031999999997,0.22870229]
["Active","F84047","Custom House Surgery ","NH","Newham","NH-PCN1","South One Newham","South One Newham","U23362","EMISweb","16 Freemasons Rd",null,"E16 3NA","TQ 40635 81244",540635,181244,51.512625,2.5271616E-2]
["Active","F84666","Dr Ruiz – St Lukes Medical Centre ","NH","Newham","NH-PCN1","South One Newham","South One Newham","U23362","EMISweb","2 St Luke's Square",null,"E16 1HT","TQ 39825 81135",539825,181135,51.511847000000003,1.3563443E-2]
["Active","F84657","Cumberland Road Medical Practice ","NH","Newham","NH-PCN1","South One Newham","South One Newham","U23362","EMISweb","179 Cumberland Rd",null,"E13 8LS","TQ 40666 82033",540666,182033,51.519706999999997,2.6032652E-2]
["Active","F84092","Glen Road Medical Centre ","NH","Newham","NH-PCN1","South One Newham","South One Newham","U23362","EMISweb","1-9 Glen Rd",null,"E13 8RU","TQ 41109 82327",541109,182327,51.522238999999999,3.2530946999999998E-2]
["Active","F84017","Star Lane Medical Centre ","NH","Newham","NH-PCN1","South One Newham","South One Newham","U23362","EMISweb","121 Star Ln",null,"E16 4QH","TQ 39602 82012",539602,182012,51.519781999999999,1.0699055000000001E-2]
["Active","F84717","Royal Docks Medical Centre ","NH","Newham","NH-PCN10","Docklands","Docklands","U56681","EMISweb","21 East Ham Manor Way",null,"E6 5NA","TQ 43258 80969",543258,180969,51.509495999999999,6.2933420000000004E-2]
["Active","F84093","Tollgate Health Centre ","NH","Newham","NH-PCN10","Docklands","Docklands","U56681","EMISweb","220 Tollgate Rd",null,"E6 5JS","TQ 42787 81629",542787,181629,51.515546000000001,5.6418168999999997E-2]
["Active","Y02928","E16 Health","NH","Newham","NH-PCN10","Docklands","Docklands","U56681","EMISweb","76 Albert Rd",null,"E16 2DY","TQ 42593 80059",542593,180059,51.501486999999997,5.2989908000000002E-2]
["Active","F84735","The Azad Practice ","NH","Newham","NH-PCN2","Central 1","Central 1","U71739","EMISweb","152 Barking Road",null,"E6 3BD","TQ 41930 83350",541930,183350,51.531225999999997,4.4768458999999997E-2]
["Active","F84669","Newham Medical Centre ","NH","Newham","NH-PCN2","Central 1","Central 1","U71739","EMISweb","576 Green St",null,"E13 9DA","TQ 41405 83360",541405,183360,51.531447,3.7208861000000003E-2]
["Active","F84010","St Bartholomew Surgery ","NH","Newham","NH-PCN2","Central 1","Central 1","U71739","EMISweb","292A Barking Road ",null,"E6 3BA","TQ 42477 83507",542477,183507,51.532499000000001,5.2712424000000001E-2]
["Active","F84004","Market Street Health Group","NH","Newham","NH-PCN2","Central 1","Central 1","U71739","EMISweb","52 Market St",null,"E6 2RA","TQ 42814 83350",542814,183350,51.531002999999998,5.7504007000000003E-2]
["Active","F84053","Greengate Medical Practice ","NH","Newham","NH-PCN2","Central 1","Central 1","U71739","EMISweb","497 Barking Road",null,"E13 8PS","TQ 40757 82646",540757,182646,51.525193000000002,2.7588027000000001E-2]
["Active","F84124","The Project Surgery ","NH","Newham","NH-PCN2","Central 1","Central 1","U71739","EMISweb","10 Lettsom Walk",null,"E13 0LN","TQ 40253 83419",540253,183419,51.532263999999998,2.0635384999999999E-2]
["Active","F84050","Boleyn Medical Centre ","NH","Newham","NH-PCN2","Central 1","Central 1","U71739","EMISweb","152 Barking Road",null,"E6 3BD","TQ 41930 83350",541930,183350,51.531225999999997,4.4768458999999997E-2]
["Active","F84052","Essex Lodge ","NH","Newham","NH-PCN3","Newham Central","Newham Central","U11373","EMISweb","94 Greengate St",null,"E13 0AS","TQ 40684 82946",540684,182946,51.527906999999999,2.6656164E-2]
["Active","F84681","Balaam Street Practice ","NH","Newham","NH-PCN3","Newham Central","Newham Central","U11373","EMISweb","113 Balaam St",null,"E13 8AF","TQ 40488 82808",540488,182808,51.526716,2.3777605E-2]
["Active","F84642","Lucas Avenue Surgery","NH","Newham","NH-PCN3","Newham Central","Newham Central","U11373","EMISweb",null,null,"E13 0QP","TQ 40943 83883",540943,183883,51.536262000000001,3.0761987000000001E-2]
["Active","F84749","Carpenter's Practice","NH","Newham","NH-PCN3","Newham Central","Newham Central","U11373","EMISweb","236-252 High St",null,"E15 2JA","TQ 38568 83938",538568,183938,51.537343999999997,-3.4372387999999999E-3]
["Active","F84658","Sangam Surgery ","NH","Newham","NH-PCN4","North East 1","North East 1","U34188","EMISweb","Snowshill Rd",null,"E12 6BE","TQ 42142 85378",542142,185378,51.549394999999997,4.8640959999999997E-2]
["Active","F84660","Dr CM Patel ","NH","Newham","NH-PCN4","North East 1","North East 1","U34188","EMISweb","2 Jephson Rd",null,"E7 8LZ","TQ 41250 84414",541250,184414,51.540956999999999,3.5398279999999997E-2]
["Active","F84088","Plashet Medical Centre ","NH","Newham","NH-PCN4","North East 1","North East 1","U34188","EMISweb","152 Plashet Rd",null,"E13 0QT","TQ 41097 84021",541097,184021,51.537464,3.3036159000000002E-2]
["Active","F84670","Westbury Road Medical Practice","NH","Newham","NH-PCN4","North East 1","North East 1","U34188","EMISweb","45 Westbury Terrace",null,"E7 8BU","TQ 40876 84941",540876,184941,51.545786,3.0219711999999999E-2]
["Active","F84729","The Manor Park Practice","NH","Newham","NH-PCN4","North East 1","North East 1","U34188","EMISweb","778 Romford Rd",null,"E12 5JG","TQ 42725 85896",542725,185896,51.553902999999998,5.7253423999999997E-2]
["Active","F84641","Birchdale Road Medical Practice ","NH","Newham","NH-PCN4","North East 1","North East 1","U34188","EMISweb","2 Birchdale Rd",null,"E7 8AR","TQ 41441 85069",541441,185069,51.546795000000003,3.8413612E-2]
["Active","F84739","E12 Medical Practice ","NH","Newham","NH-PCN5","North East 2","North East 2","U06978","EMISweb","243 High Street North",null,"E12 6SJ","TQ 42286 84464",542286,184464,51.541145999999998,5.0347099999999999E-2]
["Active","F84006","Shrewsbury Road Surgery ","NH","Newham","NH-PCN5","North East 2","North East 2","U06978","EMISweb","Shrewsbury Annexe' Shrewsbury Road",null,"E7 8QP","TQ 41796 84426",541796,184426,51.540928000000001,4.3270927000000001E-2]
["Active","F84074","Wordsworth Health Centre ","NH","Newham","NH-PCN5","North East 2","North East 2","U06978","EMISweb","19 Wordsworth Avenue",null,"E12 6SU","TQ 42172 84503",542172,184503,51.541525,4.8720109999999997E-2]
["Active","F84741","Dr Sathyajith Surgery","NH","Newham","NH-PCN5","North East 2","North East 2","U06978","EMISweb","Eastham Memorial Hospital",null,"E7 8QP","TQ 41796 84426",541796,184426,51.540928000000001,4.3270927000000001E-2]
["Active","F84742","The Summit Practice ","NH","Newham","NH-PCN5","North East 2","North East 2","U06978","EMISweb","Old East Ham Memorial Hospital",null,"E7 8PP","TQ 41670 84155",541670,184155,51.538524000000002,4.1346302000000001E-2]
["Active","F84070","Lathom Medical Centre ","NH","Newham","NH-PCN5","North East 2","North East 2","U06978","EMISweb","2A Lathom Rd",null,"E6 2DU","TQ 42458 84130",542458,184130,51.538102000000002,5.2690542999999999E-2]
["Active","F84672","E7 Health - First 4 Health Group","NH","Newham","NH-PCN6","North Newham ","North Newham ","U52641","EMISweb","157 Leytonstone Rd",null,"E15 1LH","TQ 39102 85361",539102,185361,51.55,4.8192100999999996E-3]
["Active","F84097","Claremont Clinic ","NH","Newham","NH-PCN6","North Newham ","North Newham ","U52641","EMISweb","459-463 Romford Rd",null,"E7 8AB","TQ 41105 85137",541105,185137,51.547490000000003,3.3598484999999997E-2]
["Active","F84724","Woodgrange Medical Practice ","NH","Newham","NH-PCN6","North Newham ","North Newham ","U52641","EMISweb","40 Woodgrange Rd",null,"E7 0QH","TQ 40516 85243",540516,185243,51.548589,2.5152046000000001E-2]
["Active","F84111","Abbey Road Medical Practice ","NH","Newham","NH-PCN8","Stratford","Stratford","U76122","EMISweb","28a Abbey Rd",null,"E15 3LT","TQ 39225 83671",539225,183671,51.534782999999997,5.9240574000000001E-3]
["Active","Y04273","Liberty Bridge Road ","NH","Newham","NH-PCN8","Stratford","Stratford","U76122","EMISweb","40 Liberty Bridge Rd",null,"E20 1AS","TQ 38349 85140",538349,185140,51.548198999999997,-6.1207496000000002E-3]
["Active","F84730","The Vicarage Lane Surgery","NH","Newham","NH-PCN8","Stratford","Stratford","U76122","EMISweb","10 Vicarage Ln",null,"E15 4HG","TQ 39553 84332",539553,184332,51.540641999999998,1.0911766999999999E-2]
["Active","F84121","First4Health Church Road","NH","Newham","NH-PCN8","Stratford","Stratford","U76122","EMISweb","30 Church Road",null,"E12 6AQ","TQ 42460 85199",542460,185199,51.547707000000003,5.3151713000000003E-2]
["Active","F84009","Stratford Village Surgery ","NH","Newham","NH-PCN8","Stratford","Stratford","U76122","EMISweb","50C Romford Rd",null,"E15 4BZ","TQ 39233 84486",539233,184486,51.542104999999999,6.3613932999999996E-3]
["Active","F84740","Newham Transitional Team ","NH","Newham","NH-PCN8","Stratford","Stratford","U76122","EMISweb","30 Church Rd",null,"E12 6AQ","TQ 42460 85199",542460,185199,51.547707000000003,5.3151713000000003E-2]
["Active","F84077","Newham Vicarage Practice","NH","Newham","NH-PCN9","North West 2","North West 2","U94747","EMISweb","10 Vicarage Ln",null,"E15 4ES","TQ 39491 84416",539491,184416,51.541412000000001,1.0051602E-2]
["Active","F84677","East End Medical Centre ","NH","Newham","NH-PCN9","North West 2","North West 2","U94747","EMISweb","61 Plashet Rd",null,"E13 0QA","TQ 40567 83994",540567,183994,51.537353000000003,2.5388643999999998E-2]
["Active","F84022","Stratford Health Centre ","NH","Newham","NH-PCN9","North West 2","North West 2","U94747","EMISweb","123 The Grove",null,"E15 1EN","TQ 39112 84766",539112,184766,51.544649999999997,4.7282946000000003E-3]
["Active","F84086","The Forest Practice","NH","Newham","NH-PCN9","North West 2","North West 2","U94747","EMISweb","121 Woodgrange Rd",null,"E7 0EP","TQ 40492 85464",540492,185464,51.550581000000001,2.4894327000000001E-2]
["Active","F84014","Upton Lane Medical Centre ","NH","Newham","NH-PCN9","North West 2","North West 2","U94747","EMISweb","75-77 Upton Ln",null,"E7 9PB","TQ 40620 84636",540620,184636,51.543109000000001,2.6408576E-2]
["Active","F86652","Drive Surgery","RB","Redbridge","RB-1","Cranbrook","Cranbrook","U51307","EMISweb","68 The Drive","Ilford","IG1 3HZ","TQ 42899 87429",542899,187429,51.567633999999998,6.0384001E-2]
["Active","F86702","St Clements Surgery","RB","Redbridge","RB-1","Cranbrook","Cranbrook","U51307","EMISweb","38 Bathhurst Road","Ilford","IG1 4LA","TQ 43751 87002",543751,187002,51.563580999999999,7.2493724999999995E-2]
["Active","Y00918","Granville Medical Centre","RB","Redbridge","RB-1","Cranbrook","Cranbrook","U51307","EMISweb","4 Granville Road","Ilford","IG1 4JY","TQ 43646 86952",543646,186952,51.563158000000001,7.0959545999999998E-2]
["Active","F86042","Balfour Road Surgery","RB","Redbridge","RB-1","Cranbrook","Cranbrook","U51307","EMISweb","92 Balfour Road","Ilford","IG1 4JE","TQ 43990 86949",543990,186949,51.563043,7.5917640999999994E-2]
["Active","F86698","Cranbrook Surgery","RB","Redbridge","RB-1","Cranbrook","Cranbrook","U51307","EMISweb","465 Cranbrook Road","Ilford","IG2 6EW","TQ 43201 88032",543201,188032,51.572975,6.4983819999999998E-2]
["Active","F86008","Gants Hill Medical Centre","RB","Redbridge","RB-1","Cranbrook","Cranbrook","U51307","EMISweb","63-65 Ethelbert Gardens","Gants Hill","IG2 6UW","TQ 43151 88496",543151,188496,51.577157,6.4451751000000002E-2]
["Active","F86703","Redbridge Surgery","RB","Redbridge","RB-1","Cranbrook","Cranbrook","U51307","EMISweb","49 Windermere Gardens","Gants Hill","IG4 5BZ","TQ 42406 88530",542406,188530,51.577651000000003,5.3721702000000003E-2]
["Active","F86657","York Road Surgery","RB","Redbridge","RB-1","Cranbrook","Cranbrook","U51307","SystmOne","55 York Road","Ilford","IG1 3AF","TQ 43305 86498",543305,186498,51.559165,6.5858546000000004E-2]
["Active","F86081","Kenwood Medical Centre","RB","Redbridge","RB-2","Fairlop","Fairlop","U03653","EMISweb","Kenwood Gardens","Gants Hill","IG2 6YG","TQ 43661 88984",543661,188984,51.581412999999998,7.2005967000000004E-2]
["Active","F86083","Eastern Avenue Medical Centre","RB","Redbridge","RB-2","Fairlop","Fairlop","U03653","EMISweb","167 Eastern Avenue","Gants Hill","IG4 5AW","TQ 42226 88390",542226,188390,51.576439000000001,5.1069203000000001E-2]
["Active","F86612","Fullwell Avenue Surgery","RB","Redbridge","RB-2","Fairlop","Fairlop","U03653","EMISweb","272 Fullwell Avenue","Fullwell Cross","IG5 0SB","TQ 43621 90647",543621,190647,51.596366000000003,7.2108948000000006E-2]
["Active","F86624","Heathcote Primary Care Centre","RB","Redbridge","RB-2","Fairlop","Fairlop","U03653","EMISweb","Heathcote Avenue","Barkingside","IG5 0QS","TQ 42982 90347",542982,190347,51.593831999999999,6.2767795000000001E-2]
["Active","F86707","Fencepiece Road Medical Practice","RB","Redbridge","RB-2","Fairlop","Fairlop","U03653","EMISweb","83 Fencepiece Road","Fairlop","IG6 2NB","TQ 44453 91094",544453,191094,51.600169999999999,8.4296185999999995E-2]
["Active","F86057","The Willows Practice","RB","Redbridge","RB-2","Fairlop","Fairlop","U03653","EMISweb","Hainault Health Centre","Chigwell","IG7 4DF","TQ 45822 91978",545822,191978,51.607759999999999,0.10441554]
["Active","F86007","Forest Edge Practice","RB","Redbridge","RB-2","Fairlop","Fairlop","U03653","EMISweb","Hainault Health Centre","Chigwell","IG7 4DF","TQ 45822 91978",545822,191978,51.607759999999999,0.10441554]
["Active","F86009","The Palms Medical Centre","RB","Redbridge","RB-3","Seven Kings","Seven Kings","U27585","EMISweb","97-101 Netley Road","Newbury Park","IG2 7NW","TQ 44820 88524",544820,188524,51.576982999999998,8.8531907000000007E-2]
["Active","F86087","Goodmayes Medical Centre","RB","Redbridge","RB-3","Seven Kings","Seven Kings","U27585","EMISweb","4 Eastwood Road","Goodmayes","IG3 8XB","TQ 46331 87526",546331,187526,51.567625999999997,0.10990630999999999]
["Active","F86637","Seven Kings Practice","RB","Redbridge","RB-3","Seven Kings","Seven Kings","U27585","EMISweb","1 Salisbury Road","Seven Kings","IG3 8BG","TQ 45438 87037",545438,187037,51.563462999999999,9.6829019000000002E-2]
["Active","Y00090","Doctor's House","RB","Redbridge","RB-3","Seven Kings","Seven Kings","U27585","EMISweb","40 Cameron Road","Seven Kings","IG3 8LF","TQ 45249 87246",545249,187246,51.565389000000003,9.4190582999999994E-2]
["Active","F86034","Green Lane, Goodmayes Medical practice","RB","Redbridge","RB-3","Seven Kings","Seven Kings","U27585","EMISweb","595 Green Lane","Goodmayes","IG3 9RN","TQ 46598 87054",546598,187054,51.563316,0.11355912999999999]
["Active","F86642","Castleton Road Surgery","RB","Redbridge","RB-3","Seven Kings","Seven Kings","U27585","EMISweb","19 Castleton Road","Goodmayes","IG3 9QW","TQ 46532 87121",546532,187121,51.563935000000001,0.11263556]
["Active","F86028","Chadwell Heath Surgery","RB","Redbridge","RB-3","Seven Kings","Seven Kings","U27585","EMISweb","72 Chadwell Heath Lane","Chadwell Heath","RM6 4AF","TQ 47352 88216",547352,188216,51.573560000000001,0.12491581]
["Active","Y00155","Grove Surgery","RB","Redbridge","RB-3","Seven Kings","Seven Kings","U27585","SystmOne","200-202 Chadwell Heath Lane","Chadwell Heath","RM6 4YU","TQ 47178 88535",547178,188535,51.576472000000003,0.12254036]
["Active","F86013","Broadway Surgery","RB","Redbridge","RB-4","Wanstead & Woodford","Wanstead & Woodford","U78575","SystmOne","3 The Broadway","Woodford Green","IG8 0HF","TQ 40897 91927",540897,191927,51.608555000000003,3.3322327999999998E-2]
["Active","F86023","The Evergreen Practice","RB","Redbridge","RB-4","Wanstead & Woodford","Wanstead & Woodford","U78575","EMISweb","26 High Street","Wanstead","E11 2AQ","TQ 40453 88526",540453,188526,51.578105000000001,2.5554684000000001E-2]
["Active","F86032","Wanstead Place Surgery","RB","Redbridge","RB-4","Wanstead & Woodford","Wanstead & Woodford","U78575","EMISweb","45 Wanstead Place","Wanstead","E11 2SW","TQ 40289 88521",540289,188521,51.578100999999997,2.3187508999999999E-2]
["Active","F86731","Aldersbrook Medical Centre","RB","Redbridge","RB-4","Wanstead & Woodford","Wanstead & Woodford","U78575","EMISweb","65 Aldersbrook Road","Manor Park","E12 5DL","TQ 41394 86612",541394,186612,51.560670999999999,3.8356031999999998E-2]
["Active","F86066","Southdene Surgery","RB","Redbridge","RB-4","Wanstead & Woodford","Wanstead & Woodford","U78575","EMISweb","The Shrubberies, George Ln","South Woodford","E18 1BD","TQ 40404 90279",540404,190279,51.593868999999998,2.554851E-2]
["Active","F86641","Shrubberies Medical Centre","RB","Redbridge","RB-4","Wanstead & Woodford","Wanstead & Woodford","U78575","EMISweb","12 The Shrubberies, ","South Woodford","E18 1BD","TQ 40404 90279",540404,190279,51.593868999999998,2.554851E-2]
["Active","F86020","Glebelands Practice","RB","Redbridge","RB-4","Wanstead & Woodford","Wanstead & Woodford","U78575","EMISweb","2 Glebelands Avenue","South Woodford","E18 2AB","TQ 40310 90124",540310,190124,51.592500000000001,2.4130467999999999E-2]
["Active","F86064","Elmhurst Practice","RB","Redbridge","RB-4","Wanstead & Woodford","Wanstead & Woodford","U78575","EMISweb","114 High Road","South Woodford","E18 2QS","TQ 40129 90669",540129,190669,51.597442000000001,2.1736756999999999E-2]
["Active","F86691","Clayhall Clinic","RB","Redbridge","RB-4","Wanstead & Woodford","Wanstead & Woodford","U78575","EMISweb","14 Clayhall Avenue","Ilford","IG5 0LG","TQ 42206 90038",542206,190038,51.591251999999997,5.1447693000000003E-2]
["Active","F86012","Rydal Practice","RB","Redbridge","RB-4","Wanstead & Woodford","Wanstead & Woodford","U78575","EMISweb","375 High Road","Woodford Green","IG8 9QJ","TQ 39982 91888",539982,191888,51.608432000000001,2.0101964E-2]
["Active","F86658","Queen Mary Practice","RB","Redbridge","RB-4","Wanstead & Woodford","Wanstead & Woodford","U78575","EMISweb","114 High Road","South Woodford","E18 2QS","TQ 40129 90669",540129,190669,51.597442000000001,2.1736756999999999E-2]
["Active","F86022","Ilford Medical Centre","RB","Redbridge","RB-5","Loxford","Loxford","U20290","EMISweb","61 Cleveland Road","Ilford","IG1 1EE","TQ 43897 86254",543897,186254,51.556821999999997,7.4292691999999994E-2]
["Active","Y02987","The Practice Loxford","RB","Redbridge","RB-5","Loxford","Loxford","U20290","EMISweb","417 Ilford Lane","Ilford","IG1 2SN","TQ 44106 85110",544106,185110,51.546489000000001,7.6837077000000004E-2]
["Active","F86692","Mathukias Surgery","RB","Redbridge","RB-5","Loxford","Loxford","U20290","EMISweb","281 Ilford Lane","Ilford","IG1 2SF","TQ 43991 85477",543991,185477,51.549816,7.5329842999999994E-2]
["Active","F86082","Ilford Lane Surgery","RB","Redbridge","RB-5","Loxford","Loxford","U20290","SystmOne","417 Ilford Lane","Ilford","IG1 2SN","TQ 44106 85110",544106,185110,51.546489000000001,7.6837077000000004E-2]
["Active","F86025","Oak Tree Medical Practice","RB","Redbridge","RB-5","Loxford","Loxford","U20290","SystmOne","273-275 Green Lane","Seven Kings","IG3 9TJ","TQ 45422 86734",545422,186734,51.560744,9.6473119999999996E-2]
["Active","F86085","Hainault Surgery","RB","Redbridge","RB-6","NewCross Alliance","New Cross Alliance","U08578","EMISweb","34 New North Road","Hainault","IG6 2XG","TQ 44572 91321",544572,191321,51.602179,8.6106632000000002E-2]
["Active","F86010","Fullwell Cross Medical Centre","RB","Redbridge","RB-6","NewCross Alliance","New Cross Alliance","U08578","EMISweb","1 Tomswood Hill","Fairlop","IG6 2HG","TQ 44435 90476",544435,190476,51.594620999999997,8.3782263999999995E-2]
["Active","F86060","Newbury Group Practice","RB","Redbridge","RB-6","NewCross Alliance","New Cross Alliance","U08578","EMISweb","40 Perrymans Farm Road","Newbury Park","IG2 7LE","TQ 44654 88447",544654,188447,51.576334000000003,8.6106352999999997E-2]
["Active","F84083","Bethnal Green Health Centre","TH","Tower Hamlets","TH-NW1","The One Network","Network 1","U50771","EMISweb","60 Florida Street",null,"E2 6LL","TQ 34381 82665",534381,182665,51.526916,-6.4255604999999993E-2]
["Active","F84016","The Mission Practice","TH","Tower Hamlets","TH-NW1","The One Network","Network 1","U50771","EMISweb","208 Cambridge Heath Road",null,"E2 9LS","TQ 34907 83175",534907,183175,51.531373000000002,-5.6482689000000003E-2]
["Active","F84123","Globe Town Surgery","TH","Tower Hamlets","TH-NW1","The One Network","Network 1","U50771","EMISweb","82a Roman Road",null,"E2 0PJ","TQ 35420 82859",535420,182859,51.528410999999998,-4.9212931000000001E-2]
["Active","F84051","Strouts Place Medical Centre","TH","Tower Hamlets","TH-NW1","The One Network","Network 1","U50771","EMISweb","3 Strouts Place, Pelter Street",null,"E2 7QU","TQ 33683 82924",533683,182924,51.529409000000001,-7.4213118999999994E-2]
["Active","F84081","Spitalfields Practice","TH","Tower Hamlets","TH-NW2","East End Health Network","Network 2","U54453","EMISweb","20 Old Montague Street",null,"E1 5PB","TQ 34066 81571",534066,181571,51.517158999999999,-6.9209514E-2]
["Active","F84718","Blithehale Medical Centre","TH","Tower Hamlets","TH-NW2","East End Health Network","Network 2","U54453","EMISweb","22 Dunbridge Street",null,"E2 6JA","TQ 34306 82311",534306,182311,51.523752000000002,-6.5470924E-2]
["Active","F84733","Health E1","TH","Tower Hamlets","TH-NW2","East End Health Network","Network 2","U54453","EMISweb","9-11 Brick Lane",null,"E1 6PU","TQ 33910 81676",533910,181676,51.518140000000002,-7.1416585000000005E-2]
["Active","F84012","Albion Health Centre","TH","Tower Hamlets","TH-NW2","East End Health Network","Network 2","U54453","EMISweb","333 Whitechapel Road",null,"E1 1BU","TQ 34859 81910",534859,181910,51.520017000000003,-5.7658092000000001E-2]
["Active","F84087","Harford Health Centre","TH","Tower Hamlets","TH-NW3","Tower Network","Tower Network","U37286","EMISweb","79 Ben Jonson Road",null,"E1 4SA","TQ 35898 81752",535898,181752,51.518349000000001,-4.2753129000000001E-2]
["Active","F84039","Goodman’s Field Health Centre","TH","Tower Hamlets","TH-NW3","Tower Network","Tower Network","U37286","EMISweb","44-56 Hessel Street",null,"E1 2LP","TQ 34537 81246",534537,181246,51.514127000000002,-6.2549480000000005E-2]
["Active","F84114","City Square Medical Group","TH","Tower Hamlets","TH-NW3","Tower Network","Tower Network","U37286","EMISweb","129 Cannon Street Road",null,"E1 2LX","TQ 34595 81156",534595,181156,51.513303999999998,-6.1748474999999997E-2]
["Active","F84079","Wapping Group Practice","TH","Tower Hamlets","TH-NW3","Tower Network","Tower Network","U37286","EMISweb","22 Wapping Lane",null,"E1W 2RL","TQ 34810 80364",534810,180364,51.506135999999998,-5.8954558999999997E-2]
["Active","F84031","Jubilee Street Practice","TH","Tower Hamlets","TH-NW3","Tower Network","Tower Network","U37286","EMISweb","368-374 Commercial Road",null,"E1 0LS","TQ 35359 81212",535359,181212,51.513624999999998,-5.0723846000000003E-2]
["Active","F84731","St Katharine Docks Practice","TH","Tower Hamlets","TH-NW3","Tower Network","Tower Network","U37286","EMISweb","12-14 Nightingale House, 50 Thomas More Street",null,"E1W 1UA","TQ 34160 80441",534160,180441,51.506982999999998,-6.8285214999999996E-2]
["Active","F84044","Harley Grove Medical Centre","TH","Tower Hamlets","TH-NW4","Bow Health ","Network 5","U87199","EMISweb","15 Harley Grove",null,"E3 2AT","TQ 36903 82836",536903,182836,51.527847000000001,-2.7856860000000001E-2]
["Active","F84034","St Stephens Health Centre","TH","Tower Hamlets","TH-NW4","Bow Health ","Network 5","U87199","EMISweb","Bow Community Hall, William Place",null,"E3 5ED","TQ 36678 83316",536678,183316,51.532215000000001,-3.0912192000000002E-2]
["Active","F84030","Ruston Street Clinic (Dr Amin)","TH","Tower Hamlets","TH-NW4","Bow Health ","Network 5","U87199","EMISweb","Ruston Street",null,"E3 2LR","TQ 36931 83782",536931,183782,51.536341,-2.7085962000000002E-2]
["Active","F84055","Grove Road Surgery (Dr Shah)","TH","Tower Hamlets","TH-NW4","Bow Health ","Network 5","U87199","EMISweb","3 Ivanhoe House, 130 Grove Road",null,"E3 5TW","TQ 36133 83031",536133,183031,51.529784999999997,-3.8874542999999998E-2]
["Active","F84696","The Tredegar Practice","TH","Tower Hamlets","TH-NW4","Bow Health ","Network 5","U87199","EMISweb","35 St. Stephens Road",null,"E3 5JD","TQ 36617 83214",536617,183214,51.531312999999997,-3.1830602999999999E-2]
["Active","F84676","Stroudley Walk Centre","TH","Tower Hamlets","TH-NW5","Mile End East and Bromley by Bow Network","Network 6","U08803","EMISweb","38 Stroudley Walk, Bow",null,"E3 3EW","TQ 37650 82725",537650,182725,51.526668000000001,-1.7138677000000001E-2]
["Active","Y03023","St Andrews Health Centre","TH","Tower Hamlets","TH-NW5","Mile End East and Bromley by Bow Network","Network 6","U08803","EMISweb","2 Hannaford Way",null,"E3 3FF","TQ 37837 82418",537837,182418,51.523864000000003,-1.4564782E-2]
["Active","F84118","Merchant Street (Dr Rana)","TH","Tower Hamlets","TH-NW5","Mile End East and Bromley by Bow Network","Network 6","U08803","EMISweb","5 Merchant Street",null,"E3 4LJ","TQ 36940 82648",536940,182648,51.526148999999997,-2.7396845E-2]
["Active","F84714","St Pauls Way Medical Centre","TH","Tower Hamlets","TH-NW5","Mile End East and Bromley by Bow Network","Network 6","U08803","EMISweb","First Floor. 11 Selsey Street",null,"E14 7LJ","TQ 37160 81748",537160,181748,51.518008000000002,-2.4577591999999999E-2]
["Active","F84122","XX Place /Bromley-by-Bow","TH","Tower Hamlets","TH-NW5","Mile End East and Bromley by Bow Network","Network 6","U08803","EMISweb","St Leonard’s Street",null,"E3 3BT","TQ 37975 82706",537975,182706,51.526418,-1.2464196E-2]
["Active","F84054","Limehouse Practice (Gill Street)","TH","Tower Hamlets","TH-NW6","Poplar and Limehouse Network","Network 7","U60865","EMISweb","Gill St Health Centre, 11 Gill Street",null,"E14 8HQ","TQ 36891 80989",536891,180989,51.511253000000004,-2.8746565000000002E-2]
["Active","F84062","Chrisp Street Health Centre","TH","Tower Hamlets","TH-NW6","Poplar and Limehouse Network","Network 7","U60865","EMISweb","100 Chrisp Street",null,"E14 6PG","TQ 37882 81345",537882,181345,51.514211000000003,-1.4335996E-2]
["Active","F84698","Aberfeldy Practice","TH","Tower Hamlets","TH-NW6","Poplar and Limehouse Network","Network 7","U60865","EMISweb","2a Ettrick Street",null,"E14 0PU","TQ 38534 81393",538534,181393,51.514482999999998,-4.9271033000000001E-3]
["Active","F84025","Gough Walk (Dr Selvan)","TH","Tower Hamlets","TH-NW6","Poplar and Limehouse Network","Network 7","U60865","EMISweb","21 Newby Place ",null,"E14 0EY","TQ 38012 80933",538012,180933,51.510477000000002,-1.2624882E-2]
["Active","F84710","Island Health","TH","Tower Hamlets","TH-NW7","Healthy Island Network","Network 8","U09193","EMISweb","145 East Ferry Road",null,"E14 3BQ","TQ 37996 79250",537996,179250,51.495356999999998,-1.3513117E-2]
["Active","F84656","Docklands Medical Centre","TH","Tower Hamlets","TH-NW7","Healthy Island Network","Network 8","U09193","EMISweb","100 Spindrift Avenue",null,"E14 9WU","TQ 37480 78772",537480,178772,51.491188000000001,-2.1127525000000001E-2]
["Active","F84647","Island Medical Centre","TH","Tower Hamlets","TH-NW7","Healthy Island Network","Network 8","U09193","EMISweb","Roserton Street",null,"E14 3PG","TQ 38227 79604",538227,179604,51.498482000000003,-1.0049091E-2]
["Active","F84747","Barkantine Practice","TH","Tower Hamlets","TH-NW7","Healthy Island Network","Network 8","U09193","EMISweb","121 Westferry Road",null,"E14 8JH","TQ 37136 79834",537136,179834,51.500813999999998,-2.5666996000000001E-2]
["Active","F86026","Forest Surgery","WF","Waltham Forest","WF-1","Chingford/ Walthamstow","Chingford/Walthamstow","U92720","SystmOne","2 Macdonald Road","Walthamstow","E17 4BA","TQ 38283 90316",538283,190316,51.594726000000001,-5.0366318E-3]
["Active","F86700","Kings Head Medical Practice","WF","Waltham Forest","WF-1","Chingford/ Walthamstow","Chingford/Walthamstow","U92720","EMISweb","178 Kings Head Hill","Chingford","E4 7NX","TQ 37715 94859",537715,194859,51.635688000000002,-1.1447793E-2]
["Active","F86664","Larkshall Medical Centre","WF","Waltham Forest","WF-1","Chingford/ Walthamstow","Chingford/Walthamstow","U92720","EMISweb","1 Larkshall Road","Chingford","E4 7HS","TQ 38739 93914",538739,193914,51.626944999999999,2.9649466000000002E-3]
["Active","F86005","The Penryhn Surgery","WF","Waltham Forest","WF-1","Chingford/ Walthamstow","Chingford/Walthamstow","U92720","EMISweb","2a Penryn Avenue","Walthamstow","E17 5DB","TQ 36985 90544",536985,190544,51.597090999999999,-2.3674555E-2]
["Active","F86626","Dr Shantir Practice","WF","Waltham Forest","WF-1","Chingford/ Walthamstow","Chingford/Walthamstow","U92720","EMISweb","354-358 Forest Rd","Walthamstow","E17 5JG","TQ 36694 89687",536694,189687,51.589461,-2.8206729E-2]
["Active","Y01839","Lime Tree & Sinnott Healthcare Ltd","WF","Waltham Forest","WF-1","Chingford/ Walthamstow","Chingford/Walthamstow","U92720","EMISweb","12b Sinnott Road","Walthamstow","E17 5QB","TQ 35891 90652",535891,190652,51.598326999999998,-3.9417391000000003E-2]
["Active","F86689","The Bailey Practice","WF","Waltham Forest","WF-1","Chingford/ Walthamstow","Chingford/Walthamstow","U92720","EMISweb","107 Shernhall Street","Walthamstow","E17 9HS","TQ 38167 89081",538167,189081,51.583657000000002,-7.1959318999999999E-3]
["Active","F86638","The Microfaculty","WF","Waltham Forest","WF-1","Chingford/ Walthamstow","Chingford/Walthamstow","U92720","SystmOne","107 Chingford Mount Road","Chingford","E4 8LT","TQ 37307 92314",537307,192314,51.612918000000001,-1.8336228999999999E-2]
["Active","F86004","Handsworth Medical Centre","WF","Waltham Forest","WF-2","Chingford E4","Chingford E4","U47946","SystmOne","Highams Park, Handsworth Avenue","Chingford","E4 9PD"]
["Active","Y01291","Chingford Medical Practice","WF","Waltham Forest","WF-2","Chingford E4","Chingford E4","U47946","EMISweb","109 York Road","Chingford","E4 8LF","TQ 37006 92657",537006,192657,51.616073999999998,-2.2546676000000002E-2]
["Active","F86627","Churchill Medical Centre","WF","Waltham Forest","WF-2","Chingford E4","Chingford E4","U47946","EMISweb","1 Churchill Terrace","Chingford","E4 8DG","TQ 37293 92913",537293,192913,51.618304000000002,-1.8303841000000001E-2]
["Active","F86078","The Ridgeway Surgery","WF","Waltham Forest","WF-2","Chingford E4","Chingford E4","U47946","EMISweb","1 Mount Echo Avenue","Chingford","E4 7JX","TQ 37765 94083",537765,194083,51.628701999999997,-1.1030843E-2]
["Active","F86616","Old Church Surgery","WF","Waltham Forest","WF-2","Chingford E4","Chingford E4","U47946","EMISweb","99 Chingford Avenue","Chingford","E4 6RG","TQ 37534 93450",537534,193450,51.623071000000003,-1.4614411000000001E-2]
["Active","F86074","Leyton Healthcare (Oliver Road)","WF","Waltham Forest","WF-3","Leyton Collaborative","Leyton Collaborative","U87776","SystmOne","Leyton Orient Football Club (West Stand), 75 Oliver Road","Leyton","E10 5LG","TQ 37815 86429",537815,186429,51.559911999999997,-1.3312475000000001E-2]
["Active","F86011","The Manor Practice","WF","Waltham Forest","WF-3","Leyton Collaborative","Leyton Collaborative","U87776","EMISweb","454 Lea Bridge Road","Leyton","E10 7DY","TQ 37179 87682",537179,187682,51.571325999999999,-2.1992728E-2]
["Active","F86038","Sma Medical Centre","WF","Waltham Forest","WF-3","Leyton Collaborative","Leyton Collaborative","U87776","EMISweb","693-695 High Road","Leyton","E10 6RA","TQ 38108 87688",538108,187688,51.571154,-8.5942013999999994E-3]
["Active","F86018","The Ecclesbourne Practice","WF","Waltham Forest","WF-4","Forest Integrated Health","Forest Intergrated Health","U65471","SystmOne","Ecclesbourne Warwick Terrace, Leabridge Rd","Leyton","E17 9DP","TQ 38574 88755",538574,188755,51.580627,-1.4539803E-3]
["Active","F86036","The Allum Medical Centre","WF","Waltham Forest","WF-4","Forest Integrated Health","Forest Intergrated Health","U65471","EMISweb","Fairlop Road","Leytonstone","E11 1BN","TQ 38947 87574",538947,187574,51.569923000000003,3.4589922000000002E-3]
["Active","F86044","Crawley Road Medical Centre","WF","Waltham Forest","WF-4","Forest Integrated Health","Forest Intergrated Health","U65471","EMISweb","479 High Road","Leyton","E10 5EL","TQ 37940 86918",537940,186918,51.564276,-1.1318719E-2]
["Active","F86696","Francis Road Medical Centre","WF","Waltham Forest","WF-4","Forest Integrated Health","Forest Intergrated Health","U65471","EMISweb","94 Francis Road","Leyton","E10 6PP","TQ 38466 86672",538466,186672,51.561936000000003,-3.8318204999999998E-3]
["Active","F86712","Hampton Medical Centre","WF","Waltham Forest","WF-4","Forest Integrated Health","Forest Intergrated Health","U65471","EMISweb","1 Pretoria Road","Leytonstone","E11 4BB","TQ 38721 87186",538721,187186,51.566491999999997,4.7171125999999997E-5]
["Active","F86650","Lime Tree Surgery","WF","Waltham Forest","WF-4","Forest Integrated Health","Forest Intergrated Health","U65471","EMISweb","38 Cann Hall Road","Leytonstone","E11 3HZ","TQ 39258 85734",539258,185734,51.553313000000003,7.2151919999999996E-3]
["Active","F86088","The Lyndhurst Surgery","WF","Waltham Forest","WF-4","Forest Integrated Health","Forest Intergrated Health","U65471","EMISweb","53 Lyndhurst Drive","Leyton","E10 6JB","TQ 38433 87787",538433,187787,51.571964000000001,-3.8687688000000001E-3]
["Active","F86621","Green Man Medical Centre","WF","Waltham Forest","WF-5","South Leytonstone","South Leytonstone","U47812","EMISweb","1 Hanbury Drive","Leytonstone","E11 1HR","TQ 39685 87696",539685,187696,51.570836999999997,1.4148923000000001E-2]
["Active","F86045","High Road Surgery","WF","Waltham Forest","WF-5","South Leytonstone","South Leytonstone","U47812","EMISweb","287 High Road","Leytonstone","E11 4HH","TQ 39101 85749",539101,185749,51.553485999999999,4.9580980000000002E-3]
["Active","F86701","Kiyani Medical Practice","WF","Waltham Forest","WF-5","South Leytonstone","South Leytonstone","U47812","EMISweb","13 Langthorne Rd","Leytonstone","E11 4HX","TQ 38897 85957",538897,185957,51.555405999999998,2.0996700000000001E-3]
["Active","F86625","LL Medical Care (Agarwal & Agrwal Practice)","WF","Waltham Forest","WF-5","South Leytonstone","South Leytonstone","U47812","EMISweb","13 Langthorne Rd","Leytonstone","E11 4HX","TQ 38897 85957",538897,185957,51.555405999999998,2.0996700000000001E-3]
["Active","F86666","The Harrow Road Surgery","WF","Waltham Forest","WF-5","South Leytonstone","South Leytonstone","U47812","EMISweb","2-8 Harrow Road","Leytonstone","E11 3QF","TQ 39369 86366",539369,186366,51.558964000000003,9.0654107999999997E-3]
["Active","F86705","The Langthorne Sharma Family Practice","WF","Waltham Forest","WF-5","South Leytonstone","South Leytonstone","U47812","EMISweb","13 Langthorne Rd","Leytonstone","E11 4HX","TQ 38897 85957",538897,185957,51.555405999999998,2.0996700000000001E-3]
["Active","F86607","Addison Road Medical Practice","WF","Waltham Forest","WF-6","Central Walthamstow","Central Walthamstow","U93045","EMISweb","Comely Bank Clinic","Walthamstow","E17 9LY","TQ 38040 89024",538040,189024,51.583176000000002,-9.0501534999999998E-3]
["Active","F86708","Claremont Medical Centre","WF","Waltham Forest","WF-6","Central Walthamstow","Central Walthamstow","U93045","EMISweb","29-31 Claremont Medical Centre","Walthamstow","E17 5RJ","TQ 36291 90221",536291,190221,51.594357000000002,-3.3813172000000002E-2]
["Active","F86001","The Firs","WF","Waltham Forest","WF-6","Central Walthamstow","Central Walthamstow","U93045","EMISweb","26 Stephenson Road","Walthamstow","E17 7JT","TQ 36241 88655",536241,188655,51.580297000000002,-3.5141800000000001E-2]
["Active","F86086","Dr Dhital Practice","WF","Waltham Forest","WF-6","Central Walthamstow","Central Walthamstow","U93045","EMISweb","6 Linford Rd","Walthamstow","E17 3LA","TQ 38444 89544",538444,189544,51.587749000000002,-3.0181050000000001E-3]
["Active","F86644","Waltham Forest Community & Family Health Services Ltd","WF","Waltham Forest","WF-6","Central Walthamstow","Central Walthamstow","U93045","EMISweb","6 Linford Rd","Walthamstow","E17 3LA","TQ 38444 89544",538444,189544,51.587749000000002,-3.0181050000000001E-3]
["Active","F86006","Seymour Medical Centre","WF","Waltham Forest","WF-7","Walthamstow West","Walthamstow West ","U17084","EMISweb","266 Lea Bridge Road","Walthamstow","E10 7LD","TQ 36763 87420",536763,187420,51.569073000000003,-2.8093386000000001E-2]
["Active","F86030","Queens Road Medical Centre","WF","Waltham Forest","WF-7","Walthamstow West","Walthamstow West ","U17084","EMISweb","48 Queens Road","Walthamstow","E17 8PX","TQ 37259 88627",537259,188627,51.579799000000001,-2.0470187000000001E-2]
["Active","F86062","Grove Surgery","WF","Waltham Forest","WF-7","Walthamstow West","Walthamstow West ","U17084","EMISweb","103-105 Grove Road","Walthamstow","E17 9BU","TQ 37919 88578",537919,188578,51.579197000000001,-1.0970442E-2]
["Active","F86679","Higham Hill Medical Centre","WF","Waltham Forest","WF-7","Walthamstow West","Walthamstow West ","U17084","EMISweb","258-260 Higham Hill Road","Walthamstow","E17 5RQ","TQ 36234 90272",536234,190272,51.594828999999997,-3.4615754999999998E-2]
["Active","F86058","St James Medical Practice Ltd","WF","Waltham Forest","WF-7","Walthamstow West","Walthamstow West ","U17085","EMISweb","47 St James St","Walthamstow","E17 7NH","TQ 36455 88670",536455,188670,51.580379999999998,-3.2049451E-2]
["N/A","Y06760","City & Hackney GP Confederation","CH","City & Hackney",null,null,null,null,"EMISweb"]

{"sheet":"DATA","index":14,"n_rows":274,"n_cols":12,"rows_kept":274,"cut":false,"hidden":true,"merged":[]}
["Rel_D","OrgID","00-00","08-CKD","NIS08-CKD01","NIS08-CKD02","NIS08-CKD03","NIS08-CKD04","Practice","Locality ID","SubLocality ID","SubLocality"]
["2021-10-01","F86701",3769,80,80,50,66,35,"Kiyani Medical Practice","WF","WF-5","South Leytonstone"]
["2021-10-01","F86616",7799,286,249,190,172,111,"Old Church Surgery","WF","WF-2","Chingford E4"]
["2021-10-01","F86700",3876,179,179,112,124,65,"Kings Head Medical Practice","WF","WF-1","Chingford/ Walthamstow"]
["2021-10-01","F86650",8069,146,125,62,92,54,"Lime Tree Surgery","WF","WF-4","Forest Integrated Health"]
["2021-10-01","F86062",7321,161,110,63,122,53,"Grove Surgery","WF","WF-7","Walthamstow West"]
["2021-10-01","F86689",4368,85,71,58,58,50,"The Bailey Practice","WF","WF-1","Chingford/ Walthamstow"]
["2021-10-01","F86696",6932,131,125,68,103,52,"Francis Road Medical Centre","WF","WF-4","Forest Integrated Health"]
["2021-10-01","F86030",8137,168,139,98,132,86,"Queens Road Medical Centre","WF","WF-7","Walthamstow West"]
["2021-10-01","F86625",5887,162,140,69,109,58,"LL Medical Care (Agarwal & Agrwal Practice)","WF","WF-5","South Leytonstone"]
["2021-10-01","F86712",3329,75,72,32,62,18,"Hampton Medical Centre","WF","WF-4","Forest Integrated Health"]
["2021-10-01","Y01291",9040,390,356,213,265,174,"Chingford Medical Practice","WF","WF-2","Chingford E4"]
["2021-10-01","F86058",16559,256,208,158,180,117,"St James Medical Practice Ltd","WF","WF-7","Walthamstow West"]
["2021-10-01","F86621",6421,158,145,79,129,50,"Green Man Medical Centre","WF","WF-5","South Leytonstone"]
["2021-10-01","F86001",7744,212,184,100,129,30,"The Firs","WF","WF-6","Central Walthamstow"]
["2021-10-01","F86627",13357,538,477,223,354,113,"Churchill Medical Centre","WF","WF-2","Chingford E4"]
["2021-10-01","Y01839",6340,160,142,82,127,39,"Lime Tree & Sinnott Healthcare Ltd","WF","WF-1","Chingford/ Walthamstow"]
["2021-10-01","F86078",6905,347,109,123,207,58,"The Ridgeway Surgery","WF","WF-2","Chingford E4"]
["2021-10-01","F86045",2019,53,45,20,41,35,"High Road Surgery","WF","WF-5","South Leytonstone"]
["2021-10-01","F86088",4904,111,96,33,81,49,"The Lyndhurst Surgery","WF","WF-4","Forest Integrated Health"]
["2021-10-01","F86644",9590,224,181,92,146,58,"Waltham Forest Community & Family Health Services Ltd","WF","WF-6","Central Walthamstow"]
["2021-10-01","F86705",3551,63,61,40,44,26,"The Langthorne Sharma Family Practice","WF","WF-5","South Leytonstone"]
["2021-10-01","F86036",15175,321,235,131,212,87,"The Allum Medical Centre","WF","WF-4","Forest Integrated Health"]
["2021-10-01","F86679",6115,85,79,50,70,39,"Higham Hill Medical Centre","WF","WF-7","Walthamstow West"]
["2021-10-01","F86708",2856,62,61,30,50,27,"Claremont Medical Centre","WF","WF-6","Central Walthamstow"]
["2021-10-01","F86086",6180,84,63,38,48,19,"Dr Dhital Practice","WF","WF-6","Central Walthamstow"]
["2021-10-01","F86607",15127,267,240,142,207,156,"Addison Road Medical Practice","WF","WF-6","Central Walthamstow"]
["2021-10-01","F86005",9384,203,185,92,137,59,"The Penryhn Surgery","WF","WF-1","Chingford/ Walthamstow"]
["2021-10-01","F86626",6852,108,95,49,68,30,"Dr Shantir Practice","WF","WF-1","Chingford/ Walthamstow"]
["2021-10-01","F86038",11379,210,167,129,155,113,"Sma Medical Centre","WF","WF-3","Leyton Collaborative"]
["2021-10-01","F86664",8430,202,153,135,138,113,"Larkshall Medical Centre","WF","WF-1","Chingford/ Walthamstow"]
["2021-10-01","F86011",9593,225,169,139,157,117,"The Manor Practice","WF","WF-3","Leyton Collaborative"]
["2021-10-01","F86666",14764,269,255,154,194,141,"The Harrow Road Surgery","WF","WF-5","South Leytonstone"]
["2021-10-01","F86044",10125,106,94,43,71,17,"Crawley Road Medical Centre","WF","WF-4","Forest Integrated Health"]
["2021-10-01","F86006",6692,149,111,68,89,39,"Seymour Medical Centre","WF","WF-7","Walthamstow West"]
["2021-11-01","F86679",6163,86,80,58,71,40,"Higham Hill Medical Centre","WF","WF-7","Walthamstow West"]
["2021-11-01","F86088",4922,109,95,35,82,49,"The Lyndhurst Surgery","WF","WF-4","Forest Integrated Health"]
["2021-11-01","F86086",6186,87,65,41,51,21,"Dr Dhital Practice","WF","WF-6","Central Walthamstow"]
["2021-11-01","F86650",8059,149,128,62,95,86,"Lime Tree Surgery","WF","WF-4","Forest Integrated Health"]
["2021-11-01","F86036",15128,325,238,144,216,91,"The Allum Medical Centre","WF","WF-4","Forest Integrated Health"]
["2021-11-01","F86627",13367,540,477,235,354,115,"Churchill Medical Centre","WF","WF-2","Chingford E4"]
["2021-11-01","F86696",6915,130,121,67,96,49,"Francis Road Medical Centre","WF","WF-4","Forest Integrated Health"]
["2021-11-01","F86044",10256,110,96,44,76,20,"Crawley Road Medical Centre","WF","WF-4","Forest Integrated Health"]
["2021-11-01","F86078",6965,348,109,125,209,56,"The Ridgeway Surgery","WF","WF-2","Chingford E4"]
["2021-11-01","F86616",7841,295,253,184,177,107,"Old Church Surgery","WF","WF-2","Chingford E4"]
["2021-11-01","F86011",9630,228,170,140,159,106,"The Manor Practice","WF","WF-3","Leyton Collaborative"]
["2021-11-01","F86038",11386,208,165,132,154,98,"Sma Medical Centre","WF","WF-3","Leyton Collaborative"]
["2021-11-01","F86712",3352,77,73,35,66,16,"Hampton Medical Centre","WF","WF-4","Forest Integrated Health"]
["2021-11-01","F86001",7738,206,175,109,120,31,"The Firs","WF","WF-6","Central Walthamstow"]
["2021-11-01","F86689",4383,87,76,50,60,45,"The Bailey Practice","WF","WF-1","Chingford/ Walthamstow"]
["2021-11-01","F86666",14772,273,262,159,196,137,"The Harrow Road Surgery","WF","WF-5","South Leytonstone"]
["2021-11-01","F86664",8409,204,156,116,142,87,"Larkshall Medical Centre","WF","WF-1","Chingford/ Walthamstow"]
["2021-11-01","F86700",3881,183,180,116,124,62,"Kings Head Medical Practice","WF","WF-1","Chingford/ Walthamstow"]
["2021-11-01","F86701",3774,80,79,47,67,35,"Kiyani Medical Practice","WF","WF-5","South Leytonstone"]
["2021-11-01","F86625",5884,159,139,66,111,56,"LL Medical Care (Agarwal & Agrwal Practice)","WF","WF-5","South Leytonstone"]
["2021-11-01","F86705",3535,65,61,39,45,25,"The Langthorne Sharma Family Practice","WF","WF-5","South Leytonstone"]
["2021-11-01","F86607",15178,263,240,144,204,139,"Addison Road Medical Practice","WF","WF-6","Central Walthamstow"]
["2021-11-01","F86005",9412,199,184,96,133,54,"The Penryhn Surgery","WF","WF-1","Chingford/ Walthamstow"]
["2021-11-01","F86708",2860,61,59,32,48,24,"Claremont Medical Centre","WF","WF-6","Central Walthamstow"]
["2021-11-01","F86006",6725,151,110,70,89,43,"Seymour Medical Centre","WF","WF-7","Walthamstow West"]
["2021-11-01","F86626",6898,107,92,43,64,23,"Dr Shantir Practice","WF","WF-1","Chingford/ Walthamstow"]
["2021-11-01","F86030",8118,168,139,102,132,89,"Queens Road Medical Centre","WF","WF-7","Walthamstow West"]
["2021-11-01","F86062",7292,161,112,72,122,56,"Grove Surgery","WF","WF-7","Walthamstow West"]
["2021-11-01","F86045",2031,52,45,17,40,30,"High Road Surgery","WF","WF-5","South Leytonstone"]
["2021-11-01","Y01839",6320,159,139,64,123,32,"Lime Tree & Sinnott Healthcare Ltd","WF","WF-1","Chingford/ Walthamstow"]
["2021-11-01","F86621",6442,159,145,83,129,51,"Green Man Medical Centre","WF","WF-5","South Leytonstone"]
["2021-11-01","Y01291",9061,393,362,220,266,182,"Chingford Medical Practice","WF","WF-2","Chingford E4"]
["2021-11-01","F86058",16780,258,210,163,182,108,"St James Medical Practice Ltd","WF","WF-7","Walthamstow West"]
["2021-11-01","F86644",9517,225,218,85,145,58,"Waltham Forest Community & Family Health Services Ltd","WF","WF-6","Central Walthamstow"]
["2021-12-01","F86607",15284,262,241,147,202,137,"Addison Road Medical Practice","WF","WF-6","Central Walthamstow"]
["2021-12-01","F86001",7751,212,179,112,127,31,"The Firs","WF","WF-6","Central Walthamstow"]
["2021-12-01","F86030",8099,169,141,103,132,90,"Queens Road Medical Centre","WF","WF-7","Walthamstow West"]
["2021-12-01","F86036",14979,320,234,153,215,88,"The Allum Medical Centre","WF","WF-4","Forest Integrated Health"]
["2021-12-01","F86088",4948,111,96,38,86,51,"The Lyndhurst Surgery","WF","WF-4","Forest Integrated Health"]
["2021-12-01","F86062",7280,158,112,71,123,61,"Grove Surgery","WF","WF-7","Walthamstow West"]
["2021-12-01","F86705",3531,67,61,42,48,21,"The Langthorne Sharma Family Practice","WF","WF-5","South Leytonstone"]
["2021-12-01","F86621",6435,162,145,91,134,50,"Green Man Medical Centre","WF","WF-5","South Leytonstone"]
["2021-12-01","F86701",3777,84,81,57,70,56,"Kiyani Medical Practice","WF","WF-5","South Leytonstone"]
["2021-12-01","F86650",8073,143,128,62,91,91,"Lime Tree Surgery","WF","WF-4","Forest Integrated Health"]
["2021-12-01","F86712",3373,80,73,39,69,17,"Hampton Medical Centre","WF","WF-4","Forest Integrated Health"]
["2021-12-01","F86045",2022,51,46,26,40,34,"High Road Surgery","WF","WF-5","South Leytonstone"]
["2021-12-01","F86696",6767,128,118,69,96,48,"Francis Road Medical Centre","WF","WF-4","Forest Integrated Health"]
["2021-12-01","F86666",14845,270,258,151,193,137,"The Harrow Road Surgery","WF","WF-5","South Leytonstone"]
["2021-12-01","F86044",10257,109,97,45,74,23,"Crawley Road Medical Centre","WF","WF-4","Forest Integrated Health"]
["2021-12-01","F86625",5903,157,137,66,112,46,"LL Medical Care (Agarwal & Agrwal Practice)","WF","WF-5","South Leytonstone"]
["2021-12-01","F86708",2882,58,56,30,45,24,"Claremont Medical Centre","WF","WF-6","Central Walthamstow"]
["2021-12-01","F86616",7861,301,264,211,183,105,"Old Church Surgery","WF","WF-2","Chingford E4"]
["2021-12-01","F86058",16622,253,212,164,180,106,"St James Medical Practice Ltd","WF","WF-7","Walthamstow West"]
["2021-12-01","F86689",4382,87,76,54,59,35,"The Bailey Practice","WF","WF-1","Chingford/ Walthamstow"]
["2021-12-01","F86626",6913,107,93,47,63,18,"Dr Shantir Practice","WF","WF-1","Chingford/ Walthamstow"]
["2021-12-01","F86664",8427,209,163,109,150,64,"Larkshall Medical Centre","WF","WF-1","Chingford/ Walthamstow"]
["2021-12-01","Y01291",9086,388,358,220,260,183,"Chingford Medical Practice","WF","WF-2","Chingford E4"]
["2021-12-01","F86627",13317,540,472,239,354,120,"Churchill Medical Centre","WF","WF-2","Chingford E4"]
["2021-12-01","F86078",6916,345,109,121,208,54,"The Ridgeway Surgery","WF","WF-2","Chingford E4"]
["2021-12-01","F86700",3892,182,181,122,122,61,"Kings Head Medical Practice","WF","WF-1","Chingford/ Walthamstow"]
["2021-12-01","Y01839",6291,158,140,62,122,32,"Lime Tree & Sinnott Healthcare Ltd","WF","WF-1","Chingford/ Walthamstow"]
["2021-12-01","F86679",6211,82,76,57,68,42,"Higham Hill Medical Centre","WF","WF-7","Walthamstow West"]
["2021-12-01","F86006",6750,149,110,72,88,42,"Seymour Medical Centre","WF","WF-7","Walthamstow West"]
["2021-12-01","F86086",6193,87,65,41,51,20,"Dr Dhital Practice","WF","WF-6","Central Walthamstow"]
["2021-12-01","F86038",11364,205,162,128,150,89,"Sma Medical Centre","WF","WF-3","Leyton Collaborative"]
["2021-12-01","F86644",9492,223,216,91,143,57,"Waltham Forest Community & Family Health Services Ltd","WF","WF-6","Central Walthamstow"]
["2021-12-01","F86011",9624,226,167,139,157,94,"The Manor Practice","WF","WF-3","Leyton Collaborative"]
["2021-12-01","F86005",9513,193,179,88,126,55,"The Penryhn Surgery","WF","WF-1","Chingford/ Walthamstow"]
["2022-01-01","F86001",7743,212,179,109,129,33,"The Firs","WF","WF-6","Central Walthamstow"]
["2022-01-01","F86045",2020,48,44,33,39,34,"High Road Surgery","WF","WF-5","South Leytonstone"]
["2022-01-01","Y01839",6271,156,137,63,118,31,"Lime Tree & Sinnott Healthcare Ltd","WF","WF-1","Chingford/ Walthamstow"]
["2022-01-01","F86621",6394,162,144,88,133,51,"Green Man Medical Centre","WF","WF-5","South Leytonstone"]
["2022-01-01","F86058",16682,249,208,165,181,109,"St James Medical Practice Ltd","WF","WF-7","Walthamstow West"]
["2022-01-01","F86626",6933,108,94,48,64,17,"Dr Shantir Practice","WF","WF-1","Chingford/ Walthamstow"]
["2022-01-01","F86036",14935,312,231,160,209,86,"The Allum Medical Centre","WF","WF-4","Forest Integrated Health"]
["2022-01-01","Y01291",9075,381,349,219,260,193,"Chingford Medical Practice","WF","WF-2","Chingford E4"]
["2022-01-01","F86005",9491,188,175,81,124,52,"The Penryhn Surgery","WF","WF-1","Chingford/ Walthamstow"]
["2022-01-01","F86666",14888,269,255,158,193,135,"The Harrow Road Surgery","WF","WF-5","South Leytonstone"]
["2022-01-01","F86689",4374,85,75,52,58,24,"The Bailey Practice","WF","WF-1","Chingford/ Walthamstow"]
["2022-01-01","F86006",6771,147,106,71,88,45,"Seymour Medical Centre","WF","WF-7","Walthamstow West"]
["2022-01-01","F86705",3547,65,60,40,46,21,"The Langthorne Sharma Family Practice","WF","WF-5","South Leytonstone"]
["2022-01-01","F86664",8437,210,164,106,151,44,"Larkshall Medical Centre","WF","WF-1","Chingford/ Walthamstow"]
["2022-01-01","F86625",5900,157,135,72,113,47,"LL Medical Care (Agarwal & Agrwal Practice)","WF","WF-5","South Leytonstone"]
["2022-01-01","F86701",3787,81,79,55,76,56,"Kiyani Medical Practice","WF","WF-5","South Leytonstone"]
["2022-01-01","F86607",15376,259,238,145,202,133,"Addison Road Medical Practice","WF","WF-6","Central Walthamstow"]
["2022-01-01","F86700",3887,177,177,121,117,51,"Kings Head Medical Practice","WF","WF-1","Chingford/ Walthamstow"]
["2022-01-01","F86062",7233,154,108,71,123,58,"Grove Surgery","WF","WF-7","Walthamstow West"]
["2022-01-01","F86708",2894,56,54,29,44,24,"Claremont Medical Centre","WF","WF-6","Central Walthamstow"]
["2022-01-01","F86627",13287,536,461,239,353,119,"Churchill Medical Centre","WF","WF-2","Chingford E4"]
["2022-01-01","F86650",8075,142,134,62,91,98,"Lime Tree Surgery","WF","WF-4","Forest Integrated Health"]
["2022-01-01","F86030",8128,169,141,102,133,89,"Queens Road Medical Centre","WF","WF-7","Walthamstow West"]
["2022-01-01","F86616",7911,291,255,205,174,95,"Old Church Surgery","WF","WF-2","Chingford E4"]
["2022-01-01","F86044",10358,113,100,49,76,24,"Crawley Road Medical Centre","WF","WF-4","Forest Integrated Health"]
["2022-01-01","F86086",6191,87,64,44,53,22,"Dr Dhital Practice","WF","WF-6","Central Walthamstow"]
["2022-01-01","F86679",6272,76,71,54,62,34,"Higham Hill Medical Centre","WF","WF-7","Walthamstow West"]
["2022-01-01","F86011",9658,220,165,133,151,89,"The Manor Practice","WF","WF-3","Leyton Collaborative"]
["2022-01-01","F86696",6837,126,118,68,95,50,"Francis Road Medical Centre","WF","WF-4","Forest Integrated Health"]
["2022-01-01","F86078",6927,337,108,111,205,49,"The Ridgeway Surgery","WF","WF-2","Chingford E4"]
["2022-01-01","F86088",4967,115,97,48,89,56,"The Lyndhurst Surgery","WF","WF-4","Forest Integrated Health"]
["2022-01-01","F86712",3370,79,71,41,67,17,"Hampton Medical Centre","WF","WF-4","Forest Integrated Health"]
["2022-01-01","F86644",9406,219,211,89,144,55,"Waltham Forest Community & Family Health Services Ltd","WF","WF-6","Central Walthamstow"]
["2022-01-01","F86038",11371,202,159,134,146,87,"Sma Medical Centre","WF","WF-3","Leyton Collaborative"]
["2022-02-01","F86058",16789,248,210,165,185,113,"St James Medical Practice Ltd","WF","WF-7","Walthamstow West"]
["2022-02-01","F86708",2789,56,53,30,44,25,"Claremont Medical Centre","WF","WF-6","Central Walthamstow"]
["2022-02-01","F86086",6237,86,63,40,53,21,"Dr Dhital Practice","WF","WF-6","Central Walthamstow"]
["2022-02-01","F86679",6309,74,69,52,60,34,"Higham Hill Medical Centre","WF","WF-7","Walthamstow West"]
["2022-02-01","F86664",8450,211,167,110,152,40,"Larkshall Medical Centre","WF","WF-1","Chingford/ Walthamstow"]
["2022-02-01","F86666",14919,262,250,161,186,136,"The Harrow Road Surgery","WF","WF-5","South Leytonstone"]
["2022-02-01","F86005",9507,189,176,81,127,50,"The Penryhn Surgery","WF","WF-1","Chingford/ Walthamstow"]
["2022-02-01","F86006",6788,145,104,74,89,45,"Seymour Medical Centre","WF","WF-7","Walthamstow West"]
["2022-02-01","F86036",14841,306,226,159,204,87,"The Allum Medical Centre","WF","WF-4","Forest Integrated Health"]
["2022-02-01","F86038",11266,194,153,138,141,100,"Sma Medical Centre","WF","WF-3","Leyton Collaborative"]
["2022-02-01","F86607",15420,261,235,140,198,134,"Addison Road Medical Practice","WF","WF-6","Central Walthamstow"]
["2022-02-01","F86044",10506,114,102,51,77,24,"Crawley Road Medical Centre","WF","WF-4","Forest Integrated Health"]
["2022-02-01","F86626",6974,104,90,50,63,18,"Dr Shantir Practice","WF","WF-1","Chingford/ Walthamstow"]
["2022-02-01","F86011",9691,218,165,127,147,80,"The Manor Practice","WF","WF-3","Leyton Collaborative"]
["2022-02-01","F86030",8095,167,139,106,131,87,"Queens Road Medical Centre","WF","WF-7","Walthamstow West"]
["2022-02-01","F86705",3542,63,58,40,45,21,"The Langthorne Sharma Family Practice","WF","WF-5","South Leytonstone"]
["2022-02-01","F86078",6914,329,115,113,196,50,"The Ridgeway Surgery","WF","WF-2","Chingford E4"]
["2022-02-01","Y01839",6266,149,132,63,113,32,"Lime Tree & Sinnott Healthcare Ltd","WF","WF-1","Chingford/ Walthamstow"]
["2022-02-01","F86644",9371,216,208,87,140,58,"Waltham Forest Community & Family Health Services Ltd","WF","WF-6","Central Walthamstow"]
["2022-02-01","F86700",3856,174,174,116,117,45,"Kings Head Medical Practice","WF","WF-1","Chingford/ Walthamstow"]
["2022-02-01","F86045",2025,48,44,33,39,34,"High Road Surgery","WF","WF-5","South Leytonstone"]
["2022-02-01","F86621",6384,163,144,86,134,45,"Green Man Medical Centre","WF","WF-5","South Leytonstone"]
["2022-02-01","F86627",13275,535,458,252,351,121,"Churchill Medical Centre","WF","WF-2","Chingford E4"]
["2022-02-01","F86088",4998,112,96,45,86,57,"The Lyndhurst Surgery","WF","WF-4","Forest Integrated Health"]
["2022-02-01","Y01291",9176,377,347,224,255,194,"Chingford Medical Practice","WF","WF-2","Chingford E4"]
["2022-02-01","F86650",8096,144,135,62,93,98,"Lime Tree Surgery","WF","WF-4","Forest Integrated Health"]
["2022-02-01","F86062",7198,152,110,68,123,59,"Grove Surgery","WF","WF-7","Walthamstow West"]
["2022-02-01","F86689",4371,85,74,53,58,23,"The Bailey Practice","WF","WF-1","Chingford/ Walthamstow"]
["2022-02-01","F86625",5908,152,131,66,112,48,"LL Medical Care (Agarwal & Agrwal Practice)","WF","WF-5","South Leytonstone"]
["2022-02-01","F86696",6864,128,116,71,96,48,"Francis Road Medical Centre","WF","WF-4","Forest Integrated Health"]
["2022-02-01","F86616",7956,284,249,203,169,91,"Old Church Surgery","WF","WF-2","Chingford E4"]
["2022-02-01","F86701",3822,83,80,53,77,56,"Kiyani Medical Practice","WF","WF-5","South Leytonstone"]
["2022-02-01","F86712",3371,75,68,38,65,16,"Hampton Medical Centre","WF","WF-4","Forest Integrated Health"]
["2022-02-01","F86001",7727,207,182,108,126,31,"The Firs","WF","WF-6","Central Walthamstow"]
["2022-03-01","F86708",2788,55,51,29,41,22,"Claremont Medical Centre","WF","WF-6","Central Walthamstow"]
["2022-03-01","F86644",9330,217,207,88,142,65,"Waltham Forest Community & Family Health Services Ltd","WF","WF-6","Central Walthamstow"]
["2022-03-01","F86001",7737,203,182,103,125,34,"The Firs","WF","WF-6","Central Walthamstow"]
["2022-03-01","F86086",6251,88,66,39,55,21,"Dr Dhital Practice","WF","WF-6","Central Walthamstow"]
["2022-03-01","F86679",6359,73,68,50,59,30,"Higham Hill Medical Centre","WF","WF-7","Walthamstow West"]
["2022-03-01","F86078",6875,320,112,124,191,47,"The Ridgeway Surgery","WF","WF-2","Chingford E4"]
["2022-03-01","F86627",13278,538,458,256,352,120,"Churchill Medical Centre","WF","WF-2","Chingford E4"]
["2022-03-01","F86616",7971,276,240,198,167,86,"Old Church Surgery","WF","WF-2","Chingford E4"]
["2022-03-01","F86036",14787,305,227,165,206,95,"The Allum Medical Centre","WF","WF-4","Forest Integrated Health"]
["2022-03-01","F86038",11108,192,153,150,144,97,"Sma Medical Centre","WF","WF-3","Leyton Collaborative"]
["2022-03-01","F86011",9693,218,167,116,147,59,"The Manor Practice","WF","WF-3","Leyton Collaborative"]
["2022-03-01","Y01291",9168,367,360,216,247,196,"Chingford Medical Practice","WF","WF-2","Chingford E4"]
["2022-03-01","F86058",16718,243,205,161,181,110,"St James Medical Practice Ltd","WF","WF-7","Walthamstow West"]
["2022-03-01","F86626",7000,105,89,53,64,19,"Dr Shantir Practice","WF","WF-1","Chingford/ Walthamstow"]
["2022-03-01","F86005",9521,188,174,91,125,53,"The Penryhn Surgery","WF","WF-1","Chingford/ Walthamstow"]
["2022-03-01","F86664",8452,207,165,107,150,41,"Larkshall Medical Centre","WF","WF-1","Chingford/ Walthamstow"]
["2022-03-01","Y01839",6246,150,128,68,112,37,"Lime Tree & Sinnott Healthcare Ltd","WF","WF-1","Chingford/ Walthamstow"]
["2022-03-01","F86700",3846,171,171,120,118,48,"Kings Head Medical Practice","WF","WF-1","Chingford/ Walthamstow"]
["2022-03-01","F86689",4374,83,71,47,58,20,"The Bailey Practice","WF","WF-1","Chingford/ Walthamstow"]
["2022-03-01","F86044",10689,115,102,52,79,24,"Crawley Road Medical Centre","WF","WF-4","Forest Integrated Health"]
["2022-03-01","F86625",5881,148,130,65,111,47,"LL Medical Care (Agarwal & Agrwal Practice)","WF","WF-5","South Leytonstone"]
["2022-03-01","F86701",3829,85,81,55,78,58,"Kiyani Medical Practice","WF","WF-5","South Leytonstone"]
["2022-03-01","F86045",2027,49,46,33,40,36,"High Road Surgery","WF","WF-5","South Leytonstone"]
["2022-03-01","F86666",14948,261,249,166,188,140,"The Harrow Road Surgery","WF","WF-5","South Leytonstone"]
["2022-03-01","F86607",15508,261,235,136,199,133,"Addison Road Medical Practice","WF","WF-6","Central Walthamstow"]
["2022-03-01","F86705",3535,61,57,39,45,21,"The Langthorne Sharma Family Practice","WF","WF-5","South Leytonstone"]
["2022-03-01","F86030",8107,161,135,99,126,84,"Queens Road Medical Centre","WF","WF-7","Walthamstow West"]
["2022-03-01","F86621",6419,159,140,85,129,42,"Green Man Medical Centre","WF","WF-5","South Leytonstone"]
["2022-03-01","F86006",6820,142,101,66,88,47,"Seymour Medical Centre","WF","WF-7","Walthamstow West"]
["2022-03-01","F86696",6844,122,111,66,91,48,"Francis Road Medical Centre","WF","WF-4","Forest Integrated Health"]
["2022-03-01","F86712",3368,75,75,38,65,18,"Hampton Medical Centre","WF","WF-4","Forest Integrated Health"]
["2022-03-01","F86062",7172,149,108,67,120,63,"Grove Surgery","WF","WF-7","Walthamstow West"]
["2022-03-01","F86088",5003,111,94,45,85,57,"The Lyndhurst Surgery","WF","WF-4","Forest Integrated Health"]
["2022-03-01","F86650",8087,146,135,65,93,100,"Lime Tree Surgery","WF","WF-4","Forest Integrated Health"]
["2022-04-01","F86062",7155,142,102,63,114,64,"Grove Surgery","WF","WF-7","Walthamstow West"]
["2022-04-01","F86058",16560,236,200,162,178,113,"St James Medical Practice Ltd","WF","WF-7","Walthamstow West"]
["2022-04-01","F86030",8160,165,140,106,129,87,"Queens Road Medical Centre","WF","WF-7","Walthamstow West"]
["2022-04-01","F86006",6812,144,105,66,91,47,"Seymour Medical Centre","WF","WF-7","Walthamstow West"]
["2022-04-01","F86679",6371,74,67,51,58,27,"Higham Hill Medical Centre","WF","WF-7","Walthamstow West"]
["2022-04-01","F86616",7996,268,232,187,164,90,"Old Church Surgery","WF","WF-2","Chingford E4"]
["2022-04-01","F86078",6869,316,113,128,190,49,"The Ridgeway Surgery","WF","WF-2","Chingford E4"]
["2022-04-01","F86627",13283,531,447,265,350,120,"Churchill Medical Centre","WF","WF-2","Chingford E4"]
["2022-04-01","F86011",9696,217,169,110,144,56,"The Manor Practice","WF","WF-3","Leyton Collaborative"]
["2022-04-01","F86044",10801,117,105,56,83,28,"Crawley Road Medical Centre","WF","WF-4","Forest Integrated Health"]
["2022-04-01","F86036",14732,305,224,167,206,98,"The Allum Medical Centre","WF","WF-4","Forest Integrated Health"]
["2022-04-01","F86038",11103,190,152,150,145,100,"Sma Medical Centre","WF","WF-3","Leyton Collaborative"]
["2022-04-01","F86664",8471,209,165,105,148,38,"Larkshall Medical Centre","WF","WF-1","Chingford/ Walthamstow"]
["2022-04-01","F86626",7013,103,86,47,64,20,"Dr Shantir Practice","WF","WF-1","Chingford/ Walthamstow"]
["2022-04-01","F86005",9502,185,171,90,124,52,"The Penryhn Surgery","WF","WF-1","Chingford/ Walthamstow"]
["2022-04-01","F86689",4395,82,70,41,56,14,"The Bailey Practice","WF","WF-1","Chingford/ Walthamstow"]
["2022-04-01","Y01291",9172,368,357,225,247,206,"Chingford Medical Practice","WF","WF-2","Chingford E4"]
["2022-04-01","Y01839",6230,151,129,70,111,41,"Lime Tree & Sinnott Healthcare Ltd","WF","WF-1","Chingford/ Walthamstow"]
["2022-04-01","F86700",3901,172,172,124,115,49,"Kings Head Medical Practice","WF","WF-1","Chingford/ Walthamstow"]
["2022-04-01","F86696",6873,117,109,62,92,50,"Francis Road Medical Centre","WF","WF-4","Forest Integrated Health"]
["2022-04-01","F86607",15518,263,238,138,202,130,"Addison Road Medical Practice","WF","WF-6","Central Walthamstow"]
["2022-04-01","F86705",3507,59,54,35,42,19,"The Langthorne Sharma Family Practice","WF","WF-5","South Leytonstone"]
["2022-04-01","F86666",14976,263,251,172,194,144,"The Harrow Road Surgery","WF","WF-5","South Leytonstone"]
["2022-04-01","F86708",2782,56,52,30,42,22,"Claremont Medical Centre","WF","WF-6","Central Walthamstow"]
["2022-04-01","F86644",9214,217,205,101,137,68,"Waltham Forest Community & Family Health Services Ltd","WF","WF-6","Central Walthamstow"]
["2022-04-01","F86086",6237,84,63,39,52,18,"Dr Dhital Practice","WF","WF-6","Central Walthamstow"]
["2022-04-01","F86001",7727,199,179,98,126,42,"The Firs","WF","WF-6","Central Walthamstow"]
["2022-04-01","F86088",5027,109,93,46,86,56,"The Lyndhurst Surgery","WF","WF-4","Forest Integrated Health"]
["2022-04-01","F86650",8077,144,131,67,96,100,"Lime Tree Surgery","WF","WF-4","Forest Integrated Health"]
["2022-04-01","F86712",3392,74,73,40,64,16,"Hampton Medical Centre","WF","WF-4","Forest Integrated Health"]
[44652,"F86621",6444,158,138,88,131,50,"Green Man Medical Centre","WF","WF-5","South Leytonstone"]
[44652,"F86625",5880,148,129,76,112,47,"LL Medical Care (Agarwal & Agrwal Practice)","WF","WF-5","South Leytonstone"]
[44652,"F86701",3853,84,80,53,77,55,"Kiyani Medical Practice","WF","WF-5","South Leytonstone"]
[44652,"F86045",2025,50,45,35,39,37,"High Road Surgery","WF","WF-5","South Leytonstone"]
[44470,"F86004",16004,835,593,369,470,116,"Handsworth Medical Centre","WF","WF-2","Chingford E4"]
[44470,"F86018",9961,483,372,227,261,167,"The Ecclesbourne Practice","WF","WF-4","Forest Integrated Health"]
[44470,"F86026",7201,278,201,173,159,140,"Forest Surgery","WF","WF-1","Chingford/ Walthamstow"]
[44470,"F86074",15274,353,264,193,234,115,"Leyton Healthcare (Oliver Road)","WF","WF-3","Leyton Collaborative"]
[44470,"F86638",5297,277,177,137,187,129,"The Microfaculty","WF","WF-1","Chingford/ Walthamstow"]
[44501,"F86004",15999,835,594,384,471,121,"Handsworth Medical Centre","WF","WF-2","Chingford E4"]
[44501,"F86018",9970,489,373,238,263,161,"The Ecclesbourne Practice","WF","WF-4","Forest Integrated Health"]
[44501,"F86026",7207,279,202,175,162,138,"Forest Surgery","WF","WF-1","Chingford/ Walthamstow"]
[44501,"F86074",15282,356,264,180,234,107,"Leyton Healthcare (Oliver Road)","WF","WF-3","Leyton Collaborative"]
[44501,"F86638",5283,275,174,118,186,97,"The Microfaculty","WF","WF-1","Chingford/ Walthamstow"]
[44531,"F86004",15995,831,590,385,471,119,"Handsworth Medical Centre","WF","WF-2","Chingford E4"]
[44531,"F86018",9955,494,374,247,270,148,"The Ecclesbourne Practice","WF","WF-4","Forest Integrated Health"]
[44531,"F86026",7195,276,198,182,160,138,"Forest Surgery","WF","WF-1","Chingford/ Walthamstow"]
[44531,"F86074",15239,362,266,185,237,105,"Leyton Healthcare (Oliver Road)","WF","WF-3","Leyton Collaborative"]
[44531,"F86638",5256,275,176,114,186,87,"The Microfaculty","WF","WF-1","Chingford/ Walthamstow"]
[44562,"F86004",15941,821,580,390,462,119,"Handsworth Medical Centre","WF","WF-2","Chingford E4"]
[44562,"F86018",9934,496,375,250,268,153,"The Ecclesbourne Practice","WF","WF-4","Forest Integrated Health"]
[44562,"F86026",7227,277,196,179,159,130,"Forest Surgery","WF","WF-1","Chingford/ Walthamstow"]
[44562,"F86074",15211,369,266,186,239,104,"Leyton Healthcare (Oliver Road)","WF","WF-3","Leyton Collaborative"]
[44562,"F86638",5263,271,174,115,181,88,"The Microfaculty","WF","WF-1","Chingford/ Walthamstow"]
[44593,"F86004",15887,815,576,393,458,123,"Handsworth Medical Centre","WF","WF-2","Chingford E4"]
[44593,"F86018",9911,494,376,256,270,139,"The Ecclesbourne Practice","WF","WF-4","Forest Integrated Health"]
[44593,"F86026",7185,277,195,181,156,85,"Forest Surgery","WF","WF-1","Chingford/ Walthamstow"]
[44593,"F86074",15191,368,263,189,239,107,"Leyton Healthcare (Oliver Road)","WF","WF-3","Leyton Collaborative"]
[44593,"F86638",5248,273,176,116,183,89,"The Microfaculty","WF","WF-1","Chingford/ Walthamstow"]
[44621,"F86004",15917,814,575,400,456,122,"Handsworth Medical Centre","WF","WF-2","Chingford E4"]
[44621,"F86018",9913,495,375,258,269,141,"The Ecclesbourne Practice","WF","WF-4","Forest Integrated Health"]
[44621,"F86026",7189,275,194,174,155,72,"Forest Surgery","WF","WF-1","Chingford/ Walthamstow"]
[44621,"F86074",15100,366,260,189,238,101,"Leyton Healthcare (Oliver Road)","WF","WF-3","Leyton Collaborative"]
[44621,"F86638",5220,270,201,116,179,87,"The Microfaculty","WF","WF-1","Chingford/ Walthamstow"]
[44652,"F86004",15928,809,570,410,456,null,"Handsworth Medical Centre","WF","WF-2","Chingford E4"]
[44652,"F86018",9931,490,369,255,268,null,"The Ecclesbourne Practice","WF","WF-4","Forest Integrated Health"]
[44652,"F86026",7141,276,194,166,157,null,"Forest Surgery","WF","WF-1","Chingford/ Walthamstow"]
[44652,"F86074",15084,372,260,189,242,null,"Leyton Healthcare (Oliver Road)","WF","WF-3","Leyton Collaborative"]
[44652,"F86638",5191,275,204,144,180,null,"The Microfaculty","WF","WF-1","Chingford/ Walthamstow"]

{"sheet":"Sheet6","index":15,"n_rows":7,"n_cols":2,"rows_kept":7,"cut":false,"hidden":true,"merged":[]}
["Systmone.Name","Emis.Name"]
["1.12_With_BP_below_140_90_(WF_Dashboards_CEG___CKD_KPI)","NIS08-CKD02: evidence of CKD with BP below 140/90"]
["1.13_On_Statins_(WF_Dashboards_CEG___CKD_KPI)","NIS08-CKD03: evidence of CKD on Statins"]
["1.14_Has_ACR_(WF_Dashboards_CEG___CKD_KPI)","NIS08-CKD04: evidence of CKD has ACR"]
["1.0_Listsize_(WF_Dashboards_CEG___CKD_KPI)","[00-00] Listsize"]
["1.1_Evidence_of_CKD_(WF_Dashboards_CEG___CKD_KPI)","[08-CKD] eGFR evidence of CKD"]
["1.11_QOF_coded_(WF_Dashboards_CEG___CKD_KPI)","NIS08-CKD01: evidence of CKD coded (QOF v46)"]

{"sheet":"Sheet7","index":16,"n_rows":36,"n_cols":12,"rows_kept":36,"cut":false,"hidden":true,"merged":[]}
["Rel_D","OrgID","00-00","08-CKD","NIS08-CKD01","NIS08-CKD02","NIS08-CKD03","NIS08-CKD04","Practice","Locality ID","SubLocality ID","SubLocality"]
["2021-10-01","F86004",16004,835,593,369,470,116,"Handsworth Medical Centre","WF","WF-2","Chingford E4"]
["2021-10-01","F86018",9961,483,372,227,261,167,"The Ecclesbourne Practice","WF","WF-4","Forest Integrated Health"]
["2021-10-01","F86026",7201,278,201,173,159,140,"Forest Surgery","WF","WF-1","Chingford/ Walthamstow"]
["2021-10-01","F86074",15274,353,264,193,234,115,"Leyton Healthcare (Oliver Road)","WF","WF-3","Leyton Collaborative"]
["2021-10-01","F86638",5297,277,177,137,187,129,"The Microfaculty","WF","WF-1","Chingford/ Walthamstow"]
["2021-11-01","F86004",15999,835,594,384,471,121,"Handsworth Medical Centre","WF","WF-2","Chingford E4"]
["2021-11-01","F86018",9970,489,373,238,263,161,"The Ecclesbourne Practice","WF","WF-4","Forest Integrated Health"]
["2021-11-01","F86026",7207,279,202,175,162,138,"Forest Surgery","WF","WF-1","Chingford/ Walthamstow"]
["2021-11-01","F86074",15282,356,264,180,234,107,"Leyton Healthcare (Oliver Road)","WF","WF-3","Leyton Collaborative"]
["2021-11-01","F86638",5283,275,174,118,186,97,"The Microfaculty","WF","WF-1","Chingford/ Walthamstow"]
["2021-12-01","F86004",15995,831,590,385,471,119,"Handsworth Medical Centre","WF","WF-2","Chingford E4"]
["2021-12-01","F86018",9955,494,374,247,270,148,"The Ecclesbourne Practice","WF","WF-4","Forest Integrated Health"]
["2021-12-01","F86026",7195,276,198,182,160,138,"Forest Surgery","WF","WF-1","Chingford/ Walthamstow"]
["2021-12-01","F86074",15239,362,266,185,237,105,"Leyton Healthcare (Oliver Road)","WF","WF-3","Leyton Collaborative"]
["2021-12-01","F86638",5256,275,176,114,186,87,"The Microfaculty","WF","WF-1","Chingford/ Walthamstow"]
["2022-01-01","F86004",15941,821,580,390,462,119,"Handsworth Medical Centre","WF","WF-2","Chingford E4"]
["2022-01-01","F86018",9934,496,375,250,268,153,"The Ecclesbourne Practice","WF","WF-4","Forest Integrated Health"]
["2022-01-01","F86026",7227,277,196,179,159,130,"Forest Surgery","WF","WF-1","Chingford/ Walthamstow"]
["2022-01-01","F86074",15211,369,266,186,239,104,"Leyton Healthcare (Oliver Road)","WF","WF-3","Leyton Collaborative"]
["2022-01-01","F86638",5263,271,174,115,181,88,"The Microfaculty","WF","WF-1","Chingford/ Walthamstow"]
["2022-02-01","F86004",15887,815,576,393,458,123,"Handsworth Medical Centre","WF","WF-2","Chingford E4"]
["2022-02-01","F86018",9911,494,376,256,270,139,"The Ecclesbourne Practice","WF","WF-4","Forest Integrated Health"]
["2022-02-01","F86026",7185,277,195,181,156,85,"Forest Surgery","WF","WF-1","Chingford/ Walthamstow"]
["2022-02-01","F86074",15191,368,263,189,239,107,"Leyton Healthcare (Oliver Road)","WF","WF-3","Leyton Collaborative"]
["2022-02-01","F86638",5248,273,176,116,183,89,"The Microfaculty","WF","WF-1","Chingford/ Walthamstow"]
[44621,"F86004",15917,814,575,400,456,122,"Handsworth Medical Centre","WF","WF-2","Chingford E4"]
[44621,"F86018",9913,495,375,258,269,141,"The Ecclesbourne Practice","WF","WF-4","Forest Integrated Health"]
[44621,"F86026",7189,275,194,174,155,72,"Forest Surgery","WF","WF-1","Chingford/ Walthamstow"]
[44621,"F86074",15100,366,260,189,238,101,"Leyton Healthcare (Oliver Road)","WF","WF-3","Leyton Collaborative"]
[44621,"F86638",5220,270,201,116,179,87,"The Microfaculty","WF","WF-1","Chingford/ Walthamstow"]
[44652,"F86004",15928,809,570,410,456,null,"Handsworth Medical Centre","WF","WF-2","Chingford E4"]
[44652,"F86018",9931,490,369,255,268,null,"The Ecclesbourne Practice","WF","WF-4","Forest Integrated Health"]
[44652,"F86026",7141,276,194,166,157,null,"Forest Surgery","WF","WF-1","Chingford/ Walthamstow"]
[44652,"F86074",15084,372,260,189,242,null,"Leyton Healthcare (Oliver Road)","WF","WF-3","Leyton Collaborative"]
[44652,"F86638",5191,275,204,144,180,null,"The Microfaculty","WF","WF-1","Chingford/ Walthamstow"]