{"text_format":"1","workbook":"xlsx","n_sheets":17,"sheets":["Compiled_06_2018","Homepage","Summary","Detail","TRENDS","PRACTICE","HEADERTOGGLE","HEADERINFO2","Locations","BLANK","CHART","Sheet2","Sheet3","Sheet4","DATA","Sheet6","Sheet7"],"not_rendered":{"charts":3,"images":9,"macros":1,"external_links":14,"defined_names":25,"comments":0,"pivot_tables":0},"unopened":[],"bounds":{"document_bytes":16777216,"sheet_cells":100000,"rows_first":2000,"rows_last":500,"rows_between":2000,"halvings":0,"cell_chars":16384,"cell_head_chars":4096},"cells_cut":0,"cells_raw":0,"read":"whole","date_system":"1900"}

{"sheet":"Compiled_06_2018","index":0,"n_rows":62,"n_cols":13,"rows_kept":62,"cut":false,"hidden":true,"merged":[]}
["PracName","Locality","NACS","Worksheet","[00-00]","[08-CKD]","NIS08-CKD01","NIS08-CKD01%","NIS08-CKD02","NIS08-CKD02%","NIS08-CKD03","NIS08-CKD03%","NIS08-CKD08"]
[null,null,null,"Seach Code:","[00-00]","[08-CKD]","NIS08-CKD01","NIS08-CKD01%","NIS08-CKD02","NIS08-CKD02%","NIS08-CKD03","NIS08-CKD03%","NIS08-CKD08"]
["2018-06-01",null,null,"Found EMISweb Search:","[00-00] Listsize","[08-CKD] eGFR evidence of CKD","NIS08-CKD01: evidence of CKD coded CKD (QOF v33)",null,"NIS08-CKD02: evidence of CKD with appropriate BP",null,"NIS08-CKD03: evidence of CKD on Statins",null,"NIS08-CKD08: Referrals to community renal clinic"]
[null,null,null,"Relative Run Date:","2018-06-01","2018-06-01","2018-06-01",null,"2018-06-01",null,"2018-06-01",null,"2018-06-01"]
[null,null,null,"Top Left EMISweb Data:","$A$9","$A$45","$A$81",null,"$A$117",null,"$A$153",null,"$A$225"]
["2018-06-01",null,null,"EMISweb Array Start:","$B$9","$B$45","$B$81",null,"$B$117",null,"$B$153",null,"$B$225"]
{"$rows_left_out":57}
{"sheet":"Homepage","index":1,"n_rows":29,"n_cols":13,"rows_kept":29,"cut":false,"hidden":false,"merged":[[18,2,19,3],[18,4,19,4],[4,5,4,7],[6,2,7,3],[8,2,9,3],[10,2,11,3],[12,2,13,3],[14,2,15,3],[12,4,13,4],[14,4,15,4],[16,4,17,4],[16,2,17,3],[6,4,7,4],[8,4,9,4],[10,4,11,4]]}
[]
[null,null,"WF CKD MANAGEMENT 2021-2022",null,null,null,"SELECT DATE >>",null,null,"SELECT PRACTICE >>",null,null,"SELECT KPI >>"]
[]
[]
[null,null,{"$f":"UPPER(CHART!B1)","v":"EVIDENCE OF CKD WITH ACR"},null,null,"PROGRESS TO TARGET",null,null,null,null,null,"MONTHLY ACHIEVEMENT TREND"]
[]
{"$rows_left_out":24}
{"sheet":"Summary","index":2,"n_rows":11,"n_cols":13,"rows_kept":11,"cut":false,"hidden":false,"merged":[]}
[null,"Waltham Forest: CKD - Summary "]
[null,null,null,null,null,"<< SELECT  DATE"]
[]
[null,null,null,"[00-00]","[08-CKD]","NIS08-CKD01","NIS08-CKD01%","NIS08-CKD02","NIS08-CKD02%","NIS08-CKD03","NIS08-CKD03%",null,"NIS08-CKD03%"]
[null,null,null,"Listsize","eGFR evidence of CKD","evidence of CKD coded CKD","% evidence of CKD coded CKD","evidence of CKD with BP below 140/90","% evidence of CKD with BP below 140/90","evidence of CKD on Statins","% evidence of CKD on Statins","evidence of CKD to have ACR","% evidence of CKD to have ACR"]
[null,"Select a Practice >>","Leyton Healthcare (Oliver Road) **",{"$f":"IF(COUNTIFS(WF_CKD_DATA[[#All],[OrgID]],PRACTICE!$F$11,WF_CKD_DATA[[#All],[Rel_D]],Locations!$E$17)=0,\"-\",(SUMIFS(WF_CKD_DATA[[#All],[00-00]],WF_CKD_DATA[[#All],[OrgID]],PRACTICE!F11,WF_CKD_DATA[[#All],[Rel_D]],Locations!$E$17)))","v":15084},{"$f":"IF(COUNTIFS(WF_CKD_DATA[[#All],[OrgID]],PRACTICE!$F$11,WF_CKD_DATA[[#All],[Rel_D]],Locations!$E$17)=0,\"-\",(SUMIFS(WF_CKD_DATA[[#All],[08-CKD]],WF_CKD_DATA[[#All],[OrgID]],PRACTICE!F11,WF_CKD_DATA[[#All],[Rel_D]],Locations!$E$17)))","v":372},{"$f":"IF(COUNTIFS(WF_CKD_DATA[[#All],[OrgID]],PRACTICE!$F$11,WF_CKD_DATA[[#All],[Rel_D]],Locations!$E$17)=0,\"-\",(SUMIFS(WF_CKD_DATA[[#All],[NIS08-CKD01]],WF_CKD_DATA[[#All],[OrgID]],PRACTICE!F11,WF_CKD_DATA[[#All],[Rel_D]],Locations!$E$17)))","v":260},{"$f":"IFERROR(F6/E6,\"-\")","v":0.69892473118279574},{"$f":"IF(COUNTIFS(WF_CKD_DATA[[#All],[OrgID]],PRACTICE!$F$11,WF_CKD_DATA[[#All],[Rel_D]],Locations!$E$17)=0,\"-\",(SUMIFS(WF_CKD_DATA[[#All],[NIS08-CKD02]],WF_CKD_DATA[[#All],[OrgID]],PRACTICE!F11,WF_CKD_DATA[[#All],[Rel_D]],Locations!$E$17)))","v":189},{"$f":"IFERROR(H6/E6,\"-\")","v":0.50806451612903225},{"$f":"IF(COUNTIFS(WF_CKD_DATA[[#All],[OrgID]],PRACTICE!$F$11,WF_CKD_DATA[[#All],[Rel_D]],Locations!$E$17)=0,\"-\",(SUMIFS(WF_CKD_DATA[[#All],[NIS08-CKD03]],WF_CKD_DATA[[#All],[OrgID]],PRACTICE!F11,WF_CKD_DATA[[#All],[Rel_D]],Locations!$E$17)))","v":242},{"$f":"IFERROR(J6/E6,\"-\")","v":0.65053763440860213},{"$f":"IF(COUNTIFS(WF_CKD_DATA[[#All],[OrgID]],PRACTICE!$F$11,WF_CKD_DATA[[#All],[Rel_D]],Locations!$E$17)=0,\"-\",(SUMIFS(WF_CKD_DATA[[#All],[NIS08-CKD04]],WF_CKD_DATA[[#All],[OrgID]],PRACTICE!F11,WF_CKD_DATA[[#All],[Rel_D]],Locations!$E$17)))","v":0},{"$f":"IFERROR(L6/E6,\"-\")","v":0}]
{"$rows_left_out":6}
{"sheet":"Detail","index":3,"n_rows":62,"n_cols":15,"rows_kept":62,"cut":false,"hidden":false,"merged":[[56,12,56,13],[57,12,57,13],[58,12,58,13],[59,12,59,13],[57,3,57,4],[59,3,59,4],[56,3,56,4],[58,3,58,4]]}
[]
[null,null,null,null,{"$f":"MATCH(C6,HEADERINFO2!D:D,0)-1","v":2},"A",0,1,2,3,4,5,6,5,6]
[null,null,"CKD DETAIL",null,null,"[00-00]",{"$f":"OFFSET(HEADERINFO2!$B$1,$E$2+G2,0)","v":"[08-CKD]"},{"$f":"OFFSET(HEADERINFO2!$B$1,$E$2+H2,0)","v":"NIS08-CKD01"},{"$f":"OFFSET(HEADERINFO2!$B$1,$E$2+I2,0)","v":"NIS08-CKD01%"},{"$f":"OFFSET(HEADERINFO2!$B$1,$E$2+J2,0)","v":"NIS08-CKD02"},{"$f":"OFFSET(HEADERINFO2!$B$1,$E$2+K2,0)","v":"NIS08-CKD02%"},{"$f":"OFFSET(HEADERINFO2!$B$1,$E$2+L2,0)","v":"NIS08-CKD03"},{"$f":"OFFSET(HEADERINFO2!$B$1,$E$2+M2,0)","v":"NIS08-CKD03%"},"NIS08-CKD04","NIS08-CKD04%"]
[]
[null,null,"Practice","NACS","Locality","Listsize",{"$f":"VLOOKUP(G$3,INDIRECT(Locations!$B$39),2,0)","v":"Complex Care"}]
[null,null,{"$f":"F2&HEADERTOGGLE!$J$2","v":"A"},null,null,null,{"$f":"VLOOKUP(G$3,INDIRECT(Locations!$B$39),4,0)","v":"eGFR evidence of CKD"},{"$f":"VLOOKUP(H$3,INDIRECT(Locations!$B$39),4,0)","v":"evidence of CKD coded CKD"},{"$f":"VLOOKUP(I$3,INDIRECT(Locations!$B$39),4,0)","v":"% evidence of CKD coded CKD"},{"$f":"VLOOKUP(J$3,INDIRECT(Locations!$B$39),4,0)","v":"evidence of CKD with BP below 140/90"},{"$f":"VLOOKUP(K$3,INDIRECT(Locations!$B$39),4,0)","v":"% evidence of CKD with BP below 140/90"},{"$f":"VLOOKUP(L$3,INDIRECT(Locations!$B$39),4,0)","v":"evidence of CKD on Statins"},{"$f":"VLOOKUP(M$3,INDIRECT(Locations!$B$39),4,0)","v":"% evidence of CKD on Statins"},{"$f":"VLOOKUP(N$3,INDIRECT(Locations!$B$39),4,0)","v":"evidence of CKD to have ACR"},{"$f":"VLOOKUP(O$3,INDIRECT(Locations!$B$39),4,0)","v":"% evidence of CKD to have ACR"}]
{"$rows_left_out":57}
{"sheet":"TRENDS","index":4,"n_rows":64,"n_cols":31,"rows_kept":64,"cut":false,"hidden":true,"merged":[[14,0,14,2]]}
["Practice Trend: Trend Chart"]
[{"$f":"B2&\"%\"","v":"NIS08-CKD04%"},{"$f":"CHART!C1","v":"NIS08-CKD04"},{"$f":"Locations!E21","v":"01/04/2022"}]
["Practice","NACS","Locality",null,"Listsize","2021-04-01","2021-05-01","2021-06-01","2021-07-01","2021-08-01","2021-09-01","2021-10-01","2021-11-01","2021-12-01","2022-01-01","2022-02-01","2022-03-01","2022-04-01"]
[{"$f":"PRACTICE!E1","v":"The Microfaculty **"},{"$f":"PRACTICE!E2","v":"F86638"},{"$f":"PRACTICE!E5","v":"WF-1"},null,null,{"$f":"IF(TEXT(F3,0)<=TEXT($C$2,0),VLOOKUP(F3,$E$13:$H$25,3,0)/VLOOKUP(F3,$E$13:$H$25,2,0),#N/A)","v":{"$error":"#N/A"}},{"$error":"#N/A"},{"$error":"#N/A"},{"$error":"#N/A"},{"$error":"#N/A"},{"$error":"#N/A"},0.46570397111913359,0.35272727272727272,0.31636363636363635,0.32472324723247231,0.32600732600732601,{"$f":"IF(TEXT(Q3,0)<=TEXT($C$2,0),VLOOKUP(Q3,$E$13:$H$25,3,0)/VLOOKUP(Q3,$E$13:$H$25,2,0),#N/A)","v":0.32222222222222224},{"$error":"#N/A"}]
["Target",null,null,null,null,{"$f":"VLOOKUP($B$2,$B$16:$C$19,2)","v":0.5},{"$f":"VLOOKUP($B$2,$B$16:$C$19,2)","v":0.5},0.5,0.5,0.5,0.5,0.5,0.5,0.5,0.5,0.5,0.5,0.5]
[]
{"$rows_left_out":59}
{"sheet":"PRACTICE","index":5,"n_rows":40,"n_cols":14,"rows_kept":40,"cut":false,"hidden":true,"merged":[]}
[" -","Select Practice","Area","Locality","The Microfaculty **"]
["Y01291","Chingford Medical Practice","Chingford E4","WF-2",{"$f":"INDEX($A$1:$D$45,MATCH($E$1,$B$1:$B$45,0),1)","v":"F86638"},null,null,null,"Y01291","Chingford Medical Practice","Chingford E4",{"$f":"IF($K2=$M$2,$N$2,IF($K2=$M$3,$N$3,$N$4))","v":"WF-2"},"Chingford/ Walthamstow","WF-1"]
["F86627","Churchill Medical Centre","Chingford E4","WF-2",9,null,null,null,"F86627","Churchill Medical Centre","Chingford E4","WF-2","Chingford E4","WF-2"]
["F86078","The Ridgeway Surgery","Chingford E4","WF-2",{"$f":"\"'TRENDTABLE'!$A$\"&E3&\":$T$\"&E3","v":"'TRENDTABLE'!$A$9:$T$9"},null,null,null,"F86078","The Ridgeway Surgery","Chingford E4","WF-2","Leyton Collaborative","WF-3"]
["F86700","Kings Head Medical Practice","Chingford/ Walthamstow","WF-1",{"$f":"VLOOKUP(E2,A1:D41, 4, 0)","v":"WF-1"},null,null,null,"F86700","Kings Head Medical Practice","Chingford/ Walthamstow","WF-1","Forest Integrated Health","WF-4"]
["F86664","Larkshall Medical Centre","Chingford/ Walthamstow","WF-1",null,null,null,null,"F86664","Larkshall Medical Centre","Chingford/ Walthamstow","WF-1","South Leytonstone","WF-5"]
{"$rows_left_out":35}
{"sheet":"HEADERTOGGLE","index":6,"n_rows":40,"n_cols":10,"rows_kept":40,"cut":false,"hidden":true,"merged":[]}
["Condition","Indicator Type",true,"Condition","Indicator Type",false,"Alphabetical","Quadrant",true,false]
["iLTC01-RV01","iLTC10-RA01",null,"Complex Care","COPD",null,"F86607","Y01291",null,{"$f":"IF(J1,\"Y\",\"\")","v":""}]
["iLTC03-CP04","iLTC10-RA02",null,"IC101-ICC01","IC205-COPD01",null,"Y01291","F86627",null,{"$f":"IF(J1,\"in financial year\",\"in last 12 months\")","v":"in last 12 months"}]
["iLTC03-PS03","iLTC05-AS01",null,"IC101-ICC02","IC205-COPD02",null,"F86627","F86700"]
["iLTC03-RV04","iLTC01-RV01",null,"IC101-ICC03","IC205-COPD03",null,"F86708","F86664"]
["iLTC04-CP05","iLTC05-RV02",null,"IC101-ICC04","Cancer",null,"F86044","F86616"]
{"$rows_left_out":35}
{"sheet":"HEADERINFO2","index":7,"n_rows":88,"n_cols":9,"rows_kept":88,"cut":false,"hidden":true,"merged":[]}
["SearchID","FieldID","LTC","Type","Search Title","Target1","Target2","Pay1","Pay2"]
["[00-00]","[00-00]","Listsize",null,"Listsize"]
["[08-CKD]","[08-CKD]","Complex Care","A","eGFR evidence of CKD"]
["NIS08-CKD01","NIS08-CKD01","Complex Care","A","evidence of CKD coded CKD"]
["NIS08-CKD01%","NIS08-CKD01%","Complex Care","A","% evidence of CKD coded CKD",0.7,null,0.4]
["NIS08-CKD02","NIS08-CKD02","Complex Care","A","evidence of CKD with BP below 140/90"]
{"$rows_left_out":83}
{"sheet":"Locations","index":8,"n_rows":40,"n_cols":16,"rows_kept":40,"cut":false,"hidden":true,"merged":[]}
["Blank","01/04/2019","2019-05-01","2019-06-01","2019-07-01","2019-08-01","2019-09-01","2019-10-01","2019-11-01","2019-12-01","2020-01-01","2020-02-01","2020-03-01","2020-04-01","BLANK"]
["Data (Y/N)","Y","Y","Y","Y","Y","Y","Y","Y","Y","Y","Y","Y","Y"]
["File Name"]
["Q Work Sheet","Compiled_04_2018","Compiled_05_2018","Compiled_06_2018","Compiled_07_2018","Compiled_08_2018","Compiled_09_2018","Compiled_10_2018","Compiled_11_2018","Compiled_12_2018","Compiled_01_2019","Compiled_02_2019","Compiled_03_2019","Compiled_04_2019","BLANK",{"$f":"COUNTA(B4:N4)","v":13}]
["Sheet Address",{"$f":"\"'\"&IF(B3<>\"\",\"[\"&B3&\".xlsx]\",\"\")&IF(B2=\"N\",$O$5,B4)&\"'!\"","v":"'Compiled_04_2018'!"},"'Compiled_05_2018'!","'Compiled_06_2018'!","'Compiled_07_2018'!","'Compiled_08_2018'!","'Compiled_09_2018'!","'Compiled_10_2018'!","'Compiled_11_2018'!","'Compiled_12_2018'!","'Compiled_01_2019'!","'Compiled_02_2019'!","'Compiled_03_2019'!","'Compiled_04_2019'!",{"$f":"IF(O3<>\"\",\"[\"&O3&\".xlsx]\",\"\")&IF(O2=\"N\",\"\",O4)","v":"BLANK"}]
["Sheet Check",{"$f":"IF(ISREF(INDIRECT(B5&\"A1\")),\"OK\",\"WORKSHEET NOT FOUND\")","v":"OK"},"OK","OK","OK","OK","OK","OK","OK","OK","OK","OK","OK","OK"]
{"$rows_left_out":35}
{"sheet":"BLANK","index":9,"n_rows":61,"n_cols":12,"rows_kept":61,"cut":false,"hidden":true,"merged":[]}
["PracName","NW","NACS","Worksheet","[00-00]","[08-CKD]","NIS08-CKD01","NIS08-CKD01%","NIS08-CKD02","NIS08-CKD02%","NIS08-CKD03","NIS08-CKD03%"]
[null,null,null,"Seach Code:","[00-00]","[08-CKD]","NIS08-CKD01","NIS08-CKD01%","NIS08-CKD02","NIS08-CKD02%","NIS08-CKD03","NIS08-CKD03%"]
["BLANK",null,null,"Found EMISweb Search:","[00-00] Listsize","[08-CKD] eGFR evidence of CKD","NIS08-CKD01: evidence of CKD coded CKD (QOF v33)",null,"NIS08-CKD02: evidence of CKD with appropriate BP",null,"NIS08-CKD03: evidence of CKD on Statins"]
[null,null,null,"Top Left EMISweb Data:","$A$1","$A$46","$A$92",null,"$A$137",null,"$A$183"]
[null,null,null,"EMISweb Array Start:","$B$1","$B$46","$B$92",null,"$B$137",null,"$B$183"]
["2016-07-01",null,null,"EMISweb Array End:","$C$45","$C$91","$C$136",null,"$C$182",null,"$C$227"]
{"$rows_left_out":56}
{"sheet":"CHART","index":10,"n_rows":46,"n_cols":6,"rows_kept":46,"cut":false,"hidden":true,"merged":[[45,1,46,2],[45,3,46,3],[39,1,40,2],[39,3,40,3],[41,1,42,2],[41,3,42,3],[43,1,44,2],[43,3,44,3],[33,1,34,2],[33,3,34,3],[35,1,36,2],[35,3,36,3],[37,1,38,2],[37,3,38,3]]}
["Chart Selection ","evidence of CKD with ACR",{"$f":"VLOOKUP(B1,B2:C4,2,0)","v":"NIS08-CKD04"}]
["Chart List ","evidence of CKD with BP below 140/90","NIS08-CKD02","evidence of CKD not coded CKD","NIS08-CKD02%",{"$f":"IFERROR(TRENDS!AA51,#N/A)","v":0.54705036998356105}]
[null,"evidence of CKD on Statins","NIS08-CKD03","evidence of CKD with BP below 140/90","NIS08-CKD03%",{"$f":"IFERROR(TRENDS!AC51,#N/A)","v":0.70310558287567415}]
[null,"evidence of CKD with ACR","NIS08-CKD04","evidence of CKD not on Statins","NIS08-CKD04%",{"$f":"IFERROR(TRENDS!AE51,#N/A)","v":0.32127946963608123}]
[]
[]
{"$rows_left_out":41}
{"sheet":"Sheet2","index":11,"n_rows":5,"n_cols":7,"rows_kept":5,"cut":false,"hidden":true,"merged":[]}
["Column1","Column2","Column3","Column4","Column5","Column6","Column7"]
["Column8","Column10","Column11","Column12","Column13","Column14","Column15"]
["Search","{00-00} Listsize","{08-CKD} eGFR evidence of CKD","{NIS08-CKD01}: evidence of CKD coded CKD (QOF v46)","{NIS08-CKD02}: evidence of CKD with BP below 140/90","{NIS08-CKD03}: evidence of CKD on Statins","NIS08-CKD04: evidence of CKD has ACR"]
["OrgID","00-00","08-CKD","NIS08-CKD01","NIS08-CKD02","NIS08-CKD03","NIS08-CKD04"]
["OrgID","Listsize","eGFR evidence of CKD"," evidence of CKD coded CKD (QOF v33","evidence of CKD with BP below 140/90","evidence of CKD on Statins","evidence of CKD has ACR"]

{"sheet":"Sheet3","index":12,"n_rows":10,"n_cols":4,"rows_kept":10,"cut":false,"hidden":true,"merged":[]}
["Metric","MetricID","Target1","Target2"]
["MHA Depression Review + Activity (12M)",1,0.35]
["MHA Depression Review + Activity (IN YEAR)",2,0.35]
["Anti-Psych non-SMI Review + Activity (12M)",3,0.7]
["Anti-Psych non-SMI Review + Activity (IN YEAR)",4,0.7]
["SMI Review + Activity (12M)",5,0.7]
{"$rows_left_out":5}
{"sheet":"Sheet4","index":13,"n_rows":273,"n_cols":18,"rows_kept":273,"cut":false,"hidden":true,"merged":[]}
["Status","Practice ID","Practice","Locality ID","Locality","SubLocality ID","SubLocality","PCN/Network","PCN code","Clinical System","Address 1","Address 2","Postcode","Grid Reference","X (easting)","Y (northing)","Latitude","Longitude"]
["Active","F82001","Halbutt Street Surgery","BK","Barking and Dagenham","BK-1","East","Network East","U86966","EMISweb","2 Halbutt Street","Dagenham","RM9 5AS","TQ 48956 85305",548956,185305,51.546982999999997,0.14681208000000001]
["Active","F82005","Church Elm Lane Medical Practice","BK","Barking and Dagenham","BK-1","East","Network East","U86967","EMISweb","Church Elm Lane","Dagenham","RM10 9RR","TQ 49667 84556",549667,184556,51.540066000000003,0.15673988]
["Active","Y01719","Broad Street Medical Centre","BK","Barking and Dagenham","BK-1","East","Network East","U86968","EMISweb","Broad Street Resource Centre","Dagenham","RM10 9HU","TQ 49367 83962",549367,183962,51.534807999999998,0.15216547999999999]
["Active","Y02575","Porters Avenue Doctors Surgery","BK","Barking and Dagenham","BK-1","East","Network East","U86969","EMISweb","234 Porters Avenue","Dagenham","RM8 2EQ","TQ 47283 85077",547283,185077,51.545372999999998,0.12260706]
["Active","F82003","First Avenue Surgery","BK","Barking and Dagenham","BK-2","East One","Network East One","U27362","EMISweb","2 First Avenue","Dagenham","RM10 9AT","TQ 49762 83388",549762,183388,51.529546000000003,0.15761231000000001]
{"$rows_left_out":268}
{"sheet":"DATA","index":14,"n_rows":274,"n_cols":12,"rows_kept":274,"cut":false,"hidden":true,"merged":[]}
["Rel_D","OrgID","00-00","08-CKD","NIS08-CKD01","NIS08-CKD02","NIS08-CKD03","NIS08-CKD04","Practice","Locality ID","SubLocality ID","SubLocality"]
["2021-10-01","F86701",3769,80,80,50,66,35,"Kiyani Medical Practice","WF","WF-5","South Leytonstone"]
["2021-10-01","F86616",7799,286,249,190,172,111,"Old Church Surgery","WF","WF-2","Chingford E4"]
["2021-10-01","F86700",3876,179,179,112,124,65,"Kings Head Medical Practice","WF","WF-1","Chingford/ Walthamstow"]
["2021-10-01","F86650",8069,146,125,62,92,54,"Lime Tree Surgery","WF","WF-4","Forest Integrated Health"]
["2021-10-01","F86062",7321,161,110,63,122,53,"Grove Surgery","WF","WF-7","Walthamstow West"]
{"$rows_left_out":269}
{"sheet":"Sheet6","index":15,"n_rows":7,"n_cols":2,"rows_kept":7,"cut":false,"hidden":true,"merged":[]}
["Systmone.Name","Emis.Name"]
["1.12_With_BP_below_140_90_(WF_Dashboards_CEG___CKD_KPI)","NIS08-CKD02: evidence of CKD with BP below 140/90"]
["1.13_On_Statins_(WF_Dashboards_CEG___CKD_KPI)","NIS08-CKD03: evidence of CKD on Statins"]
["1.14_Has_ACR_(WF_Dashboards_CEG___CKD_KPI)","NIS08-CKD04: evidence of CKD has ACR"]
["1.0_Listsize_(WF_Dashboards_CEG___CKD_KPI)","[00-00] Listsize"]
["1.1_Evidence_of_CKD_(WF_Dashboards_CEG___CKD_KPI)","[08-CKD] eGFR evidence of CKD"]
{"$rows_left_out":2}
{"sheet":"Sheet7","index":16,"n_rows":36,"n_cols":12,"rows_kept":36,"cut":false,"hidden":true,"merged":[]}
["Rel_D","OrgID","00-00","08-CKD","NIS08-CKD01","NIS08-CKD02","NIS08-CKD03","NIS08-CKD04","Practice","Locality ID","SubLocality ID","SubLocality"]
["2021-10-01","F86004",16004,835,593,369,470,116,"Handsworth Medical Centre","WF","WF-2","Chingford E4"]
["2021-10-01","F86018",9961,483,372,227,261,167,"The Ecclesbourne Practice","WF","WF-4","Forest Integrated Health"]
["2021-10-01","F86026",7201,278,201,173,159,140,"Forest Surgery","WF","WF-1","Chingford/ Walthamstow"]
["2021-10-01","F86074",15274,353,264,193,234,115,"Leyton Healthcare (Oliver Road)","WF","WF-3","Leyton Collaborative"]
["2021-10-01","F86638",5297,277,177,137,187,129,"The Microfaculty","WF","WF-1","Chingford/ Walthamstow"]
{"$rows_left_out":30}