{"text_format":"1","workbook":"xlsx","n_sheets":7,"sheets":["Post-operative wound care","Composite Data","EMIS Data","Other Data","Control Panel","RB","Sheet2"],"not_rendered":{"charts":0,"images":1,"macros":0,"external_links":0,"defined_names":5,"comments":0,"pivot_tables":0},"unopened":[],"bounds":{"document_bytes":16777216,"sheet_cells":100000,"rows_first":2000,"rows_last":500,"rows_between":2000,"halvings":0,"cell_chars":16384,"cell_head_chars":4096},"cells_cut":0,"cells_raw":0,"read":"whole","date_system":"1900"}

{"sheet":"Post-operative wound care","index":0,"n_rows":54,"n_cols":16,"rows_kept":54,"cut":false,"hidden":false,"merged":[]}
[null,null,null,"Redbridge"]
[null,null,null,"Post-Operative Wound Care"]
[null,null,null,"01/04/2021 - 31/03/2022","Q4"]
[null,null,null,{"$f":"INDEX('Control Panel'!$E$2:$E$17,COLUMN(A1))","v":"Currently Registered Regular Patients"},{"$f":"INDEX('Control Panel'!$E$2:$E$17,COLUMN(B1))","v":"POWC 01 Post-operative wound care 2022"},{"$f":"INDEX('Control Panel'!$E$2:$E$17,COLUMN(C1))","v":0},{"$f":"INDEX('Control Panel'!$E$2:$E$17,COLUMN(D1))","v":"POWC 01 Post-operative wound care activity"},{"$f":"INDEX('Control Panel'!$E$2:$E$17,COLUMN(E1))","v":0},{"$f":"INDEX('Control Panel'!$E$2:$E$17,COLUMN(F1))","v":"POWC 0101 Referral to tissue viability service"},null,{"$f":"INDEX('Control Panel'!$E$2:$E$17,COLUMN(G1))","v":"POWC 0102 Refer to district nurse"},{"$f":"INDEX('Control Panel'!$E$2:$E$17,COLUMN(H1))","v":"POWC 0103 Orthopaedic referral"},null,null,null,{"$f":"INDEX('Control Panel'!$E$2:$E$17,COLUMN(I1))","v":"POWC 0104 Advice given about wound care"}]
[null,null,null,{"$f":"INDEX('Control Panel'!$F$2:$F$10,COLUMN(A1))","v":"Currently Registered Regular Patients"},{"$f":"INDEX('Control Panel'!$F$2:$F$10,COLUMN(B1))","v":"Patients with Post-operative wound care 2022-23"},"%",{"$f":"INDEX('Control Panel'!$F$2:$F$10,COLUMN(D1))","v":"Post-operative wound care activity recorded 2022-23"},"%",{"$f":"INDEX('Control Panel'!$F$2:$F$10,COLUMN(F1))","v":"Referral to tissue viability service"},"%",{"$f":"INDEX('Control Panel'!$F$2:$F$10,COLUMN(G1))","v":"Refer to district nurse"},"%",{"$f":"INDEX('Control Panel'!$F$2:$F$10,COLUMN(H1))","v":"Orthopaedic referral"},"%",{"$f":"INDEX('Control Panel'!$F$2:$F$10,COLUMN(I1))","v":"Advice given about wound care"},"%"]
[{"$f":"'Control Panel'!A5","v":"RB-1"},{"$f":"'Control Panel'!B5","v":"Cranbrook"},"L1",{"$f":"SUMIFS(D$13:D$54,$A$13:$A$54,$A6)","v":53154},{"$f":"SUMIFS(E$13:E$54,$A$13:$A$54,$A6)","v":246},{"$f":"SUM(E6/D6)","v":4.6280618579975169E-3},{"$f":"SUMIFS(G$13:G$20,$A$13:$A$20,$A6)","v":410},{"$f":"SUM(G6/D6)","v":7.7134364299958607E-3},{"$f":"SUMIFS(I$13:I$54,$A$13:$A$54,$A6)","v":6},{"$f":"SUM(I6/E6)","v":2.4390243902439025E-2},{"$f":"SUMIFS(K$13:K$54,$A$13:$A$54,$A6)","v":9},{"$f":"SUM(K6/E6)","v":3.6585365853658534E-2},{"$f":"SUMIFS(M$13:M$54,$A$13:$A$54,$A6)","v":22},{"$f":"SUM(M6/E6)","v":8.943089430894309E-2},{"$f":"SUMIFS(O$13:O$54,$A$13:$A$54,$A6)","v":161},{"$f":"SUM(O6/E6)","v":0.65447154471544711}]
[{"$f":"'Control Panel'!A6","v":"RB-2"},{"$f":"'Control Panel'!B6","v":"Fairlop"},"L2",{"$f":"SUMIFS(D$13:D$54,$A$13:$A$54,$A7)","v":45941},268,{"$f":"SUM(E7/D7)","v":5.8335691430312789E-3},{"$f":"SUMIFS(G$13:G$54,$A$13:$A$54,$A7)","v":888},{"$f":"SUM(G7/D7)","v":1.9329139548551404E-2},{"$f":"SUMIFS(I$13:I$54,$A$13:$A$54,$A7)","v":2},{"$f":"SUM(I7/E7)","v":7.462686567164179E-3},{"$f":"SUMIFS(K$13:K$54,$A$13:$A$54,$A7)","v":6},{"$f":"SUM(K7/E7)","v":2.2388059701492536E-2},23,{"$f":"SUM(M7/E7)","v":8.5820895522388058E-2},163,{"$f":"SUM(O7/E7)","v":0.60820895522388063}]
[{"$f":"'Control Panel'!A7","v":"RB-3"},{"$f":"'Control Panel'!B7","v":"Seven Kings"},"L3",59108,91,1.5395547134059687E-3,{"$f":"SUMIFS(G$13:G$54,$A$13:$A$54,$A8)","v":247},4.178791364959058E-3,3,3.2967032967032968E-2,5,5.4945054945054944E-2,11,0.12087912087912088,26,0.2857142857142857]
[{"$f":"'Control Panel'!A8","v":"RB-4"},{"$f":"'Control Panel'!B8","v":"Wanstead & Woodford"},"L4",82864,464,5.5995365900753042E-3,949,1.1452500482718671E-2,2,4.3103448275862068E-3,19,4.0948275862068964E-2,42,9.0517241379310345E-2,168,0.36206896551724138]
[{"$f":"'Control Panel'!A9","v":"RB-5"},{"$f":"'Control Panel'!B9","v":"Loxford"},null,75179,150,1.9952380318972052E-3,39,5.1876188829327343E-4,3,0.02,5,3.3333333333333333E-2,5,3.3333333333333333E-2,118,0.78666666666666663]
[{"$f":"'Control Panel'!A10","v":"RB-6"},{"$f":"'Control Panel'!B10","v":"NewCross Alliance"},null,34270,101,2.9471841260577765E-3,{"$f":"SUMIFS(G$13:G$54,$A$13:$A$54,$A11)","v":119},3.4724248613948057E-3,0,0,3,2.9702970297029702E-2,6,5.9405940594059403E-2,8,7.9207920792079209E-2]
[null,"Redbridge","Total",{"$f":"SUM(D13:D54)","v":350516},{"$f":"SUM(E13:E54)","v":1320},{"$f":"SUM(E12/D12)","v":3.7658765933652103E-3},{"$f":"SUM(G13:G54)","v":2652},{"$f":"SUM(G12/D12)","v":7.5659884284882857E-3},{"$f":"SUM(I13:I54)","v":16},{"$f":"SUM(I12/E12)","v":1.2121212121212121E-2},{"$f":"SUM(K13:K54)","v":47},{"$f":"SUM(K11/E11)","v":2.9702970297029702E-2},{"$f":"SUM(M13:M54)","v":109},{"$f":"SUM(M12/E12)","v":8.257575757575758E-2},{"$f":"SUM(O13:O54)","v":644},{"$f":"SUM(O12/E12)","v":0.48787878787878786}]
["RB-1","Drive Surgery","F86652",{"$f":"HLOOKUP($C13,'Composite Data'!$B$2:$AQ$9,MATCH('Post-operative wound care'!D$4,'Composite Data'!$A$2:$A$10,0),FALSE)","v":6917},{"$f":"HLOOKUP($C13,'Composite Data'!$B$2:$AQ$9,MATCH('Post-operative wound care'!E$4,'Composite Data'!$A$2:$A$10,0),FALSE)","v":45},6.5057105681653894E-3,{"$f":"HLOOKUP($C13,'Composite Data'!$B$2:$AQ$9,MATCH('Post-operative wound care'!G$4,'Composite Data'!$A$2:$A$10,0),FALSE)","v":92},1.3300563828249241E-2,{"$f":"HLOOKUP($C13,'Composite Data'!$B$2:$AQ$9,MATCH('Post-operative wound care'!I$4,'Composite Data'!$A$2:$A$10,0),FALSE)","v":0},{"$f":"IFERROR(SUM(I13/E13),\"0.0\"%)","v":0},{"$f":"HLOOKUP($C13,'Composite Data'!$B$2:$AQ$9,MATCH('Post-operative wound care'!K$4,'Composite Data'!$A$2:$A$10,0),FALSE)","v":0},{"$f":"IFERROR(SUM(K13/E13),\"0.0%\")","v":0},{"$f":"HLOOKUP($C13,'Composite Data'!$B$2:$AQ$9,MATCH('Post-operative wound care'!L$4,'Composite Data'!$A$2:$A$10,0),FALSE)","v":6},{"$f":"IFERROR(SUM(M13/E13),\"0.0\"%)","v":0.13333333333333333},{"$f":"HLOOKUP($C13,'Composite Data'!$B$2:$AQ$9,MATCH('Post-operative wound care'!P$4,'Composite Data'!$A$2:$A$10,0),FALSE)","v":23},{"$f":"IFERROR(SUM(O13/E13),\"0.0\"%)","v":0.51111111111111107}]
["RB-1","St Clements Surgery","F86702",{"$f":"HLOOKUP($C14,'Composite Data'!$B$2:$AQ$9,MATCH('Post-operative wound care'!D$4,'Composite Data'!$A$2:$A$10,0),FALSE)","v":5168},{"$f":"HLOOKUP($C14,'Composite Data'!$B$2:$AQ$9,MATCH('Post-operative wound care'!E$4,'Composite Data'!$A$2:$A$10,0),FALSE)","v":2},3.8699690402476783E-4,{"$f":"HLOOKUP($C14,'Composite Data'!$B$2:$AQ$9,MATCH('Post-operative wound care'!G$4,'Composite Data'!$A$2:$A$10,0),FALSE)","v":2},3.8699690402476783E-4,{"$f":"HLOOKUP($C14,'Composite Data'!$B$2:$AQ$9,MATCH('Post-operative wound care'!I$4,'Composite Data'!$A$2:$A$10,0),FALSE)","v":0},{"$f":"IFERROR(SUM(I14/E14),\"0.0\"%)","v":0},{"$f":"HLOOKUP($C14,'Composite Data'!$B$2:$AQ$9,MATCH('Post-operative wound care'!K$4,'Composite Data'!$A$2:$A$10,0),FALSE)","v":0},{"$f":"IFERROR(SUM(K14/E14),\"0.0%\")","v":0},{"$f":"HLOOKUP($C14,'Composite Data'!$B$2:$AQ$9,MATCH('Post-operative wound care'!L$4,'Composite Data'!$A$2:$A$10,0),FALSE)","v":0},{"$f":"IFERROR(SUM(M14/E14),\"0.0\"%)","v":0},{"$f":"HLOOKUP($C14,'Composite Data'!$B$2:$AQ$9,MATCH('Post-operative wound care'!P$4,'Composite Data'!$A$2:$A$10,0),FALSE)","v":1},{"$f":"IFERROR(SUM(O14/E14),\"0.0\"%)","v":0.5}]
["RB-1","Granville Medical Centre","Y00918",{"$f":"HLOOKUP($C15,'Composite Data'!$B$2:$AQ$9,MATCH('Post-operative wound care'!D$4,'Composite Data'!$A$2:$A$10,0),FALSE)","v":6583},{"$f":"HLOOKUP($C15,'Composite Data'!$B$2:$AQ$9,MATCH('Post-operative wound care'!E$4,'Composite Data'!$A$2:$A$10,0),FALSE)","v":47},7.1396020051648183E-3,{"$f":"HLOOKUP($C15,'Composite Data'!$B$2:$AQ$9,MATCH('Post-operative wound care'!G$4,'Composite Data'!$A$2:$A$10,0),FALSE)","v":91},1.3823484733404223E-2,{"$f":"HLOOKUP($C15,'Composite Data'!$B$2:$AQ$9,MATCH('Post-operative wound care'!I$4,'Composite Data'!$A$2:$A$10,0),FALSE)","v":2},4.2553191489361701E-2,{"$f":"HLOOKUP($C15,'Composite Data'!$B$2:$AQ$9,MATCH('Post-operative wound care'!K$4,'Composite Data'!$A$2:$A$10,0),FALSE)","v":6},0.1276595744680851,{"$f":"HLOOKUP($C15,'Composite Data'!$B$2:$AQ$9,MATCH('Post-operative wound care'!L$4,'Composite Data'!$A$2:$A$10,0),FALSE)","v":4},8.5106382978723402E-2,{"$f":"HLOOKUP($C15,'Composite Data'!$B$2:$AQ$9,MATCH('Post-operative wound care'!P$4,'Composite Data'!$A$2:$A$10,0),FALSE)","v":43},0.91489361702127658]
["RB-1","Balfour Road Surgery","F86042",{"$f":"HLOOKUP($C16,'Composite Data'!$B$2:$AQ$9,MATCH('Post-operative wound care'!D$4,'Composite Data'!$A$2:$A$10,0),FALSE)","v":6308},{"$f":"HLOOKUP($C16,'Composite Data'!$B$2:$AQ$9,MATCH('Post-operative wound care'!E$4,'Composite Data'!$A$2:$A$10,0),FALSE)","v":46},7.2923272035510462E-3,{"$f":"HLOOKUP($C16,'Composite Data'!$B$2:$AQ$9,MATCH('Post-operative wound care'!G$4,'Composite Data'!$A$2:$A$10,0),FALSE)","v":110},1.7438173747622066E-2,{"$f":"HLOOKUP($C16,'Composite Data'!$B$2:$AQ$9,MATCH('Post-operative wound care'!I$4,'Composite Data'!$A$2:$A$10,0),FALSE)","v":4},8.6956521739130432E-2,{"$f":"HLOOKUP($C16,'Composite Data'!$B$2:$AQ$9,MATCH('Post-operative wound care'!K$4,'Composite Data'!$A$2:$A$10,0),FALSE)","v":0},0,{"$f":"HLOOKUP($C16,'Composite Data'!$B$2:$AQ$9,MATCH('Post-operative wound care'!L$4,'Composite Data'!$A$2:$A$10,0),FALSE)","v":1},2.1739130434782608E-2,{"$f":"HLOOKUP($C16,'Composite Data'!$B$2:$AQ$9,MATCH('Post-operative wound care'!P$4,'Composite Data'!$A$2:$A$10,0),FALSE)","v":42},0.91304347826086951]
["RB-1","Cranbrook Surgery","F86698",{"$f":"HLOOKUP($C17,'Composite Data'!$B$2:$AQ$9,MATCH('Post-operative wound care'!D$4,'Composite Data'!$A$2:$A$10,0),FALSE)","v":5183},{"$f":"HLOOKUP($C17,'Composite Data'!$B$2:$AQ$9,MATCH('Post-operative wound care'!E$4,'Composite Data'!$A$2:$A$10,0),FALSE)","v":13},2.5081998842369285E-3,{"$f":"HLOOKUP($C17,'Composite Data'!$B$2:$AQ$9,MATCH('Post-operative wound care'!G$4,'Composite Data'!$A$2:$A$10,0),FALSE)","v":21},4.0517075053058075E-3,{"$f":"HLOOKUP($C17,'Composite Data'!$B$2:$AQ$9,MATCH('Post-operative wound care'!I$4,'Composite Data'!$A$2:$A$10,0),FALSE)","v":0},0,{"$f":"HLOOKUP($C17,'Composite Data'!$B$2:$AQ$9,MATCH('Post-operative wound care'!K$4,'Composite Data'!$A$2:$A$10,0),FALSE)","v":0},0,{"$f":"HLOOKUP($C17,'Composite Data'!$B$2:$AQ$9,MATCH('Post-operative wound care'!L$4,'Composite Data'!$A$2:$A$10,0),FALSE)","v":0},0,{"$f":"HLOOKUP($C17,'Composite Data'!$B$2:$AQ$9,MATCH('Post-operative wound care'!P$4,'Composite Data'!$A$2:$A$10,0),FALSE)","v":3},0.23076923076923078]
["RB-1","Gants Hill Medical Centre","F86008",{"$f":"HLOOKUP($C18,'Composite Data'!$B$2:$AQ$9,MATCH('Post-operative wound care'!D$4,'Composite Data'!$A$2:$A$10,0),FALSE)","v":11002},{"$f":"HLOOKUP($C18,'Composite Data'!$B$2:$AQ$9,MATCH('Post-operative wound care'!E$4,'Composite Data'!$A$2:$A$10,0),FALSE)","v":52},4.726413379385566E-3,{"$f":"HLOOKUP($C18,'Composite Data'!$B$2:$AQ$9,MATCH('Post-operative wound care'!G$4,'Composite Data'!$A$2:$A$10,0),FALSE)","v":59},5.362661334302854E-3,{"$f":"HLOOKUP($C18,'Composite Data'!$B$2:$AQ$9,MATCH('Post-operative wound care'!I$4,'Composite Data'!$A$2:$A$10,0),FALSE)","v":0},0,{"$f":"HLOOKUP($C18,'Composite Data'!$B$2:$AQ$9,MATCH('Post-operative wound care'!K$4,'Composite Data'!$A$2:$A$10,0),FALSE)","v":3},5.7692307692307696E-2,{"$f":"HLOOKUP($C18,'Composite Data'!$B$2:$AQ$9,MATCH('Post-operative wound care'!L$4,'Composite Data'!$A$2:$A$10,0),FALSE)","v":8},0.15384615384615385,{"$f":"HLOOKUP($C18,'Composite Data'!$B$2:$AQ$9,MATCH('Post-operative wound care'!P$4,'Composite Data'!$A$2:$A$10,0),FALSE)","v":49},0.94230769230769229]
["RB-1","Redbridge Surgery","F86703",{"$f":"HLOOKUP($C19,'Composite Data'!$B$2:$AQ$9,MATCH('Post-operative wound care'!D$4,'Composite Data'!$A$2:$A$10,0),FALSE)","v":3827},{"$f":"HLOOKUP($C19,'Composite Data'!$B$2:$AQ$9,MATCH('Post-operative wound care'!E$4,'Composite Data'!$A$2:$A$10,0),FALSE)","v":25},6.5325320094068457E-3,{"$f":"HLOOKUP($C19,'Composite Data'!$B$2:$AQ$9,MATCH('Post-operative wound care'!G$4,'Composite Data'!$A$2:$A$10,0),FALSE)","v":35},9.145544813169584E-3,{"$f":"HLOOKUP($C19,'Composite Data'!$B$2:$AQ$9,MATCH('Post-operative wound care'!I$4,'Composite Data'!$A$2:$A$10,0),FALSE)","v":0},0,{"$f":"HLOOKUP($C19,'Composite Data'!$B$2:$AQ$9,MATCH('Post-operative wound care'!K$4,'Composite Data'!$A$2:$A$10,0),FALSE)","v":0},0,{"$f":"HLOOKUP($C19,'Composite Data'!$B$2:$AQ$9,MATCH('Post-operative wound care'!L$4,'Composite Data'!$A$2:$A$10,0),FALSE)","v":3},0.12,{"$f":"HLOOKUP($C19,'Composite Data'!$B$2:$AQ$9,MATCH('Post-operative wound care'!P$4,'Composite Data'!$A$2:$A$10,0),FALSE)","v":0},0]
["RB-1","York Road Surgery","F86657",{"$f":"HLOOKUP($C20,'Composite Data'!$B$2:$AQ$9,MATCH('Post-operative wound care'!D$4,'Composite Data'!$A$2:$A$10,0),FALSE)","v":8166},{"$f":"HLOOKUP($C20,'Composite Data'!$B$2:$AQ$9,MATCH('Post-operative wound care'!E$4,'Composite Data'!$A$2:$A$10,0),FALSE)","v":16},1.9593436198873378E-3,0,0,0,0,{"$f":"HLOOKUP($C20,'Composite Data'!$B$2:$AQ$9,MATCH('Post-operative wound care'!K$4,'Composite Data'!$A$2:$A$10,0),FALSE)","v":0},0,{"$f":"HLOOKUP($C20,'Composite Data'!$B$2:$AQ$9,MATCH('Post-operative wound care'!L$4,'Composite Data'!$A$2:$A$10,0),FALSE)","v":0},0,{"$f":"HLOOKUP($C20,'Composite Data'!$B$2:$AQ$9,MATCH('Post-operative wound care'!P$4,'Composite Data'!$A$2:$A$10,0),FALSE)","v":0},0]
["RB-2","Kenwood Medical Centre","F86081",{"$f":"HLOOKUP($C21,'Composite Data'!$B$2:$AQ$9,MATCH('Post-operative wound care'!D$4,'Composite Data'!$A$2:$A$10,0),FALSE)","v":6340},{"$f":"HLOOKUP($C21,'Composite Data'!$B$2:$AQ$9,MATCH('Post-operative wound care'!E$4,'Composite Data'!$A$2:$A$10,0),FALSE)","v":9},1.4195583596214511E-3,{"$f":"HLOOKUP($C21,'Composite Data'!$B$2:$AQ$9,MATCH('Post-operative wound care'!G$4,'Composite Data'!$A$2:$A$10,0),FALSE)","v":12},1.8927444794952682E-3,{"$f":"HLOOKUP($C21,'Composite Data'!$B$2:$AQ$9,MATCH('Post-operative wound care'!I$4,'Composite Data'!$A$2:$A$10,0),FALSE)","v":0},0,{"$f":"HLOOKUP($C21,'Composite Data'!$B$2:$AQ$9,MATCH('Post-operative wound care'!K$4,'Composite Data'!$A$2:$A$10,0),FALSE)","v":0},0,{"$f":"HLOOKUP($C21,'Composite Data'!$B$2:$AQ$9,MATCH('Post-operative wound care'!L$4,'Composite Data'!$A$2:$A$10,0),FALSE)","v":3},0.33333333333333331,{"$f":"HLOOKUP($C21,'Composite Data'!$B$2:$AQ$9,MATCH('Post-operative wound care'!P$4,'Composite Data'!$A$2:$A$10,0),FALSE)","v":2},0.22222222222222221]
["RB-2","Eastern Avenue Medical Centre","F86083",{"$f":"HLOOKUP($C22,'Composite Data'!$B$2:$AQ$9,MATCH('Post-operative wound care'!D$4,'Composite Data'!$A$2:$A$10,0),FALSE)","v":6577},{"$f":"HLOOKUP($C22,'Composite Data'!$B$2:$AQ$9,MATCH('Post-operative wound care'!E$4,'Composite Data'!$A$2:$A$10,0),FALSE)","v":54},8.21043028736506E-3,{"$f":"HLOOKUP($C22,'Composite Data'!$B$2:$AQ$9,MATCH('Post-operative wound care'!G$4,'Composite Data'!$A$2:$A$10,0),FALSE)","v":103},1.5660635548122245E-2,{"$f":"HLOOKUP($C22,'Composite Data'!$B$2:$AQ$9,MATCH('Post-operative wound care'!I$4,'Composite Data'!$A$2:$A$10,0),FALSE)","v":0},0,{"$f":"HLOOKUP($C22,'Composite Data'!$B$2:$AQ$9,MATCH('Post-operative wound care'!K$4,'Composite Data'!$A$2:$A$10,0),FALSE)","v":0},0,{"$f":"HLOOKUP($C22,'Composite Data'!$B$2:$AQ$9,MATCH('Post-operative wound care'!L$4,'Composite Data'!$A$2:$A$10,0),FALSE)","v":7},0.12962962962962962,{"$f":"HLOOKUP($C22,'Composite Data'!$B$2:$AQ$9,MATCH('Post-operative wound care'!P$4,'Composite Data'!$A$2:$A$10,0),FALSE)","v":10},0.18518518518518517]
["RB-2","Fullwell Avenue Surgery","F86612",{"$f":"HLOOKUP($C23,'Composite Data'!$B$2:$AQ$9,MATCH('Post-operative wound care'!D$4,'Composite Data'!$A$2:$A$10,0),FALSE)","v":3342},{"$f":"HLOOKUP($C23,'Composite Data'!$B$2:$AQ$9,MATCH('Post-operative wound care'!E$4,'Composite Data'!$A$2:$A$10,0),FALSE)","v":19},5.6852184320766008E-3,{"$f":"HLOOKUP($C23,'Composite Data'!$B$2:$AQ$9,MATCH('Post-operative wound care'!G$4,'Composite Data'!$A$2:$A$10,0),FALSE)","v":27},8.0789946140035901E-3,{"$f":"HLOOKUP($C23,'Composite Data'!$B$2:$AQ$9,MATCH('Post-operative wound care'!I$4,'Composite Data'!$A$2:$A$10,0),FALSE)","v":0},0,{"$f":"HLOOKUP($C23,'Composite Data'!$B$2:$AQ$9,MATCH('Post-operative wound care'!K$4,'Composite Data'!$A$2:$A$10,0),FALSE)","v":1},5.2631578947368418E-2,{"$f":"HLOOKUP($C23,'Composite Data'!$B$2:$AQ$9,MATCH('Post-operative wound care'!L$4,'Composite Data'!$A$2:$A$10,0),FALSE)","v":3},0.15789473684210525,{"$f":"HLOOKUP($C23,'Composite Data'!$B$2:$AQ$9,MATCH('Post-operative wound care'!P$4,'Composite Data'!$A$2:$A$10,0),FALSE)","v":16},0.84210526315789469]
["RB-2","Heathcote Primary Care Centre","F86624",{"$f":"HLOOKUP($C24,'Composite Data'!$B$2:$AQ$9,MATCH('Post-operative wound care'!D$4,'Composite Data'!$A$2:$A$10,0),FALSE)","v":3109},{"$f":"HLOOKUP($C24,'Composite Data'!$B$2:$AQ$9,MATCH('Post-operative wound care'!E$4,'Composite Data'!$A$2:$A$10,0),FALSE)","v":1},3.2164683177870698E-4,{"$f":"HLOOKUP($C24,'Composite Data'!$B$2:$AQ$9,MATCH('Post-operative wound care'!G$4,'Composite Data'!$A$2:$A$10,0),FALSE)","v":1},3.2164683177870698E-4,{"$f":"HLOOKUP($C24,'Composite Data'!$B$2:$AQ$9,MATCH('Post-operative wound care'!I$4,'Composite Data'!$A$2:$A$10,0),FALSE)","v":0},0,{"$f":"HLOOKUP($C24,'Composite Data'!$B$2:$AQ$9,MATCH('Post-operative wound care'!K$4,'Composite Data'!$A$2:$A$10,0),FALSE)","v":0},0,{"$f":"HLOOKUP($C24,'Composite Data'!$B$2:$AQ$9,MATCH('Post-operative wound care'!L$4,'Composite Data'!$A$2:$A$10,0),FALSE)","v":0},0,{"$f":"HLOOKUP($C24,'Composite Data'!$B$2:$AQ$9,MATCH('Post-operative wound care'!P$4,'Composite Data'!$A$2:$A$10,0),FALSE)","v":0},0]
["RB-2","Fencepiece Road Medical Practice","F86707",{"$f":"HLOOKUP($C25,'Composite Data'!$B$2:$AQ$9,MATCH('Post-operative wound care'!D$4,'Composite Data'!$A$2:$A$10,0),FALSE)","v":6754},{"$f":"HLOOKUP($C25,'Composite Data'!$B$2:$AQ$9,MATCH('Post-operative wound care'!E$4,'Composite Data'!$A$2:$A$10,0),FALSE)","v":15},2.2209061297009179E-3,{"$f":"HLOOKUP($C25,'Composite Data'!$B$2:$AQ$9,MATCH('Post-operative wound care'!G$4,'Composite Data'!$A$2:$A$10,0),FALSE)","v":19},2.8131477642878294E-3,{"$f":"HLOOKUP($C25,'Composite Data'!$B$2:$AQ$9,MATCH('Post-operative wound care'!I$4,'Composite Data'!$A$2:$A$10,0),FALSE)","v":1},6.6666666666666666E-2,{"$f":"HLOOKUP($C25,'Composite Data'!$B$2:$AQ$9,MATCH('Post-operative wound care'!K$4,'Composite Data'!$A$2:$A$10,0),FALSE)","v":1},6.6666666666666666E-2,{"$f":"HLOOKUP($C25,'Composite Data'!$B$2:$AQ$9,MATCH('Post-operative wound care'!L$4,'Composite Data'!$A$2:$A$10,0),FALSE)","v":2},0.13333333333333333,{"$f":"HLOOKUP($C25,'Composite Data'!$B$2:$AQ$9,MATCH('Post-operative wound care'!P$4,'Composite Data'!$A$2:$A$10,0),FALSE)","v":12},0.8]
["RB-2","The Willows Practice","F86057",{"$f":"HLOOKUP($C26,'Composite Data'!$B$2:$AQ$9,MATCH('Post-operative wound care'!D$4,'Composite Data'!$A$2:$A$10,0),FALSE)","v":6534},{"$f":"HLOOKUP($C26,'Composite Data'!$B$2:$AQ$9,MATCH('Post-operative wound care'!E$4,'Composite Data'!$A$2:$A$10,0),FALSE)","v":8},1.2243648607284971E-3,{"$f":"HLOOKUP($C26,'Composite Data'!$B$2:$AQ$9,MATCH('Post-operative wound care'!G$4,'Composite Data'!$A$2:$A$10,0),FALSE)","v":8},1.2243648607284971E-3,{"$f":"HLOOKUP($C26,'Composite Data'!$B$2:$AQ$9,MATCH('Post-operative wound care'!I$4,'Composite Data'!$A$2:$A$10,0),FALSE)","v":0},0,{"$f":"HLOOKUP($C26,'Composite Data'!$B$2:$AQ$9,MATCH('Post-operative wound care'!K$4,'Composite Data'!$A$2:$A$10,0),FALSE)","v":0},0,{"$f":"HLOOKUP($C26,'Composite Data'!$B$2:$AQ$9,MATCH('Post-operative wound care'!L$4,'Composite Data'!$A$2:$A$10,0),FALSE)","v":0},0,{"$f":"HLOOKUP($C26,'Composite Data'!$B$2:$AQ$9,MATCH('Post-operative wound care'!P$4,'Composite Data'!$A$2:$A$10,0),FALSE)","v":0},0]
["RB-2","Forest Edge Practice","F86007",{"$f":"HLOOKUP($C27,'Composite Data'!$B$2:$AQ$9,MATCH('Post-operative wound care'!D$4,'Composite Data'!$A$2:$A$10,0),FALSE)","v":13285},{"$f":"HLOOKUP($C27,'Composite Data'!$B$2:$AQ$9,MATCH('Post-operative wound care'!E$4,'Composite Data'!$A$2:$A$10,0),FALSE)","v":162},1.21942039894618E-2,{"$f":"HLOOKUP($C27,'Composite Data'!$B$2:$AQ$9,MATCH('Post-operative wound care'!G$4,'Composite Data'!$A$2:$A$10,0),FALSE)","v":718},5.4045916447120812E-2,{"$f":"HLOOKUP($C27,'Composite Data'!$B$2:$AQ$9,MATCH('Post-operative wound care'!I$4,'Composite Data'!$A$2:$A$10,0),FALSE)","v":1},6.1728395061728392E-3,{"$f":"HLOOKUP($C27,'Composite Data'!$B$2:$AQ$9,MATCH('Post-operative wound care'!K$4,'Composite Data'!$A$2:$A$10,0),FALSE)","v":4},2.4691358024691357E-2,{"$f":"HLOOKUP($C27,'Composite Data'!$B$2:$AQ$9,MATCH('Post-operative wound care'!L$4,'Composite Data'!$A$2:$A$10,0),FALSE)","v":8},4.9382716049382713E-2,{"$f":"HLOOKUP($C27,'Composite Data'!$B$2:$AQ$9,MATCH('Post-operative wound care'!P$4,'Composite Data'!$A$2:$A$10,0),FALSE)","v":123},0.7592592592592593]
["RB-3","The Palms Medical Centre","F86009",{"$f":"HLOOKUP($C28,'Composite Data'!$B$2:$AQ$9,MATCH('Post-operative wound care'!D$4,'Composite Data'!$A$2:$A$10,0),FALSE)","v":7358},{"$f":"HLOOKUP($C28,'Composite Data'!$B$2:$AQ$9,MATCH('Post-operative wound care'!E$4,'Composite Data'!$A$2:$A$10,0),FALSE)","v":18},2.446316933949443E-3,{"$f":"HLOOKUP($C28,'Composite Data'!$B$2:$AQ$9,MATCH('Post-operative wound care'!G$4,'Composite Data'!$A$2:$A$10,0),FALSE)","v":26},3.5335689045936395E-3,{"$f":"HLOOKUP($C28,'Composite Data'!$B$2:$AQ$9,MATCH('Post-operative wound care'!I$4,'Composite Data'!$A$2:$A$10,0),FALSE)","v":0},0,{"$f":"HLOOKUP($C28,'Composite Data'!$B$2:$AQ$9,MATCH('Post-operative wound care'!K$4,'Composite Data'!$A$2:$A$10,0),FALSE)","v":1},5.5555555555555552E-2,{"$f":"HLOOKUP($C28,'Composite Data'!$B$2:$AQ$9,MATCH('Post-operative wound care'!L$4,'Composite Data'!$A$2:$A$10,0),FALSE)","v":2},0.1111111111111111,{"$f":"HLOOKUP($C28,'Composite Data'!$B$2:$AQ$9,MATCH('Post-operative wound care'!P$4,'Composite Data'!$A$2:$A$10,0),FALSE)","v":0},0]
["RB-3","Goodmayes Medical Centre","F86087",{"$f":"HLOOKUP($C29,'Composite Data'!$B$2:$AQ$9,MATCH('Post-operative wound care'!D$4,'Composite Data'!$A$2:$A$10,0),FALSE)","v":7748},{"$f":"HLOOKUP($C29,'Composite Data'!$B$2:$AQ$9,MATCH('Post-operative wound care'!E$4,'Composite Data'!$A$2:$A$10,0),FALSE)","v":13},1.6778523489932886E-3,{"$f":"HLOOKUP($C29,'Composite Data'!$B$2:$AQ$9,MATCH('Post-operative wound care'!G$4,'Composite Data'!$A$2:$A$10,0),FALSE)","v":34},4.3882292204439855E-3,{"$f":"HLOOKUP($C29,'Composite Data'!$B$2:$AQ$9,MATCH('Post-operative wound care'!I$4,'Composite Data'!$A$2:$A$10,0),FALSE)","v":0},0,{"$f":"HLOOKUP($C29,'Composite Data'!$B$2:$AQ$9,MATCH('Post-operative wound care'!K$4,'Composite Data'!$A$2:$A$10,0),FALSE)","v":2},0.15384615384615385,{"$f":"HLOOKUP($C29,'Composite Data'!$B$2:$AQ$9,MATCH('Post-operative wound care'!L$4,'Composite Data'!$A$2:$A$10,0),FALSE)","v":5},0.38461538461538464,{"$f":"HLOOKUP($C29,'Composite Data'!$B$2:$AQ$9,MATCH('Post-operative wound care'!P$4,'Composite Data'!$A$2:$A$10,0),FALSE)","v":5},0.38461538461538464]
["RB-3","Seven Kings Practice","F86637",{"$f":"HLOOKUP($C30,'Composite Data'!$B$2:$AQ$9,MATCH('Post-operative wound care'!D$4,'Composite Data'!$A$2:$A$10,0),FALSE)","v":5046},{"$f":"HLOOKUP($C30,'Composite Data'!$B$2:$AQ$9,MATCH('Post-operative wound care'!E$4,'Composite Data'!$A$2:$A$10,0),FALSE)","v":5},9.9088386841062219E-4,{"$f":"HLOOKUP($C30,'Composite Data'!$B$2:$AQ$9,MATCH('Post-operative wound care'!G$4,'Composite Data'!$A$2:$A$10,0),FALSE)","v":6},1.1890606420927466E-3,{"$f":"HLOOKUP($C30,'Composite Data'!$B$2:$AQ$9,MATCH('Post-operative wound care'!I$4,'Composite Data'!$A$2:$A$10,0),FALSE)","v":0},0,{"$f":"HLOOKUP($C30,'Composite Data'!$B$2:$AQ$9,MATCH('Post-operative wound care'!K$4,'Composite Data'!$A$2:$A$10,0),FALSE)","v":0},0,{"$f":"HLOOKUP($C30,'Composite Data'!$B$2:$AQ$9,MATCH('Post-operative wound care'!L$4,'Composite Data'!$A$2:$A$10,0),FALSE)","v":0},0,{"$f":"HLOOKUP($C30,'Composite Data'!$B$2:$AQ$9,MATCH('Post-operative wound care'!P$4,'Composite Data'!$A$2:$A$10,0),FALSE)","v":0},0]
["RB-3","Doctor's House","Y00090",{"$f":"HLOOKUP($C31,'Composite Data'!$B$2:$AQ$9,MATCH('Post-operative wound care'!D$4,'Composite Data'!$A$2:$A$10,0),FALSE)","v":8097},{"$f":"HLOOKUP($C31,'Composite Data'!$B$2:$AQ$9,MATCH('Post-operative wound care'!E$4,'Composite Data'!$A$2:$A$10,0),FALSE)","v":7},8.6451772261331356E-4,{"$f":"HLOOKUP($C31,'Composite Data'!$B$2:$AQ$9,MATCH('Post-operative wound care'!G$4,'Composite Data'!$A$2:$A$10,0),FALSE)","v":8},9.880202544152155E-4,{"$f":"HLOOKUP($C31,'Composite Data'!$B$2:$AQ$9,MATCH('Post-operative wound care'!I$4,'Composite Data'!$A$2:$A$10,0),FALSE)","v":0},0,{"$f":"HLOOKUP($C31,'Composite Data'!$B$2:$AQ$9,MATCH('Post-operative wound care'!K$4,'Composite Data'!$A$2:$A$10,0),FALSE)","v":0},0,{"$f":"HLOOKUP($C31,'Composite Data'!$B$2:$AQ$9,MATCH('Post-operative wound care'!L$4,'Composite Data'!$A$2:$A$10,0),FALSE)","v":1},0.14285714285714285,{"$f":"HLOOKUP($C31,'Composite Data'!$B$2:$AQ$9,MATCH('Post-operative wound care'!P$4,'Composite Data'!$A$2:$A$10,0),FALSE)","v":3},0.42857142857142855]
["RB-3","Green Lane, Goodmayes Medical practice","F86034",{"$f":"HLOOKUP($C32,'Composite Data'!$B$2:$AQ$9,MATCH('Post-operative wound care'!D$4,'Composite Data'!$A$2:$A$10,0),FALSE)","v":5784},{"$f":"HLOOKUP($C32,'Composite Data'!$B$2:$AQ$9,MATCH('Post-operative wound care'!E$4,'Composite Data'!$A$2:$A$10,0),FALSE)","v":10},1.7289073305670815E-3,{"$f":"HLOOKUP($C32,'Composite Data'!$B$2:$AQ$9,MATCH('Post-operative wound care'!G$4,'Composite Data'!$A$2:$A$10,0),FALSE)","v":87},1.504149377593361E-2,{"$f":"HLOOKUP($C32,'Composite Data'!$B$2:$AQ$9,MATCH('Post-operative wound care'!I$4,'Composite Data'!$A$2:$A$10,0),FALSE)","v":0},0,{"$f":"HLOOKUP($C32,'Composite Data'!$B$2:$AQ$9,MATCH('Post-operative wound care'!K$4,'Composite Data'!$A$2:$A$10,0),FALSE)","v":0},0,{"$f":"HLOOKUP($C32,'Composite Data'!$B$2:$AQ$9,MATCH('Post-operative wound care'!L$4,'Composite Data'!$A$2:$A$10,0),FALSE)","v":1},0.1,{"$f":"HLOOKUP($C32,'Composite Data'!$B$2:$AQ$9,MATCH('Post-operative wound care'!P$4,'Composite Data'!$A$2:$A$10,0),FALSE)","v":2},0.2]
["RB-3","Castleton Road Surgery","F86642",{"$f":"HLOOKUP($C33,'Composite Data'!$B$2:$AQ$9,MATCH('Post-operative wound care'!D$4,'Composite Data'!$A$2:$A$10,0),FALSE)","v":4813},{"$f":"HLOOKUP($C33,'Composite Data'!$B$2:$AQ$9,MATCH('Post-operative wound care'!E$4,'Composite Data'!$A$2:$A$10,0),FALSE)","v":8},1.6621649698732599E-3,{"$f":"HLOOKUP($C33,'Composite Data'!$B$2:$AQ$9,MATCH('Post-operative wound care'!G$4,'Composite Data'!$A$2:$A$10,0),FALSE)","v":13},2.7010180760440473E-3,{"$f":"HLOOKUP($C33,'Composite Data'!$B$2:$AQ$9,MATCH('Post-operative wound care'!I$4,'Composite Data'!$A$2:$A$10,0),FALSE)","v":0},0,{"$f":"HLOOKUP($C33,'Composite Data'!$B$2:$AQ$9,MATCH('Post-operative wound care'!K$4,'Composite Data'!$A$2:$A$10,0),FALSE)","v":0},0,{"$f":"HLOOKUP($C33,'Composite Data'!$B$2:$AQ$9,MATCH('Post-operative wound care'!L$4,'Composite Data'!$A$2:$A$10,0),FALSE)","v":0},0,{"$f":"HLOOKUP($C33,'Composite Data'!$B$2:$AQ$9,MATCH('Post-operative wound care'!P$4,'Composite Data'!$A$2:$A$10,0),FALSE)","v":0},0]
["RB-3","Chadwell Heath Surgery","F86028",{"$f":"HLOOKUP($C34,'Composite Data'!$B$2:$AQ$9,MATCH('Post-operative wound care'!D$4,'Composite Data'!$A$2:$A$10,0),FALSE)","v":10587},{"$f":"HLOOKUP($C34,'Composite Data'!$B$2:$AQ$9,MATCH('Post-operative wound care'!E$4,'Composite Data'!$A$2:$A$10,0),FALSE)","v":29},2.7392084632095965E-3,{"$f":"HLOOKUP($C34,'Composite Data'!$B$2:$AQ$9,MATCH('Post-operative wound care'!G$4,'Composite Data'!$A$2:$A$10,0),FALSE)","v":73},6.895248890148295E-3,{"$f":"HLOOKUP($C34,'Composite Data'!$B$2:$AQ$9,MATCH('Post-operative wound care'!I$4,'Composite Data'!$A$2:$A$10,0),FALSE)","v":3},0.10344827586206896,{"$f":"HLOOKUP($C34,'Composite Data'!$B$2:$AQ$9,MATCH('Post-operative wound care'!K$4,'Composite Data'!$A$2:$A$10,0),FALSE)","v":2},6.8965517241379309E-2,{"$f":"HLOOKUP($C34,'Composite Data'!$B$2:$AQ$9,MATCH('Post-operative wound care'!L$4,'Composite Data'!$A$2:$A$10,0),FALSE)","v":2},6.8965517241379309E-2,{"$f":"HLOOKUP($C34,'Composite Data'!$B$2:$AQ$9,MATCH('Post-operative wound care'!P$4,'Composite Data'!$A$2:$A$10,0),FALSE)","v":16},0.55172413793103448]
["RB-3","Grove Surgery","Y00155",{"$f":"HLOOKUP($C35,'Composite Data'!$B$2:$AQ$9,MATCH('Post-operative wound care'!D$4,'Composite Data'!$A$2:$A$10,0),FALSE)","v":9675},{"$f":"HLOOKUP($C35,'Composite Data'!$B$2:$AQ$9,MATCH('Post-operative wound care'!E$4,'Composite Data'!$A$2:$A$10,0),FALSE)","v":1},1.0335917312661498E-4,0,0,0,0,{"$f":"HLOOKUP($C35,'Composite Data'!$B$2:$AQ$9,MATCH('Post-operative wound care'!K$4,'Composite Data'!$A$2:$A$10,0),FALSE)","v":0},0,{"$f":"HLOOKUP($C35,'Composite Data'!$B$2:$AQ$9,MATCH('Post-operative wound care'!L$4,'Composite Data'!$A$2:$A$10,0),FALSE)","v":0},0,{"$f":"HLOOKUP($C35,'Composite Data'!$B$2:$AQ$9,MATCH('Post-operative wound care'!P$4,'Composite Data'!$A$2:$A$10,0),FALSE)","v":0},0]
["RB-4","Broadway Surgery","F86013",{"$f":"HLOOKUP($C36,'Composite Data'!$B$2:$AQ$9,MATCH('Post-operative wound care'!D$4,'Composite Data'!$A$2:$A$10,0),FALSE)","v":7165},{"$f":"HLOOKUP($C36,'Composite Data'!$B$2:$AQ$9,MATCH('Post-operative wound care'!E$4,'Composite Data'!$A$2:$A$10,0),FALSE)","v":12},1.6748080949057921E-3,0,0,0,0,{"$f":"HLOOKUP($C36,'Composite Data'!$B$2:$AQ$9,MATCH('Post-operative wound care'!K$4,'Composite Data'!$A$2:$A$10,0),FALSE)","v":1},8.3333333333333329E-2,{"$f":"HLOOKUP($C36,'Composite Data'!$B$2:$AQ$9,MATCH('Post-operative wound care'!L$4,'Composite Data'!$A$2:$A$10,0),FALSE)","v":0},0,{"$f":"HLOOKUP($C36,'Composite Data'!$B$2:$AQ$9,MATCH('Post-operative wound care'!P$4,'Composite Data'!$A$2:$A$10,0),FALSE)","v":0},0]
["RB-4","The Evergreen Practice","F86023",{"$f":"HLOOKUP($C37,'Composite Data'!$B$2:$AQ$9,MATCH('Post-operative wound care'!D$4,'Composite Data'!$A$2:$A$10,0),FALSE)","v":9496},{"$f":"HLOOKUP($C37,'Composite Data'!$B$2:$AQ$9,MATCH('Post-operative wound care'!E$4,'Composite Data'!$A$2:$A$10,0),FALSE)","v":79},8.3192923336141526E-3,{"$f":"HLOOKUP($C37,'Composite Data'!$B$2:$AQ$9,MATCH('Post-operative wound care'!G$4,'Composite Data'!$A$2:$A$10,0),FALSE)","v":206},2.1693344566133109E-2,{"$f":"HLOOKUP($C37,'Composite Data'!$B$2:$AQ$9,MATCH('Post-operative wound care'!I$4,'Composite Data'!$A$2:$A$10,0),FALSE)","v":0},0,{"$f":"HLOOKUP($C37,'Composite Data'!$B$2:$AQ$9,MATCH('Post-operative wound care'!K$4,'Composite Data'!$A$2:$A$10,0),FALSE)","v":3},3.7974683544303799E-2,{"$f":"HLOOKUP($C37,'Composite Data'!$B$2:$AQ$9,MATCH('Post-operative wound care'!L$4,'Composite Data'!$A$2:$A$10,0),FALSE)","v":5},6.3291139240506333E-2,{"$f":"HLOOKUP($C37,'Composite Data'!$B$2:$AQ$9,MATCH('Post-operative wound care'!P$4,'Composite Data'!$A$2:$A$10,0),FALSE)","v":61},0.77215189873417722]
["RB-4","Wanstead Place Surgery","F86032",{"$f":"HLOOKUP($C38,'Composite Data'!$B$2:$AQ$9,MATCH('Post-operative wound care'!D$4,'Composite Data'!$A$2:$A$10,0),FALSE)","v":9485},{"$f":"HLOOKUP($C38,'Composite Data'!$B$2:$AQ$9,MATCH('Post-operative wound care'!E$4,'Composite Data'!$A$2:$A$10,0),FALSE)","v":36},3.7954665260938325E-3,{"$f":"HLOOKUP($C38,'Composite Data'!$B$2:$AQ$9,MATCH('Post-operative wound care'!G$4,'Composite Data'!$A$2:$A$10,0),FALSE)","v":56},5.9040590405904057E-3,{"$f":"HLOOKUP($C38,'Composite Data'!$B$2:$AQ$9,MATCH('Post-operative wound care'!I$4,'Composite Data'!$A$2:$A$10,0),FALSE)","v":0},0,{"$f":"HLOOKUP($C38,'Composite Data'!$B$2:$AQ$9,MATCH('Post-operative wound care'!K$4,'Composite Data'!$A$2:$A$10,0),FALSE)","v":2},5.5555555555555552E-2,{"$f":"HLOOKUP($C38,'Composite Data'!$B$2:$AQ$9,MATCH('Post-operative wound care'!L$4,'Composite Data'!$A$2:$A$10,0),FALSE)","v":4},0.1111111111111111,{"$f":"HLOOKUP($C38,'Composite Data'!$B$2:$AQ$9,MATCH('Post-operative wound care'!P$4,'Composite Data'!$A$2:$A$10,0),FALSE)","v":5},0.1388888888888889]
["RB-4","Aldersbrook Medical Centre","F86731",{"$f":"HLOOKUP($C39,'Composite Data'!$B$2:$AQ$9,MATCH('Post-operative wound care'!D$4,'Composite Data'!$A$2:$A$10,0),FALSE)","v":4374},{"$f":"HLOOKUP($C39,'Composite Data'!$B$2:$AQ$9,MATCH('Post-operative wound care'!E$4,'Composite Data'!$A$2:$A$10,0),FALSE)","v":25},5.7155921353452214E-3,{"$f":"HLOOKUP($C39,'Composite Data'!$B$2:$AQ$9,MATCH('Post-operative wound care'!G$4,'Composite Data'!$A$2:$A$10,0),FALSE)","v":46},1.0516689529035207E-2,{"$f":"HLOOKUP($C39,'Composite Data'!$B$2:$AQ$9,MATCH('Post-operative wound care'!I$4,'Composite Data'!$A$2:$A$10,0),FALSE)","v":0},0,{"$f":"HLOOKUP($C39,'Composite Data'!$B$2:$AQ$9,MATCH('Post-operative wound care'!K$4,'Composite Data'!$A$2:$A$10,0),FALSE)","v":0},0,{"$f":"HLOOKUP($C39,'Composite Data'!$B$2:$AQ$9,MATCH('Post-operative wound care'!L$4,'Composite Data'!$A$2:$A$10,0),FALSE)","v":1},0.04,{"$f":"HLOOKUP($C39,'Composite Data'!$B$2:$AQ$9,MATCH('Post-operative wound care'!P$4,'Composite Data'!$A$2:$A$10,0),FALSE)","v":2},0.08]
["RB-4","Southdene Surgery","F86066",{"$f":"HLOOKUP($C40,'Composite Data'!$B$2:$AQ$9,MATCH('Post-operative wound care'!D$4,'Composite Data'!$A$2:$A$10,0),FALSE)","v":8071},{"$f":"HLOOKUP($C40,'Composite Data'!$B$2:$AQ$9,MATCH('Post-operative wound care'!E$4,'Composite Data'!$A$2:$A$10,0),FALSE)","v":105},1.3009540329575022E-2,{"$f":"HLOOKUP($C40,'Composite Data'!$B$2:$AQ$9,MATCH('Post-operative wound care'!G$4,'Composite Data'!$A$2:$A$10,0),FALSE)","v":240},2.9736092181885766E-2,{"$f":"HLOOKUP($C40,'Composite Data'!$B$2:$AQ$9,MATCH('Post-operative wound care'!I$4,'Composite Data'!$A$2:$A$10,0),FALSE)","v":0},0,{"$f":"HLOOKUP($C40,'Composite Data'!$B$2:$AQ$9,MATCH('Post-operative wound care'!K$4,'Composite Data'!$A$2:$A$10,0),FALSE)","v":4},3.8095238095238099E-2,{"$f":"HLOOKUP($C40,'Composite Data'!$B$2:$AQ$9,MATCH('Post-operative wound care'!L$4,'Composite Data'!$A$2:$A$10,0),FALSE)","v":10},9.5238095238095233E-2,{"$f":"HLOOKUP($C40,'Composite Data'!$B$2:$AQ$9,MATCH('Post-operative wound care'!P$4,'Composite Data'!$A$2:$A$10,0),FALSE)","v":44},0.41904761904761906]
["RB-4","Shrubberies Medical Centre","F86641",{"$f":"HLOOKUP($C41,'Composite Data'!$B$2:$AQ$9,MATCH('Post-operative wound care'!D$4,'Composite Data'!$A$2:$A$10,0),FALSE)","v":7903},{"$f":"HLOOKUP($C41,'Composite Data'!$B$2:$AQ$9,MATCH('Post-operative wound care'!E$4,'Composite Data'!$A$2:$A$10,0),FALSE)","v":15},1.898013412628116E-3,{"$f":"HLOOKUP($C41,'Composite Data'!$B$2:$AQ$9,MATCH('Post-operative wound care'!G$4,'Composite Data'!$A$2:$A$10,0),FALSE)","v":25},3.1633556877135264E-3,{"$f":"HLOOKUP($C41,'Composite Data'!$B$2:$AQ$9,MATCH('Post-operative wound care'!I$4,'Composite Data'!$A$2:$A$10,0),FALSE)","v":0},0,{"$f":"HLOOKUP($C41,'Composite Data'!$B$2:$AQ$9,MATCH('Post-operative wound care'!K$4,'Composite Data'!$A$2:$A$10,0),FALSE)","v":0},0,{"$f":"HLOOKUP($C41,'Composite Data'!$B$2:$AQ$9,MATCH('Post-operative wound care'!L$4,'Composite Data'!$A$2:$A$10,0),FALSE)","v":2},0.13333333333333333,{"$f":"HLOOKUP($C41,'Composite Data'!$B$2:$AQ$9,MATCH('Post-operative wound care'!P$4,'Composite Data'!$A$2:$A$10,0),FALSE)","v":4},0.26666666666666666]
["RB-4","Glebelands Practice","F86020",{"$f":"HLOOKUP($C42,'Composite Data'!$B$2:$AQ$9,MATCH('Post-operative wound care'!D$4,'Composite Data'!$A$2:$A$10,0),FALSE)","v":5781},{"$f":"HLOOKUP($C42,'Composite Data'!$B$2:$AQ$9,MATCH('Post-operative wound care'!E$4,'Composite Data'!$A$2:$A$10,0),FALSE)","v":46},7.9571008476042211E-3,{"$f":"HLOOKUP($C42,'Composite Data'!$B$2:$AQ$9,MATCH('Post-operative wound care'!G$4,'Composite Data'!$A$2:$A$10,0),FALSE)","v":46},7.9571008476042211E-3,{"$f":"HLOOKUP($C42,'Composite Data'!$B$2:$AQ$9,MATCH('Post-operative wound care'!I$4,'Composite Data'!$A$2:$A$10,0),FALSE)","v":1},2.1739130434782608E-2,{"$f":"HLOOKUP($C42,'Composite Data'!$B$2:$AQ$9,MATCH('Post-operative wound care'!K$4,'Composite Data'!$A$2:$A$10,0),FALSE)","v":2},4.3478260869565216E-2,{"$f":"HLOOKUP($C42,'Composite Data'!$B$2:$AQ$9,MATCH('Post-operative wound care'!L$4,'Composite Data'!$A$2:$A$10,0),FALSE)","v":5},0.10869565217391304,{"$f":"HLOOKUP($C42,'Composite Data'!$B$2:$AQ$9,MATCH('Post-operative wound care'!P$4,'Composite Data'!$A$2:$A$10,0),FALSE)","v":44},0.95652173913043481]
["RB-4","Elmhurst Practice","F86064",{"$f":"HLOOKUP($C43,'Composite Data'!$B$2:$AQ$9,MATCH('Post-operative wound care'!D$4,'Composite Data'!$A$2:$A$10,0),FALSE)","v":4859},{"$f":"HLOOKUP($C43,'Composite Data'!$B$2:$AQ$9,MATCH('Post-operative wound care'!E$4,'Composite Data'!$A$2:$A$10,0),FALSE)","v":6},1.234821979831241E-3,{"$f":"HLOOKUP($C43,'Composite Data'!$B$2:$AQ$9,MATCH('Post-operative wound care'!G$4,'Composite Data'!$A$2:$A$10,0),FALSE)","v":6},1.234821979831241E-3,{"$f":"HLOOKUP($C43,'Composite Data'!$B$2:$AQ$9,MATCH('Post-operative wound care'!I$4,'Composite Data'!$A$2:$A$10,0),FALSE)","v":0},0,{"$f":"HLOOKUP($C43,'Composite Data'!$B$2:$AQ$9,MATCH('Post-operative wound care'!K$4,'Composite Data'!$A$2:$A$10,0),FALSE)","v":0},0,{"$f":"HLOOKUP($C43,'Composite Data'!$B$2:$AQ$9,MATCH('Post-operative wound care'!L$4,'Composite Data'!$A$2:$A$10,0),FALSE)","v":0},0,{"$f":"HLOOKUP($C43,'Composite Data'!$B$2:$AQ$9,MATCH('Post-operative wound care'!P$4,'Composite Data'!$A$2:$A$10,0),FALSE)","v":1},0.16666666666666666]
["RB-4","Clayhall Clinic","F86691",{"$f":"HLOOKUP($C44,'Composite Data'!$B$2:$AQ$9,MATCH('Post-operative wound care'!D$4,'Composite Data'!$A$2:$A$10,0),FALSE)","v":10810},{"$f":"HLOOKUP($C44,'Composite Data'!$B$2:$AQ$9,MATCH('Post-operative wound care'!E$4,'Composite Data'!$A$2:$A$10,0),FALSE)","v":68},6.2904717853839035E-3,{"$f":"HLOOKUP($C44,'Composite Data'!$B$2:$AQ$9,MATCH('Post-operative wound care'!G$4,'Composite Data'!$A$2:$A$10,0),FALSE)","v":232},2.1461609620721554E-2,{"$f":"HLOOKUP($C44,'Composite Data'!$B$2:$AQ$9,MATCH('Post-operative wound care'!I$4,'Composite Data'!$A$2:$A$10,0),FALSE)","v":1},1.4705882352941176E-2,{"$f":"HLOOKUP($C44,'Composite Data'!$B$2:$AQ$9,MATCH('Post-operative wound care'!K$4,'Composite Data'!$A$2:$A$10,0),FALSE)","v":4},5.8823529411764705E-2,{"$f":"HLOOKUP($C44,'Composite Data'!$B$2:$AQ$9,MATCH('Post-operative wound care'!L$4,'Composite Data'!$A$2:$A$10,0),FALSE)","v":8},0.11764705882352941,{"$f":"HLOOKUP($C44,'Composite Data'!$B$2:$AQ$9,MATCH('Post-operative wound care'!P$4,'Composite Data'!$A$2:$A$10,0),FALSE)","v":0},0]
["RB-4","Rydal Practice","F86012",{"$f":"HLOOKUP($C45,'Composite Data'!$B$2:$AQ$9,MATCH('Post-operative wound care'!D$4,'Composite Data'!$A$2:$A$10,0),FALSE)","v":9680},{"$f":"HLOOKUP($C45,'Composite Data'!$B$2:$AQ$9,MATCH('Post-operative wound care'!E$4,'Composite Data'!$A$2:$A$10,0),FALSE)","v":55},5.681818181818182E-3,{"$f":"HLOOKUP($C45,'Composite Data'!$B$2:$AQ$9,MATCH('Post-operative wound care'!G$4,'Composite Data'!$A$2:$A$10,0),FALSE)","v":65},6.7148760330578514E-3,{"$f":"HLOOKUP($C45,'Composite Data'!$B$2:$AQ$9,MATCH('Post-operative wound care'!I$4,'Composite Data'!$A$2:$A$10,0),FALSE)","v":0},0,{"$f":"HLOOKUP($C45,'Composite Data'!$B$2:$AQ$9,MATCH('Post-operative wound care'!K$4,'Composite Data'!$A$2:$A$10,0),FALSE)","v":3},5.4545454545454543E-2,{"$f":"HLOOKUP($C45,'Composite Data'!$B$2:$AQ$9,MATCH('Post-operative wound care'!L$4,'Composite Data'!$A$2:$A$10,0),FALSE)","v":7},0.12727272727272726,{"$f":"HLOOKUP($C45,'Composite Data'!$B$2:$AQ$9,MATCH('Post-operative wound care'!P$4,'Composite Data'!$A$2:$A$10,0),FALSE)","v":0},0]
["RB-4","Queen Mary Practice","F86658",{"$f":"HLOOKUP($C46,'Composite Data'!$B$2:$AQ$9,MATCH('Post-operative wound care'!D$4,'Composite Data'!$A$2:$A$10,0),FALSE)","v":5240},{"$f":"HLOOKUP($C46,'Composite Data'!$B$2:$AQ$9,MATCH('Post-operative wound care'!E$4,'Composite Data'!$A$2:$A$10,0),FALSE)","v":17},3.2442748091603053E-3,{"$f":"HLOOKUP($C46,'Composite Data'!$B$2:$AQ$9,MATCH('Post-operative wound care'!G$4,'Composite Data'!$A$2:$A$10,0),FALSE)","v":27},5.1526717557251909E-3,{"$f":"HLOOKUP($C46,'Composite Data'!$B$2:$AQ$9,MATCH('Post-operative wound care'!I$4,'Composite Data'!$A$2:$A$10,0),FALSE)","v":0},0,{"$f":"HLOOKUP($C46,'Composite Data'!$B$2:$AQ$9,MATCH('Post-operative wound care'!K$4,'Composite Data'!$A$2:$A$10,0),FALSE)","v":0},0,{"$f":"HLOOKUP($C46,'Composite Data'!$B$2:$AQ$9,MATCH('Post-operative wound care'!L$4,'Composite Data'!$A$2:$A$10,0),FALSE)","v":0},0,{"$f":"HLOOKUP($C46,'Composite Data'!$B$2:$AQ$9,MATCH('Post-operative wound care'!P$4,'Composite Data'!$A$2:$A$10,0),FALSE)","v":7},0.41176470588235292]
["RB-5","Ilford Medical Centre","F86022",{"$f":"HLOOKUP($C47,'Composite Data'!$B$2:$AQ$9,MATCH('Post-operative wound care'!D$4,'Composite Data'!$A$2:$A$10,0),FALSE)","v":14288},{"$f":"HLOOKUP($C47,'Composite Data'!$B$2:$AQ$9,MATCH('Post-operative wound care'!E$4,'Composite Data'!$A$2:$A$10,0),FALSE)","v":0},0,{"$f":"HLOOKUP($C47,'Composite Data'!$B$2:$AQ$9,MATCH('Post-operative wound care'!G$4,'Composite Data'!$A$2:$A$10,0),FALSE)","v":0},0,{"$f":"HLOOKUP($C47,'Composite Data'!$B$2:$AQ$9,MATCH('Post-operative wound care'!I$4,'Composite Data'!$A$2:$A$10,0),FALSE)","v":0},0,{"$f":"HLOOKUP($C47,'Composite Data'!$B$2:$AQ$9,MATCH('Post-operative wound care'!K$4,'Composite Data'!$A$2:$A$10,0),FALSE)","v":0},"0.0%",{"$f":"HLOOKUP($C47,'Composite Data'!$B$2:$AQ$9,MATCH('Post-operative wound care'!L$4,'Composite Data'!$A$2:$A$10,0),FALSE)","v":0},0,{"$f":"HLOOKUP($C47,'Composite Data'!$B$2:$AQ$9,MATCH('Post-operative wound care'!P$4,'Composite Data'!$A$2:$A$10,0),FALSE)","v":0},0]
["RB-5","The Practice Loxford","Y02987",{"$f":"HLOOKUP($C48,'Composite Data'!$B$2:$AQ$9,MATCH('Post-operative wound care'!D$4,'Composite Data'!$A$2:$A$10,0),FALSE)","v":26912},{"$f":"HLOOKUP($C48,'Composite Data'!$B$2:$AQ$9,MATCH('Post-operative wound care'!E$4,'Composite Data'!$A$2:$A$10,0),FALSE)","v":73},2.7125445897740784E-3,{"$f":"HLOOKUP($C48,'Composite Data'!$B$2:$AQ$9,MATCH('Post-operative wound care'!G$4,'Composite Data'!$A$2:$A$10,0),FALSE)","v":0},0,{"$f":"HLOOKUP($C48,'Composite Data'!$B$2:$AQ$9,MATCH('Post-operative wound care'!I$4,'Composite Data'!$A$2:$A$10,0),FALSE)","v":3},4.1095890410958902E-2,{"$f":"HLOOKUP($C48,'Composite Data'!$B$2:$AQ$9,MATCH('Post-operative wound care'!K$4,'Composite Data'!$A$2:$A$10,0),FALSE)","v":3},4.1095890410958902E-2,{"$f":"HLOOKUP($C48,'Composite Data'!$B$2:$AQ$9,MATCH('Post-operative wound care'!L$4,'Composite Data'!$A$2:$A$10,0),FALSE)","v":4},5.4794520547945202E-2,{"$f":"HLOOKUP($C48,'Composite Data'!$B$2:$AQ$9,MATCH('Post-operative wound care'!P$4,'Composite Data'!$A$2:$A$10,0),FALSE)","v":41},0.56164383561643838]
["RB-5","Mathukias Surgery","F86692",{"$f":"HLOOKUP($C49,'Composite Data'!$B$2:$AQ$9,MATCH('Post-operative wound care'!D$4,'Composite Data'!$A$2:$A$10,0),FALSE)","v":10658},{"$f":"HLOOKUP($C49,'Composite Data'!$B$2:$AQ$9,MATCH('Post-operative wound care'!E$4,'Composite Data'!$A$2:$A$10,0),FALSE)","v":9},8.44436104334772E-4,{"$f":"HLOOKUP($C49,'Composite Data'!$B$2:$AQ$9,MATCH('Post-operative wound care'!G$4,'Composite Data'!$A$2:$A$10,0),FALSE)","v":39},3.6592231187840122E-3,{"$f":"HLOOKUP($C49,'Composite Data'!$B$2:$AQ$9,MATCH('Post-operative wound care'!I$4,'Composite Data'!$A$2:$A$10,0),FALSE)","v":0},0,{"$f":"HLOOKUP($C49,'Composite Data'!$B$2:$AQ$9,MATCH('Post-operative wound care'!K$4,'Composite Data'!$A$2:$A$10,0),FALSE)","v":0},0,{"$f":"HLOOKUP($C49,'Composite Data'!$B$2:$AQ$9,MATCH('Post-operative wound care'!L$4,'Composite Data'!$A$2:$A$10,0),FALSE)","v":0},0,{"$f":"HLOOKUP($C49,'Composite Data'!$B$2:$AQ$9,MATCH('Post-operative wound care'!P$4,'Composite Data'!$A$2:$A$10,0),FALSE)","v":9},1]
["RB-5","Ilford Lane Surgery","F86082",{"$f":"HLOOKUP($C50,'Composite Data'!$B$2:$AQ$9,MATCH('Post-operative wound care'!D$4,'Composite Data'!$A$2:$A$10,0),FALSE)","v":6040},{"$f":"HLOOKUP($C50,'Composite Data'!$B$2:$AQ$9,MATCH('Post-operative wound care'!E$4,'Composite Data'!$A$2:$A$10,0),FALSE)","v":13},2.1523178807947019E-3,0,0,0,0,{"$f":"HLOOKUP($C50,'Composite Data'!$B$2:$AQ$9,MATCH('Post-operative wound care'!K$4,'Composite Data'!$A$2:$A$10,0),FALSE)","v":0},0,{"$f":"HLOOKUP($C50,'Composite Data'!$B$2:$AQ$9,MATCH('Post-operative wound care'!L$4,'Composite Data'!$A$2:$A$10,0),FALSE)","v":0},0,{"$f":"HLOOKUP($C50,'Composite Data'!$B$2:$AQ$9,MATCH('Post-operative wound care'!P$4,'Composite Data'!$A$2:$A$10,0),FALSE)","v":13},1]
["RB-5","Oak Tree Medical Practice","F86025",{"$f":"HLOOKUP($C51,'Composite Data'!$B$2:$AQ$9,MATCH('Post-operative wound care'!D$4,'Composite Data'!$A$2:$A$10,0),FALSE)","v":17281},{"$f":"HLOOKUP($C51,'Composite Data'!$B$2:$AQ$9,MATCH('Post-operative wound care'!E$4,'Composite Data'!$A$2:$A$10,0),FALSE)","v":55},3.1826861871419479E-3,0,0,0,0,{"$f":"HLOOKUP($C51,'Composite Data'!$B$2:$AQ$9,MATCH('Post-operative wound care'!K$4,'Composite Data'!$A$2:$A$10,0),FALSE)","v":2},3.6363636363636362E-2,{"$f":"HLOOKUP($C51,'Composite Data'!$B$2:$AQ$9,MATCH('Post-operative wound care'!L$4,'Composite Data'!$A$2:$A$10,0),FALSE)","v":1},1.8181818181818181E-2,{"$f":"HLOOKUP($C51,'Composite Data'!$B$2:$AQ$9,MATCH('Post-operative wound care'!P$4,'Composite Data'!$A$2:$A$10,0),FALSE)","v":55},1]
["RB-6","Hainault Surgery","F86085",{"$f":"HLOOKUP($C52,'Composite Data'!$B$2:$AQ$9,MATCH('Post-operative wound care'!D$4,'Composite Data'!$A$2:$A$10,0),FALSE)","v":3533},{"$f":"HLOOKUP($C52,'Composite Data'!$B$2:$AQ$9,MATCH('Post-operative wound care'!E$4,'Composite Data'!$A$2:$A$10,0),FALSE)","v":15},4.2456835550523635E-3,{"$f":"HLOOKUP($C52,'Composite Data'!$B$2:$AQ$9,MATCH('Post-operative wound care'!G$4,'Composite Data'!$A$2:$A$10,0),FALSE)","v":17},4.811774695726012E-3,{"$f":"HLOOKUP($C52,'Composite Data'!$B$2:$AQ$9,MATCH('Post-operative wound care'!I$4,'Composite Data'!$A$2:$A$10,0),FALSE)","v":0},0,{"$f":"HLOOKUP($C52,'Composite Data'!$B$2:$AQ$9,MATCH('Post-operative wound care'!K$4,'Composite Data'!$A$2:$A$10,0),FALSE)","v":0},0,{"$f":"HLOOKUP($C52,'Composite Data'!$B$2:$AQ$9,MATCH('Post-operative wound care'!L$4,'Composite Data'!$A$2:$A$10,0),FALSE)","v":1},6.6666666666666666E-2,{"$f":"HLOOKUP($C52,'Composite Data'!$B$2:$AQ$9,MATCH('Post-operative wound care'!P$4,'Composite Data'!$A$2:$A$10,0),FALSE)","v":5},0.33333333333333331]
["RB-6","Fullwell Cross Medical Centre","F86010",{"$f":"HLOOKUP($C53,'Composite Data'!$B$2:$AQ$9,MATCH('Post-operative wound care'!D$4,'Composite Data'!$A$2:$A$10,0),FALSE)","v":14857},{"$f":"HLOOKUP($C53,'Composite Data'!$B$2:$AQ$9,MATCH('Post-operative wound care'!E$4,'Composite Data'!$A$2:$A$10,0),FALSE)","v":86},5.7885171972807429E-3,{"$f":"HLOOKUP($C53,'Composite Data'!$B$2:$AQ$9,MATCH('Post-operative wound care'!G$4,'Composite Data'!$A$2:$A$10,0),FALSE)","v":102},6.8654506293329741E-3,{"$f":"HLOOKUP($C53,'Composite Data'!$B$2:$AQ$9,MATCH('Post-operative wound care'!I$4,'Composite Data'!$A$2:$A$10,0),FALSE)","v":0},0,{"$f":"HLOOKUP($C53,'Composite Data'!$B$2:$AQ$9,MATCH('Post-operative wound care'!K$4,'Composite Data'!$A$2:$A$10,0),FALSE)","v":3},3.4883720930232558E-2,{"$f":"HLOOKUP($C53,'Composite Data'!$B$2:$AQ$9,MATCH('Post-operative wound care'!L$4,'Composite Data'!$A$2:$A$10,0),FALSE)","v":5},5.8139534883720929E-2,{"$f":"HLOOKUP($C53,'Composite Data'!$B$2:$AQ$9,MATCH('Post-operative wound care'!P$4,'Composite Data'!$A$2:$A$10,0),FALSE)","v":3},3.4883720930232558E-2]
["RB-6","Newbury Group Practice","F86060",{"$f":"HLOOKUP($C54,'Composite Data'!$B$2:$AQ$9,MATCH('Post-operative wound care'!D$4,'Composite Data'!$A$2:$A$10,0),FALSE)","v":15880},{"$f":"HLOOKUP($C54,'Composite Data'!$B$2:$AQ$9,MATCH('Post-operative wound care'!E$4,'Composite Data'!$A$2:$A$10,0),FALSE)","v":0},0,{"$f":"HLOOKUP($C54,'Composite Data'!$B$2:$AQ$9,MATCH('Post-operative wound care'!G$4,'Composite Data'!$A$2:$A$10,0),FALSE)","v":0},0,{"$f":"HLOOKUP($C54,'Composite Data'!$B$2:$AQ$9,MATCH('Post-operative wound care'!I$4,'Composite Data'!$A$2:$A$10,0),FALSE)","v":0},0,{"$f":"HLOOKUP($C54,'Composite Data'!$B$2:$AQ$9,MATCH('Post-operative wound care'!K$4,'Composite Data'!$A$2:$A$10,0),FALSE)","v":0},"0.0%",{"$f":"HLOOKUP($C54,'Composite Data'!$B$2:$AQ$9,MATCH('Post-operative wound care'!L$4,'Composite Data'!$A$2:$A$10,0),FALSE)","v":0},0,{"$f":"HLOOKUP($C54,'Composite Data'!$B$2:$AQ$9,MATCH('Post-operative wound care'!P$4,'Composite Data'!$A$2:$A$10,0),FALSE)","v":0},0]

{"sheet":"Composite Data","index":1,"n_rows":9,"n_cols":43,"rows_kept":9,"cut":false,"hidden":false,"merged":[]}
[null,{"$f":"MATCH(B2,'Control Panel'!$A$12:$A$53,0)","v":39},{"$f":"MATCH(C2,'Control Panel'!$A$12:$A$53,0)","v":38},{"$f":"MATCH(D2,'Control Panel'!$A$12:$A$53,0)","v":8},{"$f":"MATCH(E2,'Control Panel'!$A$12:$A$53,0)","v":15},{"$f":"MATCH(F2,'Control Panel'!$A$12:$A$53,0)","v":14},{"$f":"MATCH(G2,'Control Panel'!$A$12:$A$53,0)","v":23},{"$f":"MATCH(H2,'Control Panel'!$A$12:$A$53,0)","v":24},{"$f":"MATCH(I2,'Control Panel'!$A$12:$A$53,0)","v":34},{"$f":"MATCH(J2,'Control Panel'!$A$12:$A$53,0)","v":36},{"$f":"MATCH(K2,'Control Panel'!$A$12:$A$53,0)","v":3},{"$f":"MATCH(L2,'Control Panel'!$A$12:$A$53,0)","v":19},{"$f":"MATCH(M2,'Control Panel'!$A$12:$A$53,0)","v":27},{"$f":"MATCH(N2,'Control Panel'!$A$12:$A$53,0)","v":13},{"$f":"MATCH(O2,'Control Panel'!$A$12:$A$53,0)","v":7},{"$f":"MATCH(P2,'Control Panel'!$A$12:$A$53,0)","v":2},{"$f":"MATCH(Q2,'Control Panel'!$A$12:$A$53,0)","v":5},{"$f":"MATCH(R2,'Control Panel'!$A$12:$A$53,0)","v":37},{"$f":"MATCH(S2,'Control Panel'!$A$12:$A$53,0)","v":32},{"$f":"MATCH(T2,'Control Panel'!$A$12:$A$53,0)","v":1},{"$f":"MATCH(U2,'Control Panel'!$A$12:$A$53,0)","v":21},{"$f":"MATCH(V2,'Control Panel'!$A$12:$A$53,0)","v":29},{"$f":"MATCH(W2,'Control Panel'!$A$12:$A$53,0)","v":18},{"$f":"MATCH(X2,'Control Panel'!$A$12:$A$53,0)","v":12},{"$f":"MATCH(Y2,'Control Panel'!$A$12:$A$53,0)","v":11},{"$f":"MATCH(Z2,'Control Panel'!$A$12:$A$53,0)","v":17},{"$f":"MATCH(AA2,'Control Panel'!$A$12:$A$53,0)","v":40},{"$f":"MATCH(AB2,'Control Panel'!$A$12:$A$53,0)","v":10},{"$f":"MATCH(AC2,'Control Panel'!$A$12:$A$53,0)","v":9},{"$f":"MATCH(AD2,'Control Panel'!$A$12:$A$53,0)","v":28},{"$f":"MATCH(AE2,'Control Panel'!$A$12:$A$53,0)","v":31},{"$f":"MATCH(AF2,'Control Panel'!$A$12:$A$53,0)","v":42},{"$f":"MATCH(AG2,'Control Panel'!$A$12:$A$53,0)","v":4},{"$f":"MATCH(AH2,'Control Panel'!$A$12:$A$53,0)","v":20},{"$f":"MATCH(AI2,'Control Panel'!$A$12:$A$53,0)","v":26},{"$f":"MATCH(AJ2,'Control Panel'!$A$12:$A$53,0)","v":22},{"$f":"MATCH(AK2,'Control Panel'!$A$12:$A$53,0)","v":25},{"$f":"MATCH(AL2,'Control Panel'!$A$12:$A$53,0)","v":35},{"$f":"MATCH(AM2,'Control Panel'!$A$12:$A$53,0)","v":30},{"$f":"MATCH(AN2,'Control Panel'!$A$12:$A$53,0)","v":33},{"$f":"MATCH(AO2,'Control Panel'!$A$12:$A$53,0)","v":41},{"$f":"MATCH(AP2,'Control Panel'!$A$12:$A$53,0)","v":16},{"$f":"MATCH(AQ2,'Control Panel'!$A$12:$A$53,0)","v":6}]
[null,"F86025","F86082","F86657","F86007","F86057","Y00155","F86013","F86658","Y02987","Y00918","Y00090","F86731","F86707","F86703","F86702","F86698","F86692","F86691","F86652","F86642","F86641","F86637","F86624","F86612","F86087","F86085","F86083","F86081","F86066","F86064","F86060","F86042","F86034","F86032","F86028","F86023","F86022","F86020","F86012","F86010","F86009","F86008"]
["Currently Registered Regular Patients",{"$f":"VLOOKUP($A3,'Other Data'!A2:F10,MATCH('Composite Data'!B2,'Other Data'!A2:F2,0),FALSE)","v":17281},{"$f":"VLOOKUP($A3,'Other Data'!$A$4:$J$10,MATCH('Composite Data'!C$2,'Other Data'!$A$2:$J$2,0),FALSE)","v":6040},{"$f":"VLOOKUP($A3,'Other Data'!$A$4:$J$10,MATCH('Composite Data'!D$2,'Other Data'!$A$2:$J$2,0),FALSE)","v":8166},{"$f":"VLOOKUP($A3,'EMIS Data'!$A$10:$DG$16,MATCH('Composite Data'!E$2,'EMIS Data'!$A$8:$DG$8,0),FALSE)","v":13285},{"$f":"VLOOKUP($A3,'EMIS Data'!$A$10:$DG$16,MATCH('Composite Data'!F$2,'EMIS Data'!$A$8:$DG$8,0),FALSE)","v":6534},{"$f":"VLOOKUP($A3,'Other Data'!$A$4:$J$10,MATCH('Composite Data'!G$2,'Other Data'!$A$2:$J$2,0),FALSE)","v":9675},{"$f":"VLOOKUP($A3,'Other Data'!$A$4:$J$10,MATCH('Composite Data'!H$2,'Other Data'!$A$2:$J$2,0),FALSE)","v":7165},{"$f":"VLOOKUP($A3,'EMIS Data'!$A$10:$DG$16,MATCH('Composite Data'!I$2,'EMIS Data'!$A$8:$DG$8,0),FALSE)","v":5240},26912,{"$f":"VLOOKUP($A3,'EMIS Data'!$A$10:$DG$16,MATCH('Composite Data'!K$2,'EMIS Data'!$A$8:$DG$8,0),FALSE)","v":6583},{"$f":"VLOOKUP($A3,'EMIS Data'!$A$10:$DG$16,MATCH('Composite Data'!L$2,'EMIS Data'!$A$8:$DG$8,0),FALSE)","v":8097},{"$f":"VLOOKUP($A3,'EMIS Data'!$A$10:$DG$16,MATCH('Composite Data'!M$2,'EMIS Data'!$A$8:$DG$8,0),FALSE)","v":4374},{"$f":"VLOOKUP($A3,'EMIS Data'!$A$10:$DG$16,MATCH('Composite Data'!N$2,'EMIS Data'!$A$8:$DG$8,0),FALSE)","v":6754},{"$f":"VLOOKUP($A3,'EMIS Data'!$A$10:$DG$16,MATCH('Composite Data'!O$2,'EMIS Data'!$A$8:$DG$8,0),FALSE)","v":3827},{"$f":"VLOOKUP($A3,'EMIS Data'!$A$10:$DG$16,MATCH('Composite Data'!P$2,'EMIS Data'!$A$8:$DG$8,0),FALSE)","v":5168},{"$f":"VLOOKUP($A3,'EMIS Data'!$A$10:$DG$16,MATCH('Composite Data'!Q$2,'EMIS Data'!$A$8:$DG$8,0),FALSE)","v":5183},{"$f":"VLOOKUP($A3,'EMIS Data'!$A$10:$DG$16,MATCH('Composite Data'!R$2,'EMIS Data'!$A$8:$DG$8,0),FALSE)","v":10658},{"$f":"VLOOKUP($A3,'EMIS Data'!$A$10:$DG$16,MATCH('Composite Data'!S$2,'EMIS Data'!$A$8:$DG$8,0),FALSE)","v":10810},{"$f":"VLOOKUP($A3,'EMIS Data'!$A$10:$DG$16,MATCH('Composite Data'!T$2,'EMIS Data'!$A$8:$DG$8,0),FALSE)","v":6917},{"$f":"VLOOKUP($A3,'EMIS Data'!$A$10:$DG$16,MATCH('Composite Data'!U$2,'EMIS Data'!$A$8:$DG$8,0),FALSE)","v":4813},{"$f":"VLOOKUP($A3,'EMIS Data'!$A$10:$DG$16,MATCH('Composite Data'!V$2,'EMIS Data'!$A$8:$DG$8,0),FALSE)","v":7903},{"$f":"VLOOKUP($A3,'EMIS Data'!$A$10:$DG$16,MATCH('Composite Data'!W$2,'EMIS Data'!$A$8:$DG$8,0),FALSE)","v":5046},{"$f":"VLOOKUP($A3,'EMIS Data'!$A$10:$DG$16,MATCH('Composite Data'!X$2,'EMIS Data'!$A$8:$DG$8,0),FALSE)","v":3109},{"$f":"VLOOKUP($A3,'EMIS Data'!$A$10:$DG$16,MATCH('Composite Data'!Y$2,'EMIS Data'!$A$8:$DG$8,0),FALSE)","v":3342},{"$f":"VLOOKUP($A3,'EMIS Data'!$A$10:$DG$16,MATCH('Composite Data'!Z$2,'EMIS Data'!$A$8:$DG$8,0),FALSE)","v":7748},{"$f":"VLOOKUP($A3,'EMIS Data'!$A$10:$DG$16,MATCH('Composite Data'!AA$2,'EMIS Data'!$A$8:$DG$8,0),FALSE)","v":3533},{"$f":"VLOOKUP($A3,'EMIS Data'!$A$10:$DG$16,MATCH('Composite Data'!AB$2,'EMIS Data'!$A$8:$DG$8,0),FALSE)","v":6577},{"$f":"VLOOKUP($A3,'EMIS Data'!$A$10:$DG$16,MATCH('Composite Data'!AC$2,'EMIS Data'!$A$8:$DG$8,0),FALSE)","v":6340},{"$f":"VLOOKUP($A3,'EMIS Data'!$A$10:$DG$16,MATCH('Composite Data'!AD$2,'EMIS Data'!$A$8:$DG$8,0),FALSE)","v":8071},{"$f":"VLOOKUP($A3,'EMIS Data'!$A$10:$DG$16,MATCH('Composite Data'!AE$2,'EMIS Data'!$A$8:$DG$8,0),FALSE)","v":4859},{"$f":"VLOOKUP($A3,'EMIS Data'!$A$10:$DG$16,MATCH('Composite Data'!AF$2,'EMIS Data'!$A$8:$DG$8,0),FALSE)","v":15880},{"$f":"VLOOKUP($A3,'EMIS Data'!$A$10:$DG$16,MATCH('Composite Data'!AG$2,'EMIS Data'!$A$8:$DG$8,0),FALSE)","v":6308},{"$f":"VLOOKUP($A3,'EMIS Data'!$A$10:$DG$16,MATCH('Composite Data'!AH$2,'EMIS Data'!$A$8:$DG$8,0),FALSE)","v":5784},{"$f":"VLOOKUP($A3,'EMIS Data'!$A$10:$DG$16,MATCH('Composite Data'!AI$2,'EMIS Data'!$A$8:$DG$8,0),FALSE)","v":9485},{"$f":"VLOOKUP($A3,'EMIS Data'!$A$10:$DG$16,MATCH('Composite Data'!AJ$2,'EMIS Data'!$A$8:$DG$8,0),FALSE)","v":10587},{"$f":"VLOOKUP($A3,'EMIS Data'!$A$10:$DG$16,MATCH('Composite Data'!AK$2,'EMIS Data'!$A$8:$DG$8,0),FALSE)","v":9496},{"$f":"VLOOKUP($A3,'EMIS Data'!$A$10:$DG$16,MATCH('Composite Data'!AL$2,'EMIS Data'!$A$8:$DG$8,0),FALSE)","v":14288},{"$f":"VLOOKUP($A3,'EMIS Data'!$A$10:$DG$16,MATCH('Composite Data'!AM$2,'EMIS Data'!$A$8:$DG$8,0),FALSE)","v":5781},{"$f":"VLOOKUP($A3,'EMIS Data'!$A$10:$DG$16,MATCH('Composite Data'!AN$2,'EMIS Data'!$A$8:$DG$8,0),FALSE)","v":9680},{"$f":"VLOOKUP($A3,'EMIS Data'!$A$10:$DG$16,MATCH('Composite Data'!AO$2,'EMIS Data'!$A$8:$DG$8,0),FALSE)","v":14857},{"$f":"VLOOKUP($A3,'EMIS Data'!$A$10:$DG$16,MATCH('Composite Data'!AP$2,'EMIS Data'!$A$8:$DG$8,0),FALSE)","v":7358},{"$f":"VLOOKUP($A3,'EMIS Data'!$A$10:$DG$16,MATCH('Composite Data'!AQ$2,'EMIS Data'!$A$8:$DG$8,0),FALSE)","v":11002}]
["POWC 01 Post-operative wound care 2022",{"$f":"VLOOKUP($A4,'Other Data'!$A$4:$J$10,MATCH('Composite Data'!B$2,'Other Data'!$A$2:$J$2,0),FALSE)","v":55},{"$f":"VLOOKUP($A4,'Other Data'!$A$4:$J$10,MATCH('Composite Data'!C$2,'Other Data'!$A$2:$J$2,0),FALSE)","v":13},{"$f":"VLOOKUP($A4,'Other Data'!$A$4:$J$10,MATCH('Composite Data'!D$2,'Other Data'!$A$2:$J$2,0),FALSE)","v":16},{"$f":"VLOOKUP($A4,'EMIS Data'!$A$10:$DG$16,MATCH('Composite Data'!E$2,'EMIS Data'!$A$8:$DG$8,0),FALSE)","v":162},{"$f":"VLOOKUP($A4,'EMIS Data'!$A$10:$DG$16,MATCH('Composite Data'!F$2,'EMIS Data'!$A$8:$DG$8,0),FALSE)","v":8},{"$f":"VLOOKUP($A4,'Other Data'!$A$4:$J$10,MATCH('Composite Data'!G$2,'Other Data'!$A$2:$J$2,0),FALSE)","v":1},{"$f":"VLOOKUP($A4,'Other Data'!$A$4:$J$10,MATCH('Composite Data'!H$2,'Other Data'!$A$2:$J$2,0),FALSE)","v":12},{"$f":"VLOOKUP($A4,'EMIS Data'!$A$10:$DG$16,MATCH('Composite Data'!I$2,'EMIS Data'!$A$8:$DG$8,0),FALSE)","v":17},73,{"$f":"VLOOKUP($A4,'EMIS Data'!$A$10:$DG$16,MATCH('Composite Data'!K$2,'EMIS Data'!$A$8:$DG$8,0),FALSE)","v":47},{"$f":"VLOOKUP($A4,'EMIS Data'!$A$10:$DG$16,MATCH('Composite Data'!L$2,'EMIS Data'!$A$8:$DG$8,0),FALSE)","v":7},{"$f":"VLOOKUP($A4,'EMIS Data'!$A$10:$DG$16,MATCH('Composite Data'!M$2,'EMIS Data'!$A$8:$DG$8,0),FALSE)","v":25},{"$f":"VLOOKUP($A4,'EMIS Data'!$A$10:$DG$16,MATCH('Composite Data'!N$2,'EMIS Data'!$A$8:$DG$8,0),FALSE)","v":15},{"$f":"VLOOKUP($A4,'EMIS Data'!$A$10:$DG$16,MATCH('Composite Data'!O$2,'EMIS Data'!$A$8:$DG$8,0),FALSE)","v":25},{"$f":"VLOOKUP($A4,'EMIS Data'!$A$10:$DG$16,MATCH('Composite Data'!P$2,'EMIS Data'!$A$8:$DG$8,0),FALSE)","v":2},{"$f":"VLOOKUP($A4,'EMIS Data'!$A$10:$DG$16,MATCH('Composite Data'!Q$2,'EMIS Data'!$A$8:$DG$8,0),FALSE)","v":13},{"$f":"VLOOKUP($A4,'EMIS Data'!$A$10:$DG$16,MATCH('Composite Data'!R$2,'EMIS Data'!$A$8:$DG$8,0),FALSE)","v":9},{"$f":"VLOOKUP($A4,'EMIS Data'!$A$10:$DG$16,MATCH('Composite Data'!S$2,'EMIS Data'!$A$8:$DG$8,0),FALSE)","v":68},{"$f":"VLOOKUP($A4,'EMIS Data'!$A$10:$DG$16,MATCH('Composite Data'!T$2,'EMIS Data'!$A$8:$DG$8,0),FALSE)","v":45},{"$f":"VLOOKUP($A4,'EMIS Data'!$A$10:$DG$16,MATCH('Composite Data'!U$2,'EMIS Data'!$A$8:$DG$8,0),FALSE)","v":8},{"$f":"VLOOKUP($A4,'EMIS Data'!$A$10:$DG$16,MATCH('Composite Data'!V$2,'EMIS Data'!$A$8:$DG$8,0),FALSE)","v":15},{"$f":"VLOOKUP($A4,'EMIS Data'!$A$10:$DG$16,MATCH('Composite Data'!W$2,'EMIS Data'!$A$8:$DG$8,0),FALSE)","v":5},{"$f":"VLOOKUP($A4,'EMIS Data'!$A$10:$DG$16,MATCH('Composite Data'!X$2,'EMIS Data'!$A$8:$DG$8,0),FALSE)","v":1},{"$f":"VLOOKUP($A4,'EMIS Data'!$A$10:$DG$16,MATCH('Composite Data'!Y$2,'EMIS Data'!$A$8:$DG$8,0),FALSE)","v":19},{"$f":"VLOOKUP($A4,'EMIS Data'!$A$10:$DG$16,MATCH('Composite Data'!Z$2,'EMIS Data'!$A$8:$DG$8,0),FALSE)","v":13},{"$f":"VLOOKUP($A4,'EMIS Data'!$A$10:$DG$16,MATCH('Composite Data'!AA$2,'EMIS Data'!$A$8:$DG$8,0),FALSE)","v":15},{"$f":"VLOOKUP($A4,'EMIS Data'!$A$10:$DG$16,MATCH('Composite Data'!AB$2,'EMIS Data'!$A$8:$DG$8,0),FALSE)","v":54},{"$f":"VLOOKUP($A4,'EMIS Data'!$A$10:$DG$16,MATCH('Composite Data'!AC$2,'EMIS Data'!$A$8:$DG$8,0),FALSE)","v":9},{"$f":"VLOOKUP($A4,'EMIS Data'!$A$10:$DG$16,MATCH('Composite Data'!AD$2,'EMIS Data'!$A$8:$DG$8,0),FALSE)","v":105},{"$f":"VLOOKUP($A4,'EMIS Data'!$A$10:$DG$16,MATCH('Composite Data'!AE$2,'EMIS Data'!$A$8:$DG$8,0),FALSE)","v":6},{"$f":"VLOOKUP($A4,'EMIS Data'!$A$10:$DG$16,MATCH('Composite Data'!AF$2,'EMIS Data'!$A$8:$DG$8,0),FALSE)","v":0},{"$f":"VLOOKUP($A4,'EMIS Data'!$A$10:$DG$16,MATCH('Composite Data'!AG$2,'EMIS Data'!$A$8:$DG$8,0),FALSE)","v":46},{"$f":"VLOOKUP($A4,'EMIS Data'!$A$10:$DG$16,MATCH('Composite Data'!AH$2,'EMIS Data'!$A$8:$DG$8,0),FALSE)","v":10},{"$f":"VLOOKUP($A4,'EMIS Data'!$A$10:$DG$16,MATCH('Composite Data'!AI$2,'EMIS Data'!$A$8:$DG$8,0),FALSE)","v":36},{"$f":"VLOOKUP($A4,'EMIS Data'!$A$10:$DG$16,MATCH('Composite Data'!AJ$2,'EMIS Data'!$A$8:$DG$8,0),FALSE)","v":29},{"$f":"VLOOKUP($A4,'EMIS Data'!$A$10:$DG$16,MATCH('Composite Data'!AK$2,'EMIS Data'!$A$8:$DG$8,0),FALSE)","v":79},{"$f":"VLOOKUP($A4,'EMIS Data'!$A$10:$DG$16,MATCH('Composite Data'!AL$2,'EMIS Data'!$A$8:$DG$8,0),FALSE)","v":0},{"$f":"VLOOKUP($A4,'EMIS Data'!$A$10:$DG$16,MATCH('Composite Data'!AM$2,'EMIS Data'!$A$8:$DG$8,0),FALSE)","v":46},{"$f":"VLOOKUP($A4,'EMIS Data'!$A$10:$DG$16,MATCH('Composite Data'!AN$2,'EMIS Data'!$A$8:$DG$8,0),FALSE)","v":55},{"$f":"VLOOKUP($A4,'EMIS Data'!$A$10:$DG$16,MATCH('Composite Data'!AO$2,'EMIS Data'!$A$8:$DG$8,0),FALSE)","v":86},{"$f":"VLOOKUP($A4,'EMIS Data'!$A$10:$DG$16,MATCH('Composite Data'!AP$2,'EMIS Data'!$A$8:$DG$8,0),FALSE)","v":18},{"$f":"VLOOKUP($A4,'EMIS Data'!$A$10:$DG$16,MATCH('Composite Data'!AQ$2,'EMIS Data'!$A$8:$DG$8,0),FALSE)","v":52}]
["POWC 01 Post-operative wound care Activity",{"$f":"VLOOKUP($A5,'Other Data'!$A$4:$J$10,MATCH('Composite Data'!B$2,'Other Data'!$A$2:$J$2,0),FALSE)","v":{"$error":"#N/A"}},{"$f":"VLOOKUP($A5,'Other Data'!$A$4:$J$10,MATCH('Composite Data'!C$2,'Other Data'!$A$2:$J$2,0),FALSE)","v":{"$error":"#N/A"}},{"$f":"VLOOKUP($A5,'Other Data'!$A$4:$J$10,MATCH('Composite Data'!D$2,'Other Data'!$A$2:$J$2,0),FALSE)","v":{"$error":"#N/A"}},{"$f":"VLOOKUP($A5,'EMIS Data'!$A$10:$DG$16,MATCH('Composite Data'!E$2,'EMIS Data'!$A$8:$DG$8,0),FALSE)","v":718},{"$f":"VLOOKUP($A5,'EMIS Data'!$A$10:$DG$16,MATCH('Composite Data'!F$2,'EMIS Data'!$A$8:$DG$8,0),FALSE)","v":8},{"$f":"VLOOKUP($A5,'Other Data'!$A$4:$J$10,MATCH('Composite Data'!G$2,'Other Data'!$A$2:$J$2,0),FALSE)","v":{"$error":"#N/A"}},{"$f":"VLOOKUP($A5,'Other Data'!$A$4:$J$10,MATCH('Composite Data'!H$2,'Other Data'!$A$2:$J$2,0),FALSE)","v":{"$error":"#N/A"}},{"$f":"VLOOKUP($A5,'EMIS Data'!$A$10:$DG$16,MATCH('Composite Data'!I$2,'EMIS Data'!$A$8:$DG$8,0),FALSE)","v":27},null,{"$f":"VLOOKUP($A5,'EMIS Data'!$A$10:$DG$16,MATCH('Composite Data'!K$2,'EMIS Data'!$A$8:$DG$8,0),FALSE)","v":91},{"$f":"VLOOKUP($A5,'EMIS Data'!$A$10:$DG$16,MATCH('Composite Data'!L$2,'EMIS Data'!$A$8:$DG$8,0),FALSE)","v":8},{"$f":"VLOOKUP($A5,'EMIS Data'!$A$10:$DG$16,MATCH('Composite Data'!M$2,'EMIS Data'!$A$8:$DG$8,0),FALSE)","v":46},{"$f":"VLOOKUP($A5,'EMIS Data'!$A$10:$DG$16,MATCH('Composite Data'!N$2,'EMIS Data'!$A$8:$DG$8,0),FALSE)","v":19},{"$f":"VLOOKUP($A5,'EMIS Data'!$A$10:$DG$16,MATCH('Composite Data'!O$2,'EMIS Data'!$A$8:$DG$8,0),FALSE)","v":35},{"$f":"VLOOKUP($A5,'EMIS Data'!$A$10:$DG$16,MATCH('Composite Data'!P$2,'EMIS Data'!$A$8:$DG$8,0),FALSE)","v":2},{"$f":"VLOOKUP($A5,'EMIS Data'!$A$10:$DG$16,MATCH('Composite Data'!Q$2,'EMIS Data'!$A$8:$DG$8,0),FALSE)","v":21},{"$f":"VLOOKUP($A5,'EMIS Data'!$A$10:$DG$16,MATCH('Composite Data'!R$2,'EMIS Data'!$A$8:$DG$8,0),FALSE)","v":39},{"$f":"VLOOKUP($A5,'EMIS Data'!$A$10:$DG$16,MATCH('Composite Data'!S$2,'EMIS Data'!$A$8:$DG$8,0),FALSE)","v":232},{"$f":"VLOOKUP($A5,'EMIS Data'!$A$10:$DG$16,MATCH('Composite Data'!T$2,'EMIS Data'!$A$8:$DG$8,0),FALSE)","v":92},{"$f":"VLOOKUP($A5,'EMIS Data'!$A$10:$DG$16,MATCH('Composite Data'!U$2,'EMIS Data'!$A$8:$DG$8,0),FALSE)","v":13},{"$f":"VLOOKUP($A5,'EMIS Data'!$A$10:$DG$16,MATCH('Composite Data'!V$2,'EMIS Data'!$A$8:$DG$8,0),FALSE)","v":25},{"$f":"VLOOKUP($A5,'EMIS Data'!$A$10:$DG$16,MATCH('Composite Data'!W$2,'EMIS Data'!$A$8:$DG$8,0),FALSE)","v":6},{"$f":"VLOOKUP($A5,'EMIS Data'!$A$10:$DG$16,MATCH('Composite Data'!X$2,'EMIS Data'!$A$8:$DG$8,0),FALSE)","v":1},{"$f":"VLOOKUP($A5,'EMIS Data'!$A$10:$DG$16,MATCH('Composite Data'!Y$2,'EMIS Data'!$A$8:$DG$8,0),FALSE)","v":27},{"$f":"VLOOKUP($A5,'EMIS Data'!$A$10:$DG$16,MATCH('Composite Data'!Z$2,'EMIS Data'!$A$8:$DG$8,0),FALSE)","v":34},{"$f":"VLOOKUP($A5,'EMIS Data'!$A$10:$DG$16,MATCH('Composite Data'!AA$2,'EMIS Data'!$A$8:$DG$8,0),FALSE)","v":17},{"$f":"VLOOKUP($A5,'EMIS Data'!$A$10:$DG$16,MATCH('Composite Data'!AB$2,'EMIS Data'!$A$8:$DG$8,0),FALSE)","v":103},{"$f":"VLOOKUP($A5,'EMIS Data'!$A$10:$DG$16,MATCH('Composite Data'!AC$2,'EMIS Data'!$A$8:$DG$8,0),FALSE)","v":12},{"$f":"VLOOKUP($A5,'EMIS Data'!$A$10:$DG$16,MATCH('Composite Data'!AD$2,'EMIS Data'!$A$8:$DG$8,0),FALSE)","v":240},{"$f":"VLOOKUP($A5,'EMIS Data'!$A$10:$DG$16,MATCH('Composite Data'!AE$2,'EMIS Data'!$A$8:$DG$8,0),FALSE)","v":6},{"$f":"VLOOKUP($A5,'EMIS Data'!$A$10:$DG$16,MATCH('Composite Data'!AF$2,'EMIS Data'!$A$8:$DG$8,0),FALSE)","v":0},{"$f":"VLOOKUP($A5,'EMIS Data'!$A$10:$DG$16,MATCH('Composite Data'!AG$2,'EMIS Data'!$A$8:$DG$8,0),FALSE)","v":110},{"$f":"VLOOKUP($A5,'EMIS Data'!$A$10:$DG$16,MATCH('Composite Data'!AH$2,'EMIS Data'!$A$8:$DG$8,0),FALSE)","v":87},{"$f":"VLOOKUP($A5,'EMIS Data'!$A$10:$DG$16,MATCH('Composite Data'!AI$2,'EMIS Data'!$A$8:$DG$8,0),FALSE)","v":56},{"$f":"VLOOKUP($A5,'EMIS Data'!$A$10:$DG$16,MATCH('Composite Data'!AJ$2,'EMIS Data'!$A$8:$DG$8,0),FALSE)","v":73},{"$f":"VLOOKUP($A5,'EMIS Data'!$A$10:$DG$16,MATCH('Composite Data'!AK$2,'EMIS Data'!$A$8:$DG$8,0),FALSE)","v":206},{"$f":"VLOOKUP($A5,'EMIS Data'!$A$10:$DG$16,MATCH('Composite Data'!AL$2,'EMIS Data'!$A$8:$DG$8,0),FALSE)","v":0},{"$f":"VLOOKUP($A5,'EMIS Data'!$A$10:$DG$16,MATCH('Composite Data'!AM$2,'EMIS Data'!$A$8:$DG$8,0),FALSE)","v":46},{"$f":"VLOOKUP($A5,'EMIS Data'!$A$10:$DG$16,MATCH('Composite Data'!AN$2,'EMIS Data'!$A$8:$DG$8,0),FALSE)","v":65},{"$f":"VLOOKUP($A5,'EMIS Data'!$A$10:$DG$16,MATCH('Composite Data'!AO$2,'EMIS Data'!$A$8:$DG$8,0),FALSE)","v":102},{"$f":"VLOOKUP($A5,'EMIS Data'!$A$10:$DG$16,MATCH('Composite Data'!AP$2,'EMIS Data'!$A$8:$DG$8,0),FALSE)","v":26},{"$f":"VLOOKUP($A5,'EMIS Data'!$A$10:$DG$16,MATCH('Composite Data'!AQ$2,'EMIS Data'!$A$8:$DG$8,0),FALSE)","v":59}]
["POWC 0101 Referral to tissue viability service",{"$f":"VLOOKUP($A6,'Other Data'!$A$4:$J$10,MATCH('Composite Data'!B$2,'Other Data'!$A$2:$J$2,0),FALSE)","v":{"$error":"#N/A"}},{"$f":"VLOOKUP($A6,'Other Data'!$A$4:$J$10,MATCH('Composite Data'!C$2,'Other Data'!$A$2:$J$2,0),FALSE)","v":{"$error":"#N/A"}},{"$f":"VLOOKUP($A6,'Other Data'!$A$4:$J$10,MATCH('Composite Data'!D$2,'Other Data'!$A$2:$J$2,0),FALSE)","v":{"$error":"#N/A"}},{"$f":"VLOOKUP($A6,'EMIS Data'!$A$10:$DG$16,MATCH('Composite Data'!E$2,'EMIS Data'!$A$8:$DG$8,0),FALSE)","v":1},{"$f":"VLOOKUP($A6,'EMIS Data'!$A$10:$DG$16,MATCH('Composite Data'!F$2,'EMIS Data'!$A$8:$DG$8,0),FALSE)","v":0},{"$f":"VLOOKUP($A6,'Other Data'!$A$4:$J$10,MATCH('Composite Data'!G$2,'Other Data'!$A$2:$J$2,0),FALSE)","v":{"$error":"#N/A"}},{"$f":"VLOOKUP($A6,'Other Data'!$A$4:$J$10,MATCH('Composite Data'!H$2,'Other Data'!$A$2:$J$2,0),FALSE)","v":{"$error":"#N/A"}},{"$f":"VLOOKUP($A6,'EMIS Data'!$A$10:$DG$16,MATCH('Composite Data'!I$2,'EMIS Data'!$A$8:$DG$8,0),FALSE)","v":0},3,{"$f":"VLOOKUP($A6,'EMIS Data'!$A$10:$DG$16,MATCH('Composite Data'!K$2,'EMIS Data'!$A$8:$DG$8,0),FALSE)","v":2},{"$f":"VLOOKUP($A6,'EMIS Data'!$A$10:$DG$16,MATCH('Composite Data'!L$2,'EMIS Data'!$A$8:$DG$8,0),FALSE)","v":0},{"$f":"VLOOKUP($A6,'EMIS Data'!$A$10:$DG$16,MATCH('Composite Data'!M$2,'EMIS Data'!$A$8:$DG$8,0),FALSE)","v":0},{"$f":"VLOOKUP($A6,'EMIS Data'!$A$10:$DG$16,MATCH('Composite Data'!N$2,'EMIS Data'!$A$8:$DG$8,0),FALSE)","v":1},{"$f":"VLOOKUP($A6,'EMIS Data'!$A$10:$DG$16,MATCH('Composite Data'!O$2,'EMIS Data'!$A$8:$DG$8,0),FALSE)","v":0},{"$f":"VLOOKUP($A6,'EMIS Data'!$A$10:$DG$16,MATCH('Composite Data'!P$2,'EMIS Data'!$A$8:$DG$8,0),FALSE)","v":0},{"$f":"VLOOKUP($A6,'EMIS Data'!$A$10:$DG$16,MATCH('Composite Data'!Q$2,'EMIS Data'!$A$8:$DG$8,0),FALSE)","v":0},{"$f":"VLOOKUP($A6,'EMIS Data'!$A$10:$DG$16,MATCH('Composite Data'!R$2,'EMIS Data'!$A$8:$DG$8,0),FALSE)","v":0},{"$f":"VLOOKUP($A6,'EMIS Data'!$A$10:$DG$16,MATCH('Composite Data'!S$2,'EMIS Data'!$A$8:$DG$8,0),FALSE)","v":1},{"$f":"VLOOKUP($A6,'EMIS Data'!$A$10:$DG$16,MATCH('Composite Data'!T$2,'EMIS Data'!$A$8:$DG$8,0),FALSE)","v":0},{"$f":"VLOOKUP($A6,'EMIS Data'!$A$10:$DG$16,MATCH('Composite Data'!U$2,'EMIS Data'!$A$8:$DG$8,0),FALSE)","v":0},{"$f":"VLOOKUP($A6,'EMIS Data'!$A$10:$DG$16,MATCH('Composite Data'!V$2,'EMIS Data'!$A$8:$DG$8,0),FALSE)","v":0},{"$f":"VLOOKUP($A6,'EMIS Data'!$A$10:$DG$16,MATCH('Composite Data'!W$2,'EMIS Data'!$A$8:$DG$8,0),FALSE)","v":0},{"$f":"VLOOKUP($A6,'EMIS Data'!$A$10:$DG$16,MATCH('Composite Data'!X$2,'EMIS Data'!$A$8:$DG$8,0),FALSE)","v":0},{"$f":"VLOOKUP($A6,'EMIS Data'!$A$10:$DG$16,MATCH('Composite Data'!Y$2,'EMIS Data'!$A$8:$DG$8,0),FALSE)","v":0},{"$f":"VLOOKUP($A6,'EMIS Data'!$A$10:$DG$16,MATCH('Composite Data'!Z$2,'EMIS Data'!$A$8:$DG$8,0),FALSE)","v":0},{"$f":"VLOOKUP($A6,'EMIS Data'!$A$10:$DG$16,MATCH('Composite Data'!AA$2,'EMIS Data'!$A$8:$DG$8,0),FALSE)","v":0},{"$f":"VLOOKUP($A6,'EMIS Data'!$A$10:$DG$16,MATCH('Composite Data'!AB$2,'EMIS Data'!$A$8:$DG$8,0),FALSE)","v":0},{"$f":"VLOOKUP($A6,'EMIS Data'!$A$10:$DG$16,MATCH('Composite Data'!AC$2,'EMIS Data'!$A$8:$DG$8,0),FALSE)","v":0},{"$f":"VLOOKUP($A6,'EMIS Data'!$A$10:$DG$16,MATCH('Composite Data'!AD$2,'EMIS Data'!$A$8:$DG$8,0),FALSE)","v":0},{"$f":"VLOOKUP($A6,'EMIS Data'!$A$10:$DG$16,MATCH('Composite Data'!AE$2,'EMIS Data'!$A$8:$DG$8,0),FALSE)","v":0},{"$f":"VLOOKUP($A6,'EMIS Data'!$A$10:$DG$16,MATCH('Composite Data'!AF$2,'EMIS Data'!$A$8:$DG$8,0),FALSE)","v":0},{"$f":"VLOOKUP($A6,'EMIS Data'!$A$10:$DG$16,MATCH('Composite Data'!AG$2,'EMIS Data'!$A$8:$DG$8,0),FALSE)","v":4},{"$f":"VLOOKUP($A6,'EMIS Data'!$A$10:$DG$16,MATCH('Composite Data'!AH$2,'EMIS Data'!$A$8:$DG$8,0),FALSE)","v":0},{"$f":"VLOOKUP($A6,'EMIS Data'!$A$10:$DG$16,MATCH('Composite Data'!AI$2,'EMIS Data'!$A$8:$DG$8,0),FALSE)","v":0},{"$f":"VLOOKUP($A6,'EMIS Data'!$A$10:$DG$16,MATCH('Composite Data'!AJ$2,'EMIS Data'!$A$8:$DG$8,0),FALSE)","v":3},{"$f":"VLOOKUP($A6,'EMIS Data'!$A$10:$DG$16,MATCH('Composite Data'!AK$2,'EMIS Data'!$A$8:$DG$8,0),FALSE)","v":0},{"$f":"VLOOKUP($A6,'EMIS Data'!$A$10:$DG$16,MATCH('Composite Data'!AL$2,'EMIS Data'!$A$8:$DG$8,0),FALSE)","v":0},{"$f":"VLOOKUP($A6,'EMIS Data'!$A$10:$DG$16,MATCH('Composite Data'!AM$2,'EMIS Data'!$A$8:$DG$8,0),FALSE)","v":1},{"$f":"VLOOKUP($A6,'EMIS Data'!$A$10:$DG$16,MATCH('Composite Data'!AN$2,'EMIS Data'!$A$8:$DG$8,0),FALSE)","v":0},{"$f":"VLOOKUP($A6,'EMIS Data'!$A$10:$DG$16,MATCH('Composite Data'!AO$2,'EMIS Data'!$A$8:$DG$8,0),FALSE)","v":0},{"$f":"VLOOKUP($A6,'EMIS Data'!$A$10:$DG$16,MATCH('Composite Data'!AP$2,'EMIS Data'!$A$8:$DG$8,0),FALSE)","v":0},{"$f":"VLOOKUP($A6,'EMIS Data'!$A$10:$DG$16,MATCH('Composite Data'!AQ$2,'EMIS Data'!$A$8:$DG$8,0),FALSE)","v":0}]
["POWC 0102 Refer to district nurse",{"$f":"VLOOKUP($A7,'Other Data'!$A$4:$J$10,MATCH('Composite Data'!B$2,'Other Data'!$A$2:$J$2,0),FALSE)","v":2},{"$f":"VLOOKUP($A7,'Other Data'!$A$4:$J$10,MATCH('Composite Data'!C$2,'Other Data'!$A$2:$J$2,0),FALSE)","v":0},{"$f":"VLOOKUP($A7,'Other Data'!$A$4:$J$10,MATCH('Composite Data'!D$2,'Other Data'!$A$2:$J$2,0),FALSE)","v":0},{"$f":"VLOOKUP($A7,'EMIS Data'!$A$10:$DG$16,MATCH('Composite Data'!E$2,'EMIS Data'!$A$8:$DG$8,0),FALSE)","v":4},{"$f":"VLOOKUP($A7,'EMIS Data'!$A$10:$DG$16,MATCH('Composite Data'!F$2,'EMIS Data'!$A$8:$DG$8,0),FALSE)","v":0},{"$f":"VLOOKUP($A7,'Other Data'!$A$4:$J$10,MATCH('Composite Data'!G$2,'Other Data'!$A$2:$J$2,0),FALSE)","v":0},{"$f":"VLOOKUP($A7,'Other Data'!$A$4:$J$10,MATCH('Composite Data'!H$2,'Other Data'!$A$2:$J$2,0),FALSE)","v":1},{"$f":"VLOOKUP($A7,'EMIS Data'!$A$10:$DG$16,MATCH('Composite Data'!I$2,'EMIS Data'!$A$8:$DG$8,0),FALSE)","v":0},3,{"$f":"VLOOKUP($A7,'EMIS Data'!$A$10:$DG$16,MATCH('Composite Data'!K$2,'EMIS Data'!$A$8:$DG$8,0),FALSE)","v":6},{"$f":"VLOOKUP($A7,'EMIS Data'!$A$10:$DG$16,MATCH('Composite Data'!L$2,'EMIS Data'!$A$8:$DG$8,0),FALSE)","v":0},{"$f":"VLOOKUP($A7,'EMIS Data'!$A$10:$DG$16,MATCH('Composite Data'!M$2,'EMIS Data'!$A$8:$DG$8,0),FALSE)","v":0},{"$f":"VLOOKUP($A7,'EMIS Data'!$A$10:$DG$16,MATCH('Composite Data'!N$2,'EMIS Data'!$A$8:$DG$8,0),FALSE)","v":1},{"$f":"VLOOKUP($A7,'EMIS Data'!$A$10:$DG$16,MATCH('Composite Data'!O$2,'EMIS Data'!$A$8:$DG$8,0),FALSE)","v":0},{"$f":"VLOOKUP($A7,'EMIS Data'!$A$10:$DG$16,MATCH('Composite Data'!P$2,'EMIS Data'!$A$8:$DG$8,0),FALSE)","v":0},{"$f":"VLOOKUP($A7,'EMIS Data'!$A$10:$DG$16,MATCH('Composite Data'!Q$2,'EMIS Data'!$A$8:$DG$8,0),FALSE)","v":0},{"$f":"VLOOKUP($A7,'EMIS Data'!$A$10:$DG$16,MATCH('Composite Data'!R$2,'EMIS Data'!$A$8:$DG$8,0),FALSE)","v":0},{"$f":"VLOOKUP($A7,'EMIS Data'!$A$10:$DG$16,MATCH('Composite Data'!S$2,'EMIS Data'!$A$8:$DG$8,0),FALSE)","v":4},{"$f":"VLOOKUP($A7,'EMIS Data'!$A$10:$DG$16,MATCH('Composite Data'!T$2,'EMIS Data'!$A$8:$DG$8,0),FALSE)","v":0},{"$f":"VLOOKUP($A7,'EMIS Data'!$A$10:$DG$16,MATCH('Composite Data'!U$2,'EMIS Data'!$A$8:$DG$8,0),FALSE)","v":0},{"$f":"VLOOKUP($A7,'EMIS Data'!$A$10:$DG$16,MATCH('Composite Data'!V$2,'EMIS Data'!$A$8:$DG$8,0),FALSE)","v":0},{"$f":"VLOOKUP($A7,'EMIS Data'!$A$10:$DG$16,MATCH('Composite Data'!W$2,'EMIS Data'!$A$8:$DG$8,0),FALSE)","v":0},{"$f":"VLOOKUP($A7,'EMIS Data'!$A$10:$DG$16,MATCH('Composite Data'!X$2,'EMIS Data'!$A$8:$DG$8,0),FALSE)","v":0},{"$f":"VLOOKUP($A7,'EMIS Data'!$A$10:$DG$16,MATCH('Composite Data'!Y$2,'EMIS Data'!$A$8:$DG$8,0),FALSE)","v":1},{"$f":"VLOOKUP($A7,'EMIS Data'!$A$10:$DG$16,MATCH('Composite Data'!Z$2,'EMIS Data'!$A$8:$DG$8,0),FALSE)","v":2},{"$f":"VLOOKUP($A7,'EMIS Data'!$A$10:$DG$16,MATCH('Composite Data'!AA$2,'EMIS Data'!$A$8:$DG$8,0),FALSE)","v":0},{"$f":"VLOOKUP($A7,'EMIS Data'!$A$10:$DG$16,MATCH('Composite Data'!AB$2,'EMIS Data'!$A$8:$DG$8,0),FALSE)","v":0},{"$f":"VLOOKUP($A7,'EMIS Data'!$A$10:$DG$16,MATCH('Composite Data'!AC$2,'EMIS Data'!$A$8:$DG$8,0),FALSE)","v":0},{"$f":"VLOOKUP($A7,'EMIS Data'!$A$10:$DG$16,MATCH('Composite Data'!AD$2,'EMIS Data'!$A$8:$DG$8,0),FALSE)","v":4},{"$f":"VLOOKUP($A7,'EMIS Data'!$A$10:$DG$16,MATCH('Composite Data'!AE$2,'EMIS Data'!$A$8:$DG$8,0),FALSE)","v":0},{"$f":"VLOOKUP($A7,'EMIS Data'!$A$10:$DG$16,MATCH('Composite Data'!AF$2,'EMIS Data'!$A$8:$DG$8,0),FALSE)","v":0},{"$f":"VLOOKUP($A7,'EMIS Data'!$A$10:$DG$16,MATCH('Composite Data'!AG$2,'EMIS Data'!$A$8:$DG$8,0),FALSE)","v":0},{"$f":"VLOOKUP($A7,'EMIS Data'!$A$10:$DG$16,MATCH('Composite Data'!AH$2,'EMIS Data'!$A$8:$DG$8,0),FALSE)","v":0},{"$f":"VLOOKUP($A7,'EMIS Data'!$A$10:$DG$16,MATCH('Composite Data'!AI$2,'EMIS Data'!$A$8:$DG$8,0),FALSE)","v":2},{"$f":"VLOOKUP($A7,'EMIS Data'!$A$10:$DG$16,MATCH('Composite Data'!AJ$2,'EMIS Data'!$A$8:$DG$8,0),FALSE)","v":2},{"$f":"VLOOKUP($A7,'EMIS Data'!$A$10:$DG$16,MATCH('Composite Data'!AK$2,'EMIS Data'!$A$8:$DG$8,0),FALSE)","v":3},{"$f":"VLOOKUP($A7,'EMIS Data'!$A$10:$DG$16,MATCH('Composite Data'!AL$2,'EMIS Data'!$A$8:$DG$8,0),FALSE)","v":0},{"$f":"VLOOKUP($A7,'EMIS Data'!$A$10:$DG$16,MATCH('Composite Data'!AM$2,'EMIS Data'!$A$8:$DG$8,0),FALSE)","v":2},{"$f":"VLOOKUP($A7,'EMIS Data'!$A$10:$DG$16,MATCH('Composite Data'!AN$2,'EMIS Data'!$A$8:$DG$8,0),FALSE)","v":3},{"$f":"VLOOKUP($A7,'EMIS Data'!$A$10:$DG$16,MATCH('Composite Data'!AO$2,'EMIS Data'!$A$8:$DG$8,0),FALSE)","v":3},{"$f":"VLOOKUP($A7,'EMIS Data'!$A$10:$DG$16,MATCH('Composite Data'!AP$2,'EMIS Data'!$A$8:$DG$8,0),FALSE)","v":1},{"$f":"VLOOKUP($A7,'EMIS Data'!$A$10:$DG$16,MATCH('Composite Data'!AQ$2,'EMIS Data'!$A$8:$DG$8,0),FALSE)","v":3}]
["POWC 0103 Orthopaedic referral",{"$f":"VLOOKUP($A8,'Other Data'!$A$4:$J$10,MATCH('Composite Data'!B$2,'Other Data'!$A$2:$J$2,0),FALSE)","v":1},{"$f":"VLOOKUP($A8,'Other Data'!$A$4:$J$10,MATCH('Composite Data'!C$2,'Other Data'!$A$2:$J$2,0),FALSE)","v":0},{"$f":"VLOOKUP($A8,'Other Data'!$A$4:$J$10,MATCH('Composite Data'!D$2,'Other Data'!$A$2:$J$2,0),FALSE)","v":0},{"$f":"VLOOKUP($A8,'EMIS Data'!$A$10:$DG$16,MATCH('Composite Data'!E$2,'EMIS Data'!$A$8:$DG$8,0),FALSE)","v":8},{"$f":"VLOOKUP($A8,'EMIS Data'!$A$10:$DG$16,MATCH('Composite Data'!F$2,'EMIS Data'!$A$8:$DG$8,0),FALSE)","v":0},{"$f":"VLOOKUP($A8,'Other Data'!$A$4:$J$10,MATCH('Composite Data'!G$2,'Other Data'!$A$2:$J$2,0),FALSE)","v":0},{"$f":"VLOOKUP($A8,'Other Data'!$A$4:$J$10,MATCH('Composite Data'!H$2,'Other Data'!$A$2:$J$2,0),FALSE)","v":0},{"$f":"VLOOKUP($A8,'EMIS Data'!$A$10:$DG$16,MATCH('Composite Data'!I$2,'EMIS Data'!$A$8:$DG$8,0),FALSE)","v":0},4,{"$f":"VLOOKUP($A8,'EMIS Data'!$A$10:$DG$16,MATCH('Composite Data'!K$2,'EMIS Data'!$A$8:$DG$8,0),FALSE)","v":4},{"$f":"VLOOKUP($A8,'EMIS Data'!$A$10:$DG$16,MATCH('Composite Data'!L$2,'EMIS Data'!$A$8:$DG$8,0),FALSE)","v":1},{"$f":"VLOOKUP($A8,'EMIS Data'!$A$10:$DG$16,MATCH('Composite Data'!M$2,'EMIS Data'!$A$8:$DG$8,0),FALSE)","v":1},{"$f":"VLOOKUP($A8,'EMIS Data'!$A$10:$DG$16,MATCH('Composite Data'!N$2,'EMIS Data'!$A$8:$DG$8,0),FALSE)","v":2},{"$f":"VLOOKUP($A8,'EMIS Data'!$A$10:$DG$16,MATCH('Composite Data'!O$2,'EMIS Data'!$A$8:$DG$8,0),FALSE)","v":3},{"$f":"VLOOKUP($A8,'EMIS Data'!$A$10:$DG$16,MATCH('Composite Data'!P$2,'EMIS Data'!$A$8:$DG$8,0),FALSE)","v":0},{"$f":"VLOOKUP($A8,'EMIS Data'!$A$10:$DG$16,MATCH('Composite Data'!Q$2,'EMIS Data'!$A$8:$DG$8,0),FALSE)","v":0},{"$f":"VLOOKUP($A8,'EMIS Data'!$A$10:$DG$16,MATCH('Composite Data'!R$2,'EMIS Data'!$A$8:$DG$8,0),FALSE)","v":0},{"$f":"VLOOKUP($A8,'EMIS Data'!$A$10:$DG$16,MATCH('Composite Data'!S$2,'EMIS Data'!$A$8:$DG$8,0),FALSE)","v":8},{"$f":"VLOOKUP($A8,'EMIS Data'!$A$10:$DG$16,MATCH('Composite Data'!T$2,'EMIS Data'!$A$8:$DG$8,0),FALSE)","v":6},{"$f":"VLOOKUP($A8,'EMIS Data'!$A$10:$DG$16,MATCH('Composite Data'!U$2,'EMIS Data'!$A$8:$DG$8,0),FALSE)","v":0},{"$f":"VLOOKUP($A8,'EMIS Data'!$A$10:$DG$16,MATCH('Composite Data'!V$2,'EMIS Data'!$A$8:$DG$8,0),FALSE)","v":2},{"$f":"VLOOKUP($A8,'EMIS Data'!$A$10:$DG$16,MATCH('Composite Data'!W$2,'EMIS Data'!$A$8:$DG$8,0),FALSE)","v":0},{"$f":"VLOOKUP($A8,'EMIS Data'!$A$10:$DG$16,MATCH('Composite Data'!X$2,'EMIS Data'!$A$8:$DG$8,0),FALSE)","v":0},{"$f":"VLOOKUP($A8,'EMIS Data'!$A$10:$DG$16,MATCH('Composite Data'!Y$2,'EMIS Data'!$A$8:$DG$8,0),FALSE)","v":3},{"$f":"VLOOKUP($A8,'EMIS Data'!$A$10:$DG$16,MATCH('Composite Data'!Z$2,'EMIS Data'!$A$8:$DG$8,0),FALSE)","v":5},{"$f":"VLOOKUP($A8,'EMIS Data'!$A$10:$DG$16,MATCH('Composite Data'!AA$2,'EMIS Data'!$A$8:$DG$8,0),FALSE)","v":1},{"$f":"VLOOKUP($A8,'EMIS Data'!$A$10:$DG$16,MATCH('Composite Data'!AB$2,'EMIS Data'!$A$8:$DG$8,0),FALSE)","v":7},{"$f":"VLOOKUP($A8,'EMIS Data'!$A$10:$DG$16,MATCH('Composite Data'!AC$2,'EMIS Data'!$A$8:$DG$8,0),FALSE)","v":3},{"$f":"VLOOKUP($A8,'EMIS Data'!$A$10:$DG$16,MATCH('Composite Data'!AD$2,'EMIS Data'!$A$8:$DG$8,0),FALSE)","v":10},{"$f":"VLOOKUP($A8,'EMIS Data'!$A$10:$DG$16,MATCH('Composite Data'!AE$2,'EMIS Data'!$A$8:$DG$8,0),FALSE)","v":0},{"$f":"VLOOKUP($A8,'EMIS Data'!$A$10:$DG$16,MATCH('Composite Data'!AF$2,'EMIS Data'!$A$8:$DG$8,0),FALSE)","v":0},{"$f":"VLOOKUP($A8,'EMIS Data'!$A$10:$DG$16,MATCH('Composite Data'!AG$2,'EMIS Data'!$A$8:$DG$8,0),FALSE)","v":1},{"$f":"VLOOKUP($A8,'EMIS Data'!$A$10:$DG$16,MATCH('Composite Data'!AH$2,'EMIS Data'!$A$8:$DG$8,0),FALSE)","v":1},{"$f":"VLOOKUP($A8,'EMIS Data'!$A$10:$DG$16,MATCH('Composite Data'!AI$2,'EMIS Data'!$A$8:$DG$8,0),FALSE)","v":4},{"$f":"VLOOKUP($A8,'EMIS Data'!$A$10:$DG$16,MATCH('Composite Data'!AJ$2,'EMIS Data'!$A$8:$DG$8,0),FALSE)","v":2},{"$f":"VLOOKUP($A8,'EMIS Data'!$A$10:$DG$16,MATCH('Composite Data'!AK$2,'EMIS Data'!$A$8:$DG$8,0),FALSE)","v":5},{"$f":"VLOOKUP($A8,'EMIS Data'!$A$10:$DG$16,MATCH('Composite Data'!AL$2,'EMIS Data'!$A$8:$DG$8,0),FALSE)","v":0},{"$f":"VLOOKUP($A8,'EMIS Data'!$A$10:$DG$16,MATCH('Composite Data'!AM$2,'EMIS Data'!$A$8:$DG$8,0),FALSE)","v":5},{"$f":"VLOOKUP($A8,'EMIS Data'!$A$10:$DG$16,MATCH('Composite Data'!AN$2,'EMIS Data'!$A$8:$DG$8,0),FALSE)","v":7},{"$f":"VLOOKUP($A8,'EMIS Data'!$A$10:$DG$16,MATCH('Composite Data'!AO$2,'EMIS Data'!$A$8:$DG$8,0),FALSE)","v":5},{"$f":"VLOOKUP($A8,'EMIS Data'!$A$10:$DG$16,MATCH('Composite Data'!AP$2,'EMIS Data'!$A$8:$DG$8,0),FALSE)","v":2},{"$f":"VLOOKUP($A8,'EMIS Data'!$A$10:$DG$16,MATCH('Composite Data'!AQ$2,'EMIS Data'!$A$8:$DG$8,0),FALSE)","v":8}]
["POWC 0104 Advice given about wound care",{"$f":"VLOOKUP($A9,'Other Data'!$A$4:$J$10,MATCH('Composite Data'!B$2,'Other Data'!$A$2:$J$2,0),FALSE)","v":55},{"$f":"VLOOKUP($A9,'Other Data'!$A$4:$J$10,MATCH('Composite Data'!C$2,'Other Data'!$A$2:$J$2,0),FALSE)","v":13},{"$f":"VLOOKUP($A9,'Other Data'!$A$4:$J$10,MATCH('Composite Data'!D$2,'Other Data'!$A$2:$J$2,0),FALSE)","v":0},{"$f":"VLOOKUP($A9,'EMIS Data'!$A$10:$DG$16,MATCH('Composite Data'!E$2,'EMIS Data'!$A$8:$DG$8,0),FALSE)","v":123},{"$f":"VLOOKUP($A9,'EMIS Data'!$A$10:$DG$16,MATCH('Composite Data'!F$2,'EMIS Data'!$A$8:$DG$8,0),FALSE)","v":0},{"$f":"VLOOKUP($A9,'Other Data'!$A$4:$J$10,MATCH('Composite Data'!G$2,'Other Data'!$A$2:$J$2,0),FALSE)","v":0},{"$f":"VLOOKUP($A9,'Other Data'!$A$4:$J$10,MATCH('Composite Data'!H$2,'Other Data'!$A$2:$J$2,0),FALSE)","v":0},{"$f":"VLOOKUP($A9,'EMIS Data'!$A$10:$DG$16,MATCH('Composite Data'!I$2,'EMIS Data'!$A$8:$DG$8,0),FALSE)","v":7},41,{"$f":"VLOOKUP($A9,'EMIS Data'!$A$10:$DG$16,MATCH('Composite Data'!K$2,'EMIS Data'!$A$8:$DG$8,0),FALSE)","v":43},{"$f":"VLOOKUP($A9,'EMIS Data'!$A$10:$DG$16,MATCH('Composite Data'!L$2,'EMIS Data'!$A$8:$DG$8,0),FALSE)","v":3},{"$f":"VLOOKUP($A9,'EMIS Data'!$A$10:$DG$16,MATCH('Composite Data'!M$2,'EMIS Data'!$A$8:$DG$8,0),FALSE)","v":2},{"$f":"VLOOKUP($A9,'EMIS Data'!$A$10:$DG$16,MATCH('Composite Data'!N$2,'EMIS Data'!$A$8:$DG$8,0),FALSE)","v":12},{"$f":"VLOOKUP($A9,'EMIS Data'!$A$10:$DG$16,MATCH('Composite Data'!O$2,'EMIS Data'!$A$8:$DG$8,0),FALSE)","v":0},{"$f":"VLOOKUP($A9,'EMIS Data'!$A$10:$DG$16,MATCH('Composite Data'!P$2,'EMIS Data'!$A$8:$DG$8,0),FALSE)","v":1},{"$f":"VLOOKUP($A9,'EMIS Data'!$A$10:$DG$16,MATCH('Composite Data'!Q$2,'EMIS Data'!$A$8:$DG$8,0),FALSE)","v":3},{"$f":"VLOOKUP($A9,'EMIS Data'!$A$10:$DG$16,MATCH('Composite Data'!R$2,'EMIS Data'!$A$8:$DG$8,0),FALSE)","v":9},{"$f":"VLOOKUP($A9,'EMIS Data'!$A$10:$DG$16,MATCH('Composite Data'!S$2,'EMIS Data'!$A$8:$DG$8,0),FALSE)","v":0},{"$f":"VLOOKUP($A9,'EMIS Data'!$A$10:$DG$16,MATCH('Composite Data'!T$2,'EMIS Data'!$A$8:$DG$8,0),FALSE)","v":23},{"$f":"VLOOKUP($A9,'EMIS Data'!$A$10:$DG$16,MATCH('Composite Data'!U$2,'EMIS Data'!$A$8:$DG$8,0),FALSE)","v":0},{"$f":"VLOOKUP($A9,'EMIS Data'!$A$10:$DG$16,MATCH('Composite Data'!V$2,'EMIS Data'!$A$8:$DG$8,0),FALSE)","v":4},{"$f":"VLOOKUP($A9,'EMIS Data'!$A$10:$DG$16,MATCH('Composite Data'!W$2,'EMIS Data'!$A$8:$DG$8,0),FALSE)","v":0},{"$f":"VLOOKUP($A9,'EMIS Data'!$A$10:$DG$16,MATCH('Composite Data'!X$2,'EMIS Data'!$A$8:$DG$8,0),FALSE)","v":0},{"$f":"VLOOKUP($A9,'EMIS Data'!$A$10:$DG$16,MATCH('Composite Data'!Y$2,'EMIS Data'!$A$8:$DG$8,0),FALSE)","v":16},{"$f":"VLOOKUP($A9,'EMIS Data'!$A$10:$DG$16,MATCH('Composite Data'!Z$2,'EMIS Data'!$A$8:$DG$8,0),FALSE)","v":5},{"$f":"VLOOKUP($A9,'EMIS Data'!$A$10:$DG$16,MATCH('Composite Data'!AA$2,'EMIS Data'!$A$8:$DG$8,0),FALSE)","v":5},{"$f":"VLOOKUP($A9,'EMIS Data'!$A$10:$DG$16,MATCH('Composite Data'!AB$2,'EMIS Data'!$A$8:$DG$8,0),FALSE)","v":10},{"$f":"VLOOKUP($A9,'EMIS Data'!$A$10:$DG$16,MATCH('Composite Data'!AC$2,'EMIS Data'!$A$8:$DG$8,0),FALSE)","v":2},{"$f":"VLOOKUP($A9,'EMIS Data'!$A$10:$DG$16,MATCH('Composite Data'!AD$2,'EMIS Data'!$A$8:$DG$8,0),FALSE)","v":44},{"$f":"VLOOKUP($A9,'EMIS Data'!$A$10:$DG$16,MATCH('Composite Data'!AE$2,'EMIS Data'!$A$8:$DG$8,0),FALSE)","v":1},{"$f":"VLOOKUP($A9,'EMIS Data'!$A$10:$DG$16,MATCH('Composite Data'!AF$2,'EMIS Data'!$A$8:$DG$8,0),FALSE)","v":0},{"$f":"VLOOKUP($A9,'EMIS Data'!$A$10:$DG$16,MATCH('Composite Data'!AG$2,'EMIS Data'!$A$8:$DG$8,0),FALSE)","v":42},{"$f":"VLOOKUP($A9,'EMIS Data'!$A$10:$DG$16,MATCH('Composite Data'!AH$2,'EMIS Data'!$A$8:$DG$8,0),FALSE)","v":2},{"$f":"VLOOKUP($A9,'EMIS Data'!$A$10:$DG$16,MATCH('Composite Data'!AI$2,'EMIS Data'!$A$8:$DG$8,0),FALSE)","v":5},{"$f":"VLOOKUP($A9,'EMIS Data'!$A$10:$DG$16,MATCH('Composite Data'!AJ$2,'EMIS Data'!$A$8:$DG$8,0),FALSE)","v":16},{"$f":"VLOOKUP($A9,'EMIS Data'!$A$10:$DG$16,MATCH('Composite Data'!AK$2,'EMIS Data'!$A$8:$DG$8,0),FALSE)","v":61},{"$f":"VLOOKUP($A9,'EMIS Data'!$A$10:$DG$16,MATCH('Composite Data'!AL$2,'EMIS Data'!$A$8:$DG$8,0),FALSE)","v":0},{"$f":"VLOOKUP($A9,'EMIS Data'!$A$10:$DG$16,MATCH('Composite Data'!AM$2,'EMIS Data'!$A$8:$DG$8,0),FALSE)","v":44},{"$f":"VLOOKUP($A9,'EMIS Data'!$A$10:$DG$16,MATCH('Composite Data'!AN$2,'EMIS Data'!$A$8:$DG$8,0),FALSE)","v":0},{"$f":"VLOOKUP($A9,'EMIS Data'!$A$10:$DG$16,MATCH('Composite Data'!AO$2,'EMIS Data'!$A$8:$DG$8,0),FALSE)","v":3},{"$f":"VLOOKUP($A9,'EMIS Data'!$A$10:$DG$16,MATCH('Composite Data'!AP$2,'EMIS Data'!$A$8:$DG$8,0),FALSE)","v":0},{"$f":"VLOOKUP($A9,'EMIS Data'!$A$10:$DG$16,MATCH('Composite Data'!AQ$2,'EMIS Data'!$A$8:$DG$8,0),FALSE)","v":49}]

{"sheet":"EMIS Data","index":2,"n_rows":118,"n_cols":112,"rows_kept":118,"cut":false,"hidden":false,"merged":[]}
["POWC 2022 Audit Report"]
[]
["Last Run:","2022-10-26T14:03:00","Relative Date:","2022-03-31"]
[]
["Population Count","Males","Females"]
[819095,410936,408159]
[]
[null,"Organisation Code","F82001","F82002","F82003","F82005","F82006","F82007","F82008","F82009","F82010","F82011","F82012","F82013","F82014","F82015","F82016","F82017","F82018","F82019","F82021","F82022","F82023","F82025","F82027","F82028","F82030","F82031","F82033","F82034","F82038","F82039","F82040","F82042","F82045","F82051","F82053","F82055","F82604","F82607","F82609","F82610","F82612","F82619","F82621","F82624","F82625","F82627","F82630","F82634","F82638","F82642","F82647","F82648","F82649","F82650","F82660","F82661","F82663","F82666","F82670","F82671","F82674","F82675","F82677","F82678","F82679","F82686","F86007","F86008","F86009","F86010","F86012","F86020","F86022","F86023","F86028","F86032","F86034","F86040","F86042","F86057","F86060","F86064","F86066","F86081","F86083","F86085","F86087","F86612","F86624","F86637","F86641","F86642","F86652","F86658","F86691","F86692","F86698","F86702","F86703","F86707","F86731","Y00090","Y00312","Y00918","Y01280","Y01719","Y01795","Y02575","Y02973","Y02987"]
["Search"]
["Currently Registered Regular Patients",null,6171,6552,5821,6344,12358,11272,14057,20137,8021,10197,3871,17162,7169,5145,7019,8634,11341,6471,9910,12459,3423,5703,2201,9637,13830,4475,3569,4804,5399,3908,3038,19444,3537,9704,3391,9245,5342,5054,4532,2902,5885,3288,4465,3888,7552,5559,6889,5695,6706,6931,4966,3521,4550,9143,20667,3851,3937,5034,3262,3239,5248,3541,7302,4846,5191,3541,13285,11002,7358,14857,9680,5781,14288,9496,10587,9485,5784,5538,6308,6534,15880,4859,8071,6340,6577,3533,7748,3342,3109,5046,7903,4813,6917,5240,10810,10658,5183,5168,3827,6754,4374,8097,4894,6583,2307,6838,4111,21272,8563,25207]
["POWC 01 Post-operative wound care 2022",null,38,20,24,9,19,34,34,31,1,4,16,8,28,13,3,56,50,20,3,17,5,34,0,4,12,4,0,3,19,6,6,15,1,7,2,5,1,24,0,0,2,0,4,2,10,3,0,29,3,3,0,6,7,18,86,0,0,4,2,5,3,0,23,0,10,1,162,52,18,86,55,46,0,79,29,36,10,2,46,8,0,6,105,9,54,15,13,19,1,5,15,8,45,17,68,9,13,2,25,15,25,7,6,47,0,4,17,23,16,108]
["POWC 0101 Referral to tissue viability service",null,0,0,0,0,0,0,0,0,0,0,1,0,0,0,1,0,0,0,0,0,0,0,0,0,0,0,0,0,0,0,1,0,0,0,0,0,0,0,0,0,0,0,0,0,0,0,0,0,0,0,0,0,0,0,0,0,0,0,0,0,0,0,0,0,0,0,1,0,0,0,0,1,0,0,3,0,0,0,4,0,0,0,0,0,0,0,0,0,0,0,0,0,0,0,1,0,0,0,0,1,0,0,0,2,0,0,0,0,0,9]
["POWC 0102 Refer to district nurse",null,0,0,0,0,0,0,0,0,0,0,0,0,0,0,1,0,0,2,0,0,0,0,0,0,0,0,0,0,0,0,1,1,0,0,0,0,0,0,0,0,0,0,0,0,0,0,0,1,0,0,0,0,0,0,1,0,0,0,0,0,0,0,0,0,1,1,4,3,1,3,3,2,0,3,2,2,0,0,0,0,0,0,4,0,0,0,2,1,0,0,0,0,0,0,4,0,0,0,0,1,0,0,0,6,0,0,0,1,1,6]
["POWC 0103 Orthopaedic referral",null,1,3,5,0,2,3,5,2,0,0,0,0,0,0,1,2,1,4,0,1,1,4,0,0,0,0,0,0,2,0,0,2,0,0,1,0,0,1,0,0,0,0,0,0,1,0,0,5,1,0,0,0,0,1,9,0,0,0,0,1,0,0,0,0,1,0,8,8,2,5,7,5,0,5,2,4,1,0,1,0,0,0,10,3,7,1,5,3,0,0,2,0,6,0,8,0,0,0,3,2,1,1,1,4,0,0,1,3,0,8]
["POWC 0104 Advice given about wound care",null,33,0,10,1,2,9,1,1,0,0,0,0,1,7,1,0,0,0,0,1,0,0,0,0,2,0,0,3,0,0,2,1,0,0,0,0,0,12,0,0,0,0,0,0,4,1,0,0,0,0,0,2,1,2,24,0,0,0,0,1,0,0,12,0,0,0,123,49,0,3,0,44,0,61,16,5,2,0,42,0,0,1,44,2,10,5,5,16,0,0,4,0,23,7,0,9,3,1,0,12,2,3,1,43,0,2,0,2,2,83]
["POWC 01 Post-operative wound care Activity",null,{"$f":"IFERROR(VLOOKUP(C8,$A$23:$B$118,2,FALSE),0)","v":107},{"$f":"IFERROR(VLOOKUP(D8,$A$23:$B$118,2,FALSE),0)","v":24},42,11,26,45,38,69,2,6,18,8,49,16,3,130,106,32,4,19,6,60,0,10,16,4,0,3,27,6,11,17,1,8,2,5,1,93,0,0,2,0,8,5,13,3,0,134,3,3,0,7,7,30,197,0,0,4,2,7,8,0,37,0,13,{"$f":"IFERROR(VLOOKUP(BP8,$A$23:$B$118,2,FALSE),0)","v":2},718,59,26,102,65,46,0,206,73,56,87,2,110,8,0,6,240,12,103,17,34,27,1,6,25,13,92,27,232,39,21,2,35,19,46,8,9,91,0,5,19,27,16,258]
[]
[]
[]
[]
[]
[]
["F86008",59]
["F86010",102]
["F86012",65]
["F86020",46]
["F86023",206]
["F86028",73]
["F86032",56]
["F86042",110]
["F86064",6]
["F86066",240]
["F86081",12]
["F86083",103]
["F86085",17]
["F86087",34]
["F86612",27]
["F86637",6]
["F86641",25]
["F86642",13]
["F86652",92]
["F86691",232]
["F86692",39]
["F86698",21]
["F86703",35]
["F86731",46]
["Y00090",8]
["Y02987",258]
["F86707",19]
["Y00918",91]
["F86009",26]
["F86007",718]
["F86057",8]
["F86658",27]
["F86034",87]
["F86624",1]
["F86702",2]
["F82607",93]
["F82045",1]
["F82017",130]
["F82003",42]
["F82039",6]
["F82012",18]
["F82011",6]
["Y01719",5]
["F82030",16]
["F82612",2]
["F82010",2]
["F82055",5]
["F82649",7]
["Y00312",9]
["F82025",60]
["F82053",2]
["F82642",3]
["F82002",24]
["F82627",3]
["F82014",49]
["F82022",19]
["F82021",4]
["F82018",106]
["F82650",30]
["F82005",11]
["F82666",4]
["F82031",4]
["Y01795",19]
["F82660",197]
["F82625",13]
["F82001",107]
["F82040",11]
["F82007",45]
["F82008",38]
["F82006",26]
["F82621",8]
["F82023",6]
["F82042",17]
["F82670",2]
["F82016",3]
["F82034",3]
["F82671",7]
["F82638",3]
["F82015",16]
["F82686",2]
["F82648",7]
["Y02575",27]
["F82038",27]
["F82624",5]
["F82604",1]
["Y02973",16]
["F82679",13]
["F82009",69]
["F86040",2]
["F82677",37]
["F82013",8]
["F82674",8]
["F82634",134]
["F82028",10]
["F82051",8]
["F82019",32]

{"sheet":"Other Data","index":3,"n_rows":35,"n_cols":24,"rows_kept":35,"cut":false,"hidden":false,"merged":[]}
[]
[null,"Y00155","F86082","F86025","F86013","F86657"]
[]
["Currently Registered Regular Patients",{"$f":"VLOOKUP(B$2,Sheet2!$B$4:$H$9,MATCH('Other Data'!$A4,Sheet2!$B$4:$H$4,0),FALSE)","v":9675},{"$f":"VLOOKUP(C$2,Sheet2!$B$4:$H$9,MATCH('Other Data'!$A4,Sheet2!$B$4:$H$4,0),FALSE)","v":6040},{"$f":"VLOOKUP(D$2,Sheet2!$B$4:$H$9,MATCH('Other Data'!$A4,Sheet2!$B$4:$H$4,0),FALSE)","v":17281},{"$f":"VLOOKUP(E$2,Sheet2!$B$4:$H$9,MATCH('Other Data'!$A4,Sheet2!$B$4:$H$4,0),FALSE)","v":7165},{"$f":"VLOOKUP(F$2,Sheet2!$B$4:$H$9,MATCH('Other Data'!$A4,Sheet2!$B$4:$H$4,0),FALSE)","v":8166}]
["POWC 01 Post-operative wound care 2022",{"$f":"VLOOKUP(B$2,Sheet2!$B$4:$H$9,MATCH('Other Data'!$A5,Sheet2!$B$4:$H$4,0),FALSE)","v":1},{"$f":"VLOOKUP(C$2,Sheet2!$B$4:$H$9,MATCH('Other Data'!$A5,Sheet2!$B$4:$H$4,0),FALSE)","v":13},{"$f":"VLOOKUP(D$2,Sheet2!$B$4:$H$9,MATCH('Other Data'!$A5,Sheet2!$B$4:$H$4,0),FALSE)","v":55},{"$f":"VLOOKUP(E$2,Sheet2!$B$4:$H$9,MATCH('Other Data'!$A5,Sheet2!$B$4:$H$4,0),FALSE)","v":12},{"$f":"VLOOKUP(F$2,Sheet2!$B$4:$H$9,MATCH('Other Data'!$A5,Sheet2!$B$4:$H$4,0),FALSE)","v":16}]
["POWC 01 Post-operative wound care activity",{"$f":"VLOOKUP(B$2,Sheet2!$B$4:$H$9,MATCH('Other Data'!$A6,Sheet2!$B$4:$H$4,0),FALSE)","v":{"$error":"#N/A"}},{"$f":"VLOOKUP(C$2,Sheet2!$B$4:$H$9,MATCH('Other Data'!$A6,Sheet2!$B$4:$H$4,0),FALSE)","v":{"$error":"#N/A"}},{"$f":"VLOOKUP(D$2,Sheet2!$B$4:$H$9,MATCH('Other Data'!$A6,Sheet2!$B$4:$H$4,0),FALSE)","v":{"$error":"#N/A"}},{"$f":"VLOOKUP(E$2,Sheet2!$B$4:$H$9,MATCH('Other Data'!$A6,Sheet2!$B$4:$H$4,0),FALSE)","v":{"$error":"#N/A"}},{"$f":"VLOOKUP(F$2,Sheet2!$B$4:$H$9,MATCH('Other Data'!$A6,Sheet2!$B$4:$H$4,0),FALSE)","v":{"$error":"#N/A"}}]
["POWC 0101 Referral to tissue viability service",{"$f":"VLOOKUP(B$2,Sheet2!$B$4:$H$9,MATCH('Other Data'!$A7,Sheet2!$B$4:$H$4,0),FALSE)","v":{"$error":"#N/A"}},{"$f":"VLOOKUP(C$2,Sheet2!$B$4:$H$9,MATCH('Other Data'!$A7,Sheet2!$B$4:$H$4,0),FALSE)","v":{"$error":"#N/A"}},{"$f":"VLOOKUP(D$2,Sheet2!$B$4:$H$9,MATCH('Other Data'!$A7,Sheet2!$B$4:$H$4,0),FALSE)","v":{"$error":"#N/A"}},{"$f":"VLOOKUP(E$2,Sheet2!$B$4:$H$9,MATCH('Other Data'!$A7,Sheet2!$B$4:$H$4,0),FALSE)","v":{"$error":"#N/A"}},{"$f":"VLOOKUP(F$2,Sheet2!$B$4:$H$9,MATCH('Other Data'!$A7,Sheet2!$B$4:$H$4,0),FALSE)","v":{"$error":"#N/A"}}]
["POWC 0102 Refer to district nurse",{"$f":"VLOOKUP(B$2,Sheet2!$B$4:$H$9,MATCH('Other Data'!$A8,Sheet2!$B$4:$H$4,0),FALSE)","v":0},{"$f":"VLOOKUP(C$2,Sheet2!$B$4:$H$9,MATCH('Other Data'!$A8,Sheet2!$B$4:$H$4,0),FALSE)","v":0},{"$f":"VLOOKUP(D$2,Sheet2!$B$4:$H$9,MATCH('Other Data'!$A8,Sheet2!$B$4:$H$4,0),FALSE)","v":2},{"$f":"VLOOKUP(E$2,Sheet2!$B$4:$H$9,MATCH('Other Data'!$A8,Sheet2!$B$4:$H$4,0),FALSE)","v":1},{"$f":"VLOOKUP(F$2,Sheet2!$B$4:$H$9,MATCH('Other Data'!$A8,Sheet2!$B$4:$H$4,0),FALSE)","v":0}]
["POWC 0103 Orthopaedic referral",{"$f":"VLOOKUP(B$2,Sheet2!$B$4:$H$9,MATCH('Other Data'!$A9,Sheet2!$B$4:$H$4,0),FALSE)","v":0},{"$f":"VLOOKUP(C$2,Sheet2!$B$4:$H$9,MATCH('Other Data'!$A9,Sheet2!$B$4:$H$4,0),FALSE)","v":0},{"$f":"VLOOKUP(D$2,Sheet2!$B$4:$H$9,MATCH('Other Data'!$A9,Sheet2!$B$4:$H$4,0),FALSE)","v":1},{"$f":"VLOOKUP(E$2,Sheet2!$B$4:$H$9,MATCH('Other Data'!$A9,Sheet2!$B$4:$H$4,0),FALSE)","v":0},{"$f":"VLOOKUP(F$2,Sheet2!$B$4:$H$9,MATCH('Other Data'!$A9,Sheet2!$B$4:$H$4,0),FALSE)","v":0}]
["POWC 0104 Advice given about wound care",{"$f":"VLOOKUP(B$2,Sheet2!$B$4:$H$9,MATCH('Other Data'!$A10,Sheet2!$B$4:$H$4,0),FALSE)","v":0},{"$f":"VLOOKUP(C$2,Sheet2!$B$4:$H$9,MATCH('Other Data'!$A10,Sheet2!$B$4:$H$4,0),FALSE)","v":13},{"$f":"VLOOKUP(D$2,Sheet2!$B$4:$H$9,MATCH('Other Data'!$A10,Sheet2!$B$4:$H$4,0),FALSE)","v":55},{"$f":"VLOOKUP(E$2,Sheet2!$B$4:$H$9,MATCH('Other Data'!$A10,Sheet2!$B$4:$H$4,0),FALSE)","v":0},{"$f":"VLOOKUP(F$2,Sheet2!$B$4:$H$9,MATCH('Other Data'!$A10,Sheet2!$B$4:$H$4,0),FALSE)","v":0}]
[]
[]
[]
[]
[]
[]
[]
[]
[]
[]
[]
["Row Labels","Sum of Q4 Activity","Sum of Q4 Patients","Sum of #Tissue viability nurseQ4","Sum of #Refer to district nurseQ4","Sum of #Orthopaedic referralQ4","Sum of #Advice given about wound careQ4"]
["F86007",57,57,0,2,1,2]
["F86057",8,8,0,0,4,0]
["Grand Total",65,65,0,2,5,2]
[]
[]
[]
["Folder Path.2.1","Currently Registered Regular Patients","L&D Population","Q1 POWC 01 Post-operative wound care 2019-20","Q1 POWC 0101 Referral to tissue viability service","Q1 POWC 0102 Refer to district nurse","Q1 POWC 0103 Orthopaedic referral","Q1 POWC 0104 Advice given about wound care","Q2 POWC 01 Post-operative wound care 2019-20","Q2 POWC 0101 Referral to tissue viability service","Q2 POWC 0102 Refer to district nurse","Q2 POWC 0103 Orthopaedic referral","Q2 POWC 0104 Advice given about wound care","Q3 POWC 01 Post-operative wound care 2019-20","Q3 POWC 0101 Referral to tissue viability service","Q3 POWC 0102 Refer to district nurse","Q3 POWC 0103 Orthopaedic referral","Q3 POWC 0104 Advice given about wound care","Q4 POWC 01 Post-operative wound care 2019-20","Q4 POWC 0101 Referral to tissue viability service","Q4 POWC 0102 Refer to district nurse","Q4 POWC 0103 Orthopaedic referral","Q4 POWC 0104 Advice given about wound care","POWC 01 Post-operative wound care activity"]
["F86013",6609,14476,24,0,0,0,24,18,0,1,2,18,21,0,1,0,20,21,0,0,0,18,21]
["F86025",16678,29177,39,0,2,1,38,34,0,0,0,34,34,0,1,0,34,35,0,0,0,31,35]
["F86082",5553,12616,13,0,0,0,0,12,0,0,0,1,8,0,1,0,2,8,0,0,0,2,8]
["F86657",8351,16711,8,0,0,0,0,15,0,0,0,0,11,0,0,0,1,15,0,0,0,0,15]
["F86658",4939,7544,4,0,1,0,0,9,0,0,0,0,7,0,0,0,1,8,0,0,0,1]
["Y00155",9062,21226,10,0,0,0,10,31,0,0,0,30,23,0,0,0,21,20,0,0,0,20,20]

{"sheet":"Control Panel","index":4,"n_rows":53,"n_cols":6,"rows_kept":53,"cut":false,"hidden":false,"merged":[]}
["2020-01-01",null,null,null,"Search Title","Report Title"]
[null,null,null,null,"Currently Registered Regular Patients","Currently Registered Regular Patients"]
[null,null,null,null,"POWC 01 Post-operative wound care 2022","Patients with Post-operative wound care 2022-23"]
[null,null,null,null,null,"Patients per 1000 patients"]
["RB-1","Cranbrook",null,null,"POWC 01 Post-operative wound care activity","Post-operative wound care activity recorded 2022-23"]
["RB-2","Fairlop",null,null,null,"Activity per patient"]
["RB-3","Seven Kings",null,null,"POWC 0101 Referral to tissue viability service","Referral to tissue viability service"]
["RB-4","Wanstead & Woodford",null,null,"POWC 0102 Refer to district nurse","Refer to district nurse"]
["RB-5","Loxford",null,null,"POWC 0103 Orthopaedic referral","Orthopaedic referral"]
["RB-6","NewCross Alliance",null,null,"POWC 0104 Advice given about wound care","Advice given about wound care"]
[]
["F86652","Drive Surgery","RB","Redbridge","RB-1","Cranbrook"]
["F86702","St Clements Surgery","RB","Redbridge","RB-1","Cranbrook"]
["Y00918","Granville Medical Centre","RB","Redbridge","RB-1","Cranbrook"]
["F86042","Balfour Road Surgery","RB","Redbridge","RB-1","Cranbrook"]
["F86698","Cranbrook Surgery","RB","Redbridge","RB-1","Cranbrook"]
["F86008","Gants Hill Medical Centre","RB","Redbridge","RB-1","Cranbrook"]
["F86703","Redbridge Surgery","RB","Redbridge","RB-1","Cranbrook"]
["F86657","York Road Surgery","RB","Redbridge","RB-1","Cranbrook"]
["F86081","Kenwood Medical Centre","RB","Redbridge","RB-2","Fairlop"]
["F86083","Eastern Avenue Medical Centre","RB","Redbridge","RB-2","Fairlop"]
["F86612","Fullwell Avenue Surgery","RB","Redbridge","RB-2","Fairlop"]
["F86624","Heathcote Primary Care Centre","RB","Redbridge","RB-2","Fairlop"]
["F86707","Fencepiece Road Medical Practice","RB","Redbridge","RB-2","Fairlop"]
["F86057","The Willows Practice","RB","Redbridge","RB-2","Fairlop"]
["F86007","Forest Edge Practice","RB","Redbridge","RB-2","Fairlop"]
["F86009","The Palms Medical Centre","RB","Redbridge","RB-3","Seven Kings"]
["F86087","Goodmayes Medical Centre","RB","Redbridge","RB-3","Seven Kings"]
["F86637","Seven Kings Practice","RB","Redbridge","RB-3","Seven Kings"]
["Y00090","Doctor's House","RB","Redbridge","RB-3","Seven Kings"]
["F86034","Green Lane, Goodmayes Medical practice","RB","Redbridge","RB-3","Seven Kings"]
["F86642","Castleton Road Surgery","RB","Redbridge","RB-3","Seven Kings"]
["F86028","Chadwell Heath Surgery","RB","Redbridge","RB-3","Seven Kings"]
["Y00155","Grove Surgery","RB","Redbridge","RB-3","Seven Kings"]
["F86013","Broadway Surgery","RB","Redbridge","RB-4","Wanstead & Woodford"]
["F86023","The Evergreen Practice","RB","Redbridge","RB-4","Wanstead & Woodford"]
["F86032","Wanstead Place Surgery","RB","Redbridge","RB-4","Wanstead & Woodford"]
["F86731","Aldersbrook Medical Centre","RB","Redbridge","RB-4","Wanstead & Woodford"]
["F86066","Southdene Surgery","RB","Redbridge","RB-4","Wanstead & Woodford"]
["F86641","Shrubberies Medical Centre","RB","Redbridge","RB-4","Wanstead & Woodford"]
["F86020","Glebelands Practice","RB","Redbridge","RB-4","Wanstead & Woodford"]
["F86064","Elmhurst Practice","RB","Redbridge","RB-4","Wanstead & Woodford"]
["F86691","Clayhall Clinic","RB","Redbridge","RB-4","Wanstead & Woodford"]
["F86012","Rydal Practice","RB","Redbridge","RB-4","Wanstead & Woodford"]
["F86658","Queen Mary Practice","RB","Redbridge","RB-4","Wanstead & Woodford"]
["F86022","Ilford Medical Centre","RB","Redbridge","RB-5","Loxford"]
["Y02987","The Practice Loxford","RB","Redbridge","RB-5","Loxford"]
["F86692","Mathukias Surgery","RB","Redbridge","RB-5","Loxford"]
["F86082","Ilford Lane Surgery","RB","Redbridge","RB-5","Loxford"]
["F86025","Oak Tree Medical Practice","RB","Redbridge","RB-5","Loxford"]
["F86085","Hainault Surgery","RB","Redbridge","RB-6","NewCross Alliance"]
["F86010","Fullwell Cross Medical Centre","RB","Redbridge","RB-6","NewCross Alliance"]
["F86060","Newbury Group Practice","RB","Redbridge","RB-6","NewCross Alliance"]

{"sheet":"RB","index":5,"n_rows":6,"n_cols":9,"rows_kept":6,"cut":false,"hidden":false,"merged":[]}
["Rel_D","Practice","OrgID","Currently Registered Regular Patients","L&D Population","POWC 0102 Refer to district nurse","POWC 0103 Orthopaedic referral","POWC 0104 Advice given about wound care","POWC 01 Post-operative wound care 2021"]
["2022-01-01","Grove Surgery","Y00155","9725","14560"]
["2022-01-01","Ilford Lane Surgery","F86082","6028","9450",null,null,"1","7"]
["2022-01-01","Oak Tree Medical Practice","F86025","17422","22981","1","1","1","13"]
["2022-01-01","The Broadway Surgery","F86013","7186","11175",null,null,null,"7"]
["2022-01-01","York Surgery","F86657","8202","13352",null,null,null,"7"]

{"sheet":"Sheet2","index":6,"n_rows":591,"n_cols":8,"rows_kept":591,"cut":false,"hidden":false,"merged":[]}
[]
[]
[]
[null,"OrgID","Currently Registered Regular Patients","L&D Population","POWC 0102 Refer to district nurse","POWC 0103 Orthopaedic referral","POWC 0104 Advice given about wound care","POWC 01 Post-operative wound care 2022"]
[null,"Y00155",9675,14536,null,null,null,1]
[null,"F86082",6040,9448,null,null,13,13]
[null,"F86025",17281,22874,2,1,55,55]
[null,"F86013",7165,11144,1,null,null,12]
[null,"F86657",8166,13324,null,null,null,16]
[]
[]
[]
[]
[null,"F86692",{"$f":"COUNTIF($B$14:$B$669,B14)","v":1}]
[null,"F86009",14]
[null,"F86642",3]
[null,"F86060",1]
[null,"F86087",6]
[null,"F86087",6]
[null,"F86007",88]
[null,"Y02987",67]
[null,"F86028",19]
[null,"F86081",5]
[null,"F86707",13]
[null,"F86707",13]
[null,"F86637",3]
[null,"F86637",3]
[null,"F86057",10]
[null,"F86007",88]
[null,"F86637",3]
[null,"F86057",10]
[null,"F86703",14]
[null,"F86703",14]
[null,"F86703",14]
[null,"F86703",14]
[null,"F86652",7]
[null,"F86658",2]
[null,"F86087",6]
[null,"F86087",6]
[null,"F86087",6]
[null,"F86023",54]
[null,"F86023",54]
[null,"F86023",54]
[null,"F86081",5]
[null,"F86083",11]
[null,"F86020",12]
[null,"F86642",3]
[null,"F86642",3]
[null,"F86083",11]
[null,"F86083",11]
[null,"F86083",11]
[null,"F86083",11]
[null,"F86641",8]
[null,"F86012",24]
[null,"F86012",24]
[null,"F86707",13]
[null,"F86707",13]
[null,"F86087",6]
[null,"F86691",19]
[null,"F86066",47]
[null,"F86066",47]
[null,"F86066",47]
[null,"F86008",22]
[null,"F86083",11]
[null,"F86083",11]
[null,"F86028",19]
[null,"F86028",19]
[null,"F86057",10]
[null,"F86731",11]
[null,"F86731",11]
[null,"F86731",11]
[null,"F86731",11]
[null,"F86731",11]
[null,"F86731",11]
[null,"F86731",11]
[null,"F86066",47]
[null,"F86085",6]
[null,"F86020",{"$f":"COUNTIF($B$14:$B$669,B78)","v":12}]
[null,"F86020",12]
[null,"F86020",12]
[null,"F86020",12]
[null,"F86020",12]
[null,"F86020",12]
[null,"F86020",12]
[null,"F86020",12]
[null,"F86020",12]
[null,"F86020",12]
[null,"F86020",12]
[null,"F86698",4]
[null,"F86698",4]
[null,"F86698",4]
[null,"F86066",47]
[null,"F86083",11]
[null,"F86083",11]
[null,"F86083",11]
[null,"F86731",11]
[null,"F86731",11]
[null,"Y02987",67]
[null,"Y02987",67]
[null,"Y02987",67]
[null,"F86081",5]
[null,"F86081",5]
[null,"F86081",5]
[null,"F86731",11]
[null,"F86731",11]
[null,"F86023",54]
[null,"F86023",54]
[null,"F86023",54]
[null,"F86023",54]
[null,"F86023",54]
[null,"F86023",54]
[null,"F86612",4]
[null,"F86612",4]
[null,"F86612",4]
[null,"F86612",4]
[null,"F86707",13]
[null,"F86707",13]
[null,"F86707",13]
[null,"F86707",13]
[null,"F86707",13]
[null,"F86707",13]
[null,"F86707",13]
[null,"F86707",13]
[null,"F86707",13]
[null,"F86028",19]
[null,"F86028",19]
[null,"F86028",19]
[null,"F86028",19]
[null,"F86028",19]
[null,"F86028",19]
[null,"F86028",19]
[null,"F86028",19]
[null,"F86028",19]
[null,"F86028",19]
[null,"F86028",19]
[null,"F86028",19]
[null,"F86028",19]
[null,"F86028",19]
[null,"F86028",19]
[null,"F86028",19]
[null,"F86057",10]
[null,"F86057",{"$f":"COUNTIF($B$14:$B$669,B142)","v":10}]
[null,"F86057",10]
[null,"F86057",10]
[null,"F86007",88]
[null,"F86007",88]
[null,"F86641",8]
[null,"F86641",8]
[null,"F86641",8]
[null,"F86641",8]
[null,"Y00918",19]
[null,"Y00918",19]
[null,"Y00918",19]
[null,"Y00918",19]
[null,"Y00918",19]
[null,"Y00918",19]
[null,"Y00918",19]
[null,"Y00918",19]
[null,"Y00918",19]
[null,"Y00918",19]
[null,"Y00918",19]
[null,"Y00918",19]
[null,"Y00918",19]
[null,"Y00918",19]
[null,"F86064",8]
[null,"F86064",8]
[null,"F86698",4]
[null,"F86032",28]
[null,"Y00090",4]
[null,"F86641",8]
[null,"F86641",8]
[null,"F86641",8]
[null,"F86652",7]
[null,"F86010",21]
[null,"F86009",14]
[null,"F86010",21]
[null,"F86691",19]
[null,"F86691",19]
[null,"F86691",19]
[null,"Y02987",67]
[null,"Y02987",67]
[null,"Y02987",67]
[null,"Y02987",67]
[null,"Y02987",67]
[null,"Y02987",67]
[null,"Y02987",67]
[null,"Y02987",67]
[null,"Y02987",67]
[null,"Y02987",67]
[null,"Y02987",67]
[null,"Y02987",67]
[null,"F86691",19]
[null,"F86691",19]
[null,"F86691",19]
[null,"F86691",19]
[null,"F86042",23]
[null,"F86042",23]
[null,"F86042",23]
[null,"F86042",23]
[null,"F86042",23]
[null,"F86042",23]
[null,"F86042",23]
[null,"F86042",23]
[null,"F86042",23]
[null,"F86042",23]
[null,"F86042",{"$f":"COUNTIF($B$14:$B$669,B206)","v":23}]
[null,"F86042",23]
[null,"F86042",23]
[null,"F86042",23]
[null,"F86042",23]
[null,"F86042",23]
[null,"F86042",23]
[null,"F86042",23]
[null,"F86042",23]
[null,"F86042",23]
[null,"F86042",23]
[null,"F86042",23]
[null,"F86042",23]
[null,"F86057",10]
[null,"F86057",10]
[null,"Y00918",19]
[null,"Y00918",19]
[null,"Y00918",19]
[null,"Y00918",19]
[null,"Y00918",19]
[null,"F86008",22]
[null,"F86008",22]
[null,"F86008",22]
[null,"F86008",22]
[null,"F86008",22]
[null,"F86008",22]
[null,"F86066",47]
[null,"F86066",47]
[null,"F86066",47]
[null,"F86066",47]
[null,"F86066",47]
[null,"F86066",47]
[null,"F86066",47]
[null,"F86066",47]
[null,"F86066",47]
[null,"F86066",47]
[null,"F86066",47]
[null,"F86032",28]
[null,"F86032",28]
[null,"F86032",28]
[null,"F86032",28]
[null,"Y00090",4]
[null,"F86032",28]
[null,"F86032",28]
[null,"F86032",28]
[null,"F86032",28]
[null,"F86032",28]
[null,"F86032",28]
[null,"F86032",28]
[null,"F86032",28]
[null,"Y00090",4]
[null,"F86032",28]
[null,"F86064",8]
[null,"F86064",8]
[null,"F86064",8]
[null,"F86064",8]
[null,"F86064",8]
[null,"F86064",8]
[null,"F86703",14]
[null,"F86703",14]
[null,"F86703",14]
[null,"F86703",14]
[null,"F86703",14]
[null,"F86703",14]
[null,"F86703",{"$f":"COUNTIF($B$14:$B$669,B270)","v":14}]
[null,"F86703",14]
[null,"F86703",14]
[null,"F86703",14]
[null,"F86085",6]
[null,"F86085",6]
[null,"F86085",6]
[null,"F86085",6]
[null,"F86085",6]
[null,"F86658",2]
[null,"F86023",54]
[null,"F86023",54]
[null,"F86023",54]
[null,"F86023",54]
[null,"F86023",54]
[null,"F86023",54]
[null,"F86023",54]
[null,"F86023",54]
[null,"F86023",54]
[null,"F86023",54]
[null,"F86023",54]
[null,"Y02987",67]
[null,"Y02987",67]
[null,"Y02987",67]
[null,"Y02987",67]
[null,"Y02987",67]
[null,"Y02987",67]
[null,"Y02987",67]
[null,"Y02987",67]
[null,"Y02987",67]
[null,"Y02987",67]
[null,"Y02987",67]
[null,"F86008",22]
[null,"F86008",22]
[null,"F86008",22]
[null,"F86008",22]
[null,"F86008",22]
[null,"F86008",22]
[null,"F86010",21]
[null,"F86009",14]
[null,"F86009",14]
[null,"F86010",21]
[null,"F86010",21]
[null,"F86009",14]
[null,"F86009",14]
[null,"F86010",21]
[null,"F86010",21]
[null,"F86010",21]
[null,"F86010",21]
[null,"F86009",14]
[null,"F86010",21]
[null,"F86009",14]
[null,"F86009",14]
[null,"F86010",21]
[null,"F86010",21]
[null,"F86010",21]
[null,"F86009",14]
[null,"F86009",14]
[null,"F86009",14]
[null,"F86010",21]
[null,"F86010",21]
[null,"F86010",21]
[null,"F86009",14]
[null,"F86010",21]
[null,"F86010",{"$f":"COUNTIF($B$14:$B$669,B334)","v":21}]
[null,"F86010",21]
[null,"F86010",21]
[null,"F86010",21]
[null,"F86009",14]
[null,"F86691",19]
[null,"F86691",19]
[null,"F86691",19]
[null,"F86691",19]
[null,"F86691",19]
[null,"F86691",19]
[null,"F86691",19]
[null,"F86691",19]
[null,"F86691",19]
[null,"F86691",19]
[null,"F86691",19]
[null,"F86083",11]
[null,"F86007",88]
[null,"F86007",88]
[null,"F86007",88]
[null,"F86007",88]
[null,"F86007",88]
[null,"F86007",88]
[null,"F86007",88]
[null,"F86007",88]
[null,"F86007",88]
[null,"F86007",88]
[null,"F86007",88]
[null,"F86007",88]
[null,"F86007",88]
[null,"F86007",88]
[null,"F86007",88]
[null,"F86007",88]
[null,"F86007",88]
[null,"F86007",88]
[null,"F86007",88]
[null,"F86007",88]
[null,"F86007",88]
[null,"F86007",88]
[null,"F86007",88]
[null,"F86007",88]
[null,"F86007",88]
[null,"F86007",88]
[null,"F86007",88]
[null,"F86007",88]
[null,"F86007",88]
[null,"F86007",88]
[null,"F86007",88]
[null,"F86007",88]
[null,"F86007",88]
[null,"F86007",88]
[null,"F86008",22]
[null,"F86008",22]
[null,"F86008",22]
[null,"F86008",22]
[null,"F86008",22]
[null,"F86008",22]
[null,"F86008",22]
[null,"F86008",22]
[null,"F86008",22]
[null,"F86652",7]
[null,"F86652",7]
[null,"F86652",7]
[null,"F86652",7]
[null,"F86652",{"$f":"COUNTIF($B$14:$B$669,B398)","v":7}]
[null,"F86066",47]
[null,"F86066",47]
[null,"F86066",47]
[null,"F86066",47]
[null,"F86066",47]
[null,"F86007",88]
[null,"F86007",88]
[null,"F86007",88]
[null,"F86007",88]
[null,"F86007",88]
[null,"F86007",88]
[null,"F86007",88]
[null,"F86007",88]
[null,"F86007",88]
[null,"F86007",88]
[null,"F86007",88]
[null,"F86007",88]
[null,"F86007",88]
[null,"F86007",88]
[null,"F86007",88]
[null,"F86007",88]
[null,"F86007",88]
[null,"F86007",88]
[null,"F86007",88]
[null,"F86032",28]
[null,"Y00090",4]
[null,"F86032",28]
[null,"F86032",28]
[null,"F86032",28]
[null,"F86032",28]
[null,"F86032",28]
[null,"F86032",28]
[null,"F86032",28]
[null,"F86032",28]
[null,"F86032",28]
[null,"F86032",28]
[null,"F86032",28]
[null,"F86032",28]
[null,"F86032",28]
[null,"F86012",24]
[null,"F86012",24]
[null,"F86012",24]
[null,"F86012",24]
[null,"F86012",24]
[null,"F86012",24]
[null,"F86012",24]
[null,"F86012",24]
[null,"F86012",24]
[null,"F86012",24]
[null,"F86012",24]
[null,"F86012",24]
[null,"F86012",24]
[null,"F86012",24]
[null,"F86012",24]
[null,"F86012",24]
[null,"F86012",24]
[null,"F86012",24]
[null,"F86012",24]
[null,"F86012",24]
[null,"F86012",24]
[null,"F86012",24]
[null,"F86007",88]
[null,"F86007",88]
[null,"F86007",{"$f":"COUNTIF($B$14:$B$669,B462)","v":88}]
[null,"F86007",88]
[null,"F86007",88]
[null,"F86007",88]
[null,"F86007",88]
[null,"F86007",88]
[null,"F86007",88]
[null,"F86007",88]
[null,"F86007",88]
[null,"F86057",10]
[null,"F86023",54]
[null,"F86023",54]
[null,"F86023",54]
[null,"F86023",54]
[null,"F86023",54]
[null,"F86023",54]
[null,"F86023",54]
[null,"F86023",54]
[null,"F86023",54]
[null,"F86023",54]
[null,"F86023",54]
[null,"F86023",54]
[null,"F86023",54]
[null,"F86023",54]
[null,"F86023",54]
[null,"F86023",54]
[null,"F86023",54]
[null,"F86023",54]
[null,"F86023",54]
[null,"F86023",54]
[null,"F86023",54]
[null,"F86023",54]
[null,"F86023",54]
[null,"F86023",54]
[null,"F86023",54]
[null,"F86023",54]
[null,"F86023",54]
[null,"F86023",54]
[null,"F86023",54]
[null,"F86023",54]
[null,"F86023",54]
[null,"F86023",54]
[null,"F86023",54]
[null,"F86023",54]
[null,"Y02987",67]
[null,"Y02987",67]
[null,"Y02987",67]
[null,"Y02987",67]
[null,"Y02987",67]
[null,"Y02987",67]
[null,"Y02987",67]
[null,"Y02987",67]
[null,"Y02987",67]
[null,"Y02987",67]
[null,"F86007",88]
[null,"F86007",88]
[null,"F86007",88]
[null,"F86007",88]
[null,"F86007",88]
[null,"F86007",88]
[null,"F86007",88]
[null,"F86007",88]
[null,"F86007",88]
[null,"F86007",88]
[null,"F86007",{"$f":"COUNTIF($B$14:$B$669,B526)","v":88}]
[null,"F86007",88]
[null,"F86007",88]
[null,"F86007",88]
[null,"F86007",88]
[null,"F86007",88]
[null,"F86007",88]
[null,"F86007",88]
[null,"F86007",88]
[null,"F86007",88]
[null,"F86066",47]
[null,"F86066",47]
[null,"F86066",47]
[null,"F86066",47]
[null,"F86066",47]
[null,"F86066",47]
[null,"F86066",47]
[null,"F86066",47]
[null,"F86066",47]
[null,"F86066",47]
[null,"F86066",47]
[null,"F86066",47]
[null,"F86066",47]
[null,"F86066",47]
[null,"F86066",47]
[null,"F86066",47]
[null,"F86066",47]
[null,"F86066",47]
[null,"F86066",47]
[null,"F86066",47]
[null,"F86066",47]
[null,"F86066",47]
[null,"F86066",47]
[null,"F86066",47]
[null,"F86066",47]
[null,"F86066",47]
[null,"Y02987",67]
[null,"Y02987",67]
[null,"Y02987",67]
[null,"Y02987",67]
[null,"Y02987",67]
[null,"Y02987",67]
[null,"Y02987",67]
[null,"Y02987",67]
[null,"Y02987",67]
[null,"Y02987",67]
[null,"Y02987",67]
[null,"Y02987",67]
[null,"Y02987",67]
[null,"Y02987",67]
[null,"Y02987",67]
[null,"Y02987",67]
[null,"Y02987",67]
[null,"Y02987",67]
[null,"Y02987",67]
[null,"Y02987",67]
[null,"Y02987",67]
[null,"Y02987",67]
[null,"Y02987",67]
[null,"Y02987",67]
[null,"Y02987",67]
[null,"Y02987",67]
[null,"Y02987",67]
[null,"Y02987",67]
[null,"Y02987",{"$f":"COUNTIF($B$14:$B$669,B590)","v":67}]
[null,"Y02987",67]